##TITLE=Methane, dichloro-
##JCAMP-DX=4.24
##DATA TYPE=INFRARED SPECTRUM
##CLASS=COBLENTZ
##ORIGIN=DOW CHEMICAL COMPANY
##OWNER= PUBLIC DOMAIN
##NAMES=dichloromethane, METHYLENE CHLORIDE
##CAS REGISTRY NO=75-09-2
##MOLFORM=CH2Cl2
##SPECTROMETER/DATA SYSTEM=DOW KBr FOREPRISM-GRATING
##INSTRUMENT PARAMETERS=GRATING CHANGED AT 5.0, 7.5, 15.0 MICRON
##STATE=GAS (100 mmHg, N2 ADDED, TOTAL PRESSURE 600 mmHg)
##PATH LENGTH=5 CM
$$ SPECTRAL CONTAMINATION DUE TO Cl2C=CCl2 AROUND 915 CM^-^1
##SAMPLING PROCEDURE=TRANSMISSION
##RESOLUTION=2
##$MODELS=
<Models>
<ModelData>
CH2Cl2
RLDSViewer          3D                             0

  5  4  0  0  0  0  0  0  0  0999 V2000
    0.0000    0.0000    0.7926 C   0  0  0  0  0  0  0  0  0  1
    0.8900    0.0000    1.4219 H   0  0  0  0  0  0  0  0  0  2
    0.0000    1.4370   -0.2235 Cl  0  0  0  0  0  0  0  0  0  3
   -0.8900    0.0000    1.4219 H   0  0  0  0  0  0  0  0  0  4
    0.0000   -1.4370   -0.2235 Cl  0  0  0  0  0  0  0  0  0  5
  1  2  1  0  0  0
  1  4  1  0  0  0
  1  3  1  0  0  0
  1  5  1  0  0  0
M  END
</ModelData>
5
Model[1]: Convg=0.2016D-08;-V/T=2.0004;Energy=NaN;Range=M.O.s;E(RHF)=-957.984015823 A.U.;PATH=Calculation 1;Input
C     0.00000    0.00000    0.00000
H     0.00000    0.00000    1.09000
Cl    1.65934    0.00000   -0.58667
H    -0.51383    0.88998   -0.36333
Cl   -0.82967   -1.43703   -0.58667
5
Model[2]: Convg=0.2016D-08;-V/T=2.0004;Energy=-957.9841;Range=M.O.s;E(RHF)=-957.984015823 A.U.;PATH=Calculation 1;Standard
C     0.00000    0.00000    0.79262
H     0.88998    0.00000    1.42193
Cl    0.00000    1.43703   -0.22352
H    -0.88998    0.00000    1.42193
Cl    0.00000   -1.43703   -0.22352
5
Model[3]: IRIntensity=0.8549 KM/Mole;ReducedMass=19.4874 AMU;ForceConstant=1.2400 mDyne/A;Frequency=328.6293 cm^-1;FrequencyLabel=A1;PATH=Calculation 1;FrequenciesFrequencies
C     0.00000    0.00000    0.79262    0.00000    0.00000   -0.42000
H     0.88998    0.00000    1.42193   -0.01000    0.00000   -0.41000
Cl    0.00000    1.43703   -0.22352    0.00000    0.49000    0.08000
H    -0.88998    0.00000    1.42193    0.01000    0.00000   -0.41000
Cl    0.00000   -1.43703   -0.22352    0.00000   -0.49000    0.08000
5
Model[4]: IRIntensity=22.3831 KM/Mole;ReducedMass=7.1242 AMU;ForceConstant=2.6393 mDyne/A;Frequency=792.9600 cm^-1;FrequencyLabel=A1;PATH=Calculation 1;FrequenciesFrequencies
C     0.00000    0.00000    0.79262    0.00000    0.00000    0.61000
H     0.88998    0.00000    1.42193    0.06000    0.00000    0.53000
Cl    0.00000    1.43703   -0.22352    0.00000    0.12000   -0.12000
H    -0.88998    0.00000    1.42193   -0.06000    0.00000    0.53000
Cl    0.00000   -1.43703   -0.22352    0.00000   -0.12000   -0.12000
5
Model[5]: IRIntensity=135.9554 KM/Mole;ReducedMass=6.9784 AMU;ForceConstant=2.9811 mDyne/A;Frequency=851.5017 cm^-1;FrequencyLabel=B2;PATH=Calculation 1;FrequenciesFrequencies
C     0.00000    0.00000    0.79262    0.00000    0.63000    0.00000
$$ [...]
H    -0.88998    0.00000    1.42193   -0.27000    0.00000   -0.64000
Cl    0.00000   -1.43703   -0.22352   -0.02000    0.00000    0.00000
5
Model[7]: IRIntensity=0.0000 KM/Mole;ReducedMass=1.0186 AMU;ForceConstant=1.0551 mDyne/A;Frequency=1325.9201 cm^-1;FrequencyLabel=A2;PATH=Calculation 1;FrequenciesFrequencies
C     0.00000    0.00000    0.79262    0.00000    0.00000    0.00000
H     0.88998    0.00000    1.42193    0.00000    0.71000    0.00000
Cl    0.00000    1.43703   -0.22352    0.01000    0.00000    0.00000
H    -0.88998    0.00000    1.42193    0.00000   -0.71000    0.00000
Cl    0.00000   -1.43703   -0.22352   -0.01000    0.00000    0.00000
5
Model[8]: IRIntensity=70.1871 KM/Mole;ReducedMass=1.1462 AMU;ForceConstant=1.4791 mDyne/A;Frequency=1479.9284 cm^-1;FrequencyLabel=B2;PATH=Calculation 1;FrequenciesFrequencies
C     0.00000    0.00000    0.79262    0.00000   -0.11000    0.00000
H     0.88998    0.00000    1.42193    0.00000    0.70000    0.00000
Cl    0.00000    1.43703   -0.22352    0.00000    0.00000    0.01000
H    -0.88998    0.00000    1.42193    0.00000    0.70000    0.00000
Cl    0.00000   -1.43703   -0.22352    0.00000    0.00000   -0.01000
5
Model[9]: IRIntensity=0.9042 KM/Mole;ReducedMass=1.0790 AMU;ForceConstant=1.7283 mDyne/A;Frequency=1648.8226 cm^-1;FrequencyLabel=A1;PATH=Calculation 1;FrequenciesFrequencies
C     0.00000    0.00000    0.79262    0.00000    0.00000   -0.08000
H     0.88998    0.00000    1.42193   -0.42000    0.00000    0.56000
Cl    0.00000    1.43703   -0.22352    0.00000    0.00000    0.00000
H    -0.88998    0.00000    1.42193    0.42000    0.00000    0.56000
Cl    0.00000   -1.43703   -0.22352    0.00000    0.00000    0.00000
5
Model[10]: IRIntensity=15.1988 KM/Mole;ReducedMass=1.0560 AMU;ForceConstant=6.3458 mDyne/A;Frequency=3193.6506 cm^-1;FrequencyLabel=A1;PATH=Calculation 1;FrequenciesFrequencies
C     0.00000    0.00000    0.79262    0.00000    0.00000   -0.07000
H     0.88998    0.00000    1.42193    0.59000    0.00000    0.39000
Cl    0.00000    1.43703   -0.22352    0.00000    0.00000    0.00000
H    -0.88998    0.00000    1.42193   -0.59000    0.00000    0.39000
Cl    0.00000   -1.43703   -0.22352    0.00000    0.00000    0.00000
5
Model[11]: IRIntensity=1.4436 KM/Mole;ReducedMass=1.1167 AMU;ForceConstant=6.9841 mDyne/A;Frequency=3258.0311 cm^-1;FrequencyLabel=B1;PATH=Calculation 1;FrequenciesFrequencies
C     0.00000    0.00000    0.79262    0.10000    0.00000    0.00000
H     0.88998    0.00000    1.42193   -0.58000    0.00000   -0.40000
Cl    0.00000    1.43703   -0.22352    0.00000    0.00000    0.00000
H    -0.88998    0.00000    1.42193   -0.58000    0.00000    0.40000
Cl    0.00000   -1.43703   -0.22352    0.00000    0.00000    0.00000

</ModelData>
</Models>
##$PEAKS=

##XUNITS=1/CM
##YUNITS=TRANSMITTANCE
##XFACTOR= 3.316E-3
##YFACTOR= 9.21375E-7
##FIRSTX= 458
##FIRSTY= 0.868008
##LASTX= 3774
##NPOINTS= 3318
##XYDATA= (X++(Y..Y))
138118I42079j434j059j091j091j090r66r98p48j191p84m70L2J57r4n95r40r71I27869
143546I26992j034j315j535j566j284p52R5J096K192L164L789M009L727L257K757I45972
148673I48133J973J754J441J097Q45O58M38L45K20K19K19K81L45L13K51J56R4I58845
154403I58877%l2o3l1%L1O3O2O3J26K19L13M07M38M70N02N01N32N01M39L75K82I64326
161641I64577J88J24J26J25J26J88J56J88J88K19K51L13L13L13K51K82K50K51I68679
167672I68836J26J24R5J25J26J24J26J57K19L12L77M07L76L75L77M38M07L44L14I74004
174005I74255K19K51J87J57J56J89K81L77L75M07M07M39N01N63N65M38L44J88I80425
180036I80456L2o3r5j56k51l12m70n01n64m70l13k20j87j57j57j25l1%L1L2L1I76666
$$ plain form
138118 942079 940645 939586 938495 937404 936314 935348 934350 933602 932411 931627 931157 931189 931346 931252 930657 929717 928746 927869
143546 926992 925958 924643 923108 921542 920258 919506 919601 920697 922889 926053 929842 933851 937578 940835 943592 945972
148673 948133 950106 951860 953301 954398 955243 955901 956339 956684 956904 957123 957342 957623 957968 958281 958532 958688 958782 958845
154403 958877 958877 958845 958782 958751 958751 958782 958845 958907 958970 959096 959315 959628 960035 960473 960943 961445 961946 962478 962979 963418 963793 964075 964326
161641 964577 964765 964889 965015 965140 965266 965454 965610 965798 965986 966205 966456 966769 967082 967395 967646 967928 968178 968429 968679
167672 968836 968962 969086 969181 969306 969432 969556 969682 969839 970058 970370 970747 971154 971530 971905 972282 972720 973127 973471 973785 974004
174005 974255 974474 974725 974912 975069 975225 975414 975695 976072 976447 976854 977261 977700 978201 978764 979329 979767 980111 980299 980425
180036 980456 980488 980425 980330 980174 979923 979611 979141 978640 978076 977606 977293 977073 976886 976729 976572 976447 976416 976416 976447 976479 976510 976666
186972I76949M38N63N33N64N94P21P84P82O58M38K20R4o3k51n33p82j033j128I78357
193004I77168j222j284j284j159j034r71j002j096j159j128j096j221j504j879I57905
197829I55494k506k537k725k913l069l007k850k757k912l288l790m229m635n105I03439
202654H96893p266p673p800p736p829q113q582r145r553j0054j0586j1119j1464G68605
207177G57611j0586j0462j0742j1213j1495j1526j1557j1870j2529j3186j3185F16856
211098F05801r835r177r146q926p611m760l14N074J0618J5253J7446J5378P141F19394
215621E93272m3535n4749n7441n2712m3316l1759j9576p798K662J0492J3781J1526C25796
219843C22883r647j6537k7625m4319n9728o1794m7921k8564j4001o170k631j127B380
$$ plain form
186972 976949 977387 977950 978483 979047 979641 980362 981146 981928 982586 983024 983244 983338 983275 983024 982491 981709 980676 979548 978357
193004 977168 975946 974662 973378 972219 971185 970214 969212 968116 966957 965829 964733 963512 962008 960129 957905
197829 955494 952988 950451 947726 944813 941744 938737 935887 933130 930218 926930 923140 918911 914276 909171 903439
202654 896893 889627 881954 874154 866418 858589 850476 841894 832749 823196 813142 802556 791437 779973 768605
207177 757611 747025 736563 725821 714608 703113 691587 680030 668160 655631 642445 629260 616856
211098 605801 595966 586789 577643 568717 561106 556346 556032 561106 571724 586977 604423 619801 626942 619394
215621 593272 549737 494988 437547 384835 341519 309760 290184 282386 285048 295540 309321 320847 325796
219843 322883 313236 296699 269074 224755 165027 103233 55312 26748 12747 6577 3946 2819 2380
224065B255L2R3J26J25J25J89J87J57J25L1o2j26r3r5%O3O3O2O3R4J88M70R39F796
231604A0273O734J3154K4932M4381P0785R7750J14602J14570J00602Q1370O3549G91750
235525H29022K8032K1830J8635J7227J5722J2780Q769N136L258L163L790L727I73690
239747I74630l75q46p52o89j002j410j503r08L1J002J566J817K005K286K412K254I82116
245175I82837o3n02n95n94p84j002j159j096p83m70k50%K82Q45J379J691J534I82242
250905I82461m38p21p21n01k19J25M39P51R08R09P20O27N64O58P19O90M70K19I87660
256936I87565k19l44n01o58p51p84q14r08r72j033r70q47p19o58p21q45r09r39I72908
262967I71749j284j410j377j284j191j191j189j065r08p52p52j065j440j629j535I52079
$$ plain form
224065 2255 2287 2380 2506 2631 2756 2945 3132 3289 3414 3445 3383 3257 3164 3069 3069 3132 3195 3257 3320 3414 3602 4072 5011 6796
231604 10273 17007 30161 55093 99474 170259 268009 382611 497181 597783 679153 742702 791750
235525 829022 857054 878884 897519 914746 930468 943248 952017 957153 960411 963574 967364 971091 973690
239747 974630 974255 973409 972657 971968 970966 969556 968053 967145 967176 968178 969744 971561 973566 975852 978264 980518 982116
245175 982837 982774 982272 981677 981083 980299 979297 978138 977042 976259 975789 975539 975539 975821 976666 978045 979736 981270 982242
250905 982461 982023 981302 980581 980080 979861 979986 980425 981176 982084 982993 983713 984340 984904 985562 986281 986971 987441 987660 987660
256936 987565 987346 987002 986501 985843 985092 984308 983494 982586 981614 980581 979611 978764 978045 977387 976666 975821 974912 973973 972908
262967 971749 970465 969055 967678 966394 965203 964012 962823 961758 960850 960098 959346 958281 956841 955212 953677 952079
268094I49543n074r146j3437j5879j4814r772j849O516J2778J5096J3093Q018I37359
272316I35104m666n419n418n544n951o295o045n074l508j754k51Q14J503K099H92226
277141H95515L915M447M824N105N356N606N919O202O359O389O076N481M635L634I72125
281966I74004J410J158J065J065J065J065J033J003R39Q15O58N01M39M07L44L13I87535
287394I87723J56J88K19K19K19J88J58J56J56J26R3O3O3R4J26J24O3L2%O2R4J88I90729
294632I90980K50K83K19J56R4l1o3o3r3j26j25j57j56j25j58j24j57j88j88j88I89884
301267I89758r4j26r3o3o3%%%%L2L1%%l1o2r5l1l2%l1%O3O3J25L1%j25k19k51I88474
310615I88098m07m38m70m70n02m68n02n01n02m38l76k19l1J56L76N95O89O27L45I85562
$$ plain form
268094 949543 944469 935323 921886 906007 891193 881421 879572 886088 898866 913962 927055 935073 937359
272316 935104 930438 925019 919601 914057 908106 901811 895766 890692 887184 885430 885179 885993 887496 889595 892226
277141 895515 899430 903877 908701 913806 919162 924768 930687 936889 943248 949637 955713 961194 965829 969463 972125
281966 974004 975414 976572 977637 978702 979767 980832 981865 982868 983807 984622 985280 985781 986220 986627 986971 987284 987535
287394 987723 987879 988067 988286 988505 988724 988912 989070 989226 989382 989508 989601 989664 989727 989821 989947 990071 990134 990166 990166 990228 990322 990510 990729
294632 990980 991230 991513 991732 991888 991982 991951 991888 991825 991732 991606 991481 991324 991168 991043 990885 990761 990604 990416 990228 990040 989884
301267 989758 989664 989538 989445 989382 989319 989319 989319 989319 989319 989351 989382 989382 989382 989351 989289 989194 989163 989131 989131 989100 989100 989163 989226 989351 989382 989382 989257 989038 988787 988474
310615 988098 987691 987253 986783 986313 985811 985343 984841 984340 983838 983400 983024 982805 982774 982930 983306 983901 984590 985217 985562 985562
316948I85092q46j127j222j097q45n01k82k50l77n63p21p21n63m38l44m39n96I73409
322678I72594q45p21n95m07r4J89N00P21P83P83P21O89O88O27N95N01N01M70M70I78640
329011I79047L13L13K82L14L12L14K81L14L44M38N02N01M70M70M70N32M70L44I86125
335042I85969l14m38m70n95o26o27m69j88J25L75N02N94O89O90P20O58M70K81I87472
341074I87472j56l77o58q45r09r39q14p83p21o26m38j26J89M07M38L76L44L45I82586
347105I82930J89O2l2L2J57K19K50J89J87L76N33O58O26N01M07M07M39K82l2m70I87002
353739I85874j221j253j347j377j191n63L12J254J942K285K381K412K349K129I95584
358565I96461J56k19l13l45m38p20r71r09m38L1L14L12K20L45Q14J315J503J160I98872
$$ plain form
316948 985092 984246 983119 981897 980800 979955 979454 979172 978922 978545 977982 977261 976540 975977 975539 975195 974756 974160 973409
322678 972594 971749 971028 970433 970026 969932 970121 970621 971342 972125 972908 973629 974318 975006 975633 976228 976729 977230 977700 978170 978640
329011 979047 979360 979673 979955 980269 980581 980895 981176 981490 981834 982272 982774 983275 983745 984215 984685 985217 985687 986031 986125
335042 985969 985655 985217 984747 984152 983526 982899 982430 982242 982367 982742 983244 983838 984527 985217 985937 986595 987065 987346 987472
341074 987472 987316 986939 986281 985436 984527 983588 982774 981991 981270 980644 980206 980080 980269 980676 981114 981490 981834 982179 982586
347105 982930 983119 983181 983149 983181 983338 983557 983807 983996 984183 984559 985092 985750 986376 986877 987284 987691 988130 988412 988380 987910 987002
353739 985874 984653 983400 982053 980676 979485 978922 979234 980488 982430 984715 987096 989508 991857 993986 995584
358565 996461 996617 996398 996085 995740 995302 994582 993611 992702 992264 992295 992609 992921 993141 993486 994300 995615 997118 998278 998872
364596I98967o3k51p21j659k538k850k285j254l75r4j26J26J002K255L070K850I97932
370024I98967R08J253J127l13k725m854n607n293n418p455j1432j5410j7132j5879H97582
374849H86119j2591j6569k2456l0819m3912o3862q8386j09090j16136j06302q4941A30293
378770I0422k4273j3436n858k19M135P298Q769Q926R741J3781K2708L4953M2063B26823
383293B14420n0270n6846m0185k1360q268P20Q989J9231L2917N0301O9751Q7854D07072
387515E09146R5058Q4001P4417O7402N9477M6355K8219J0023k099n887l947p52I62102
391737I62384k19N64K443L914L885K443Q14J56L76P20L46p21j629j754j096l13I72282
397165I71905p51n95J25R40J284J002M70K19L13N32M70o2p20j003q77m69j89j56I72094
$$ plain form
364596 998967 998904 998653 997932 996273 993735 990885 988600 987346 986971 986877 986751 986877 987879 990134 993204 996054 997932
370024 998967 999875 1001128 1002255 1001942 999217 994363 988756 983463 978045 970590 959158 943748 926616 910737 897582
374849 886119 873528 856959 834503 803684 759772 695910 607524 498434 382298 275996 191055 130293
378770 90422 66149 52713 46855 46636 50771 58069 66838 75764 85505 99286 121994 156947 199010 226823
383293 214420 164150 107304 67119 45759 37491 38211 47200 66431 99348 149649 219400 307254 407072
387515 509146 604204 688205 762622 830024 889501 935856 964075 974098 971999 966112 962165 961413 962102
391737 962384 962165 962729 965172 969086 972971 975414 976228 976384 976760 977480 977826 977105 975476 973722 972626 972313 972282
397165 971905 971154 970559 970684 971624 972908 973910 974380 974599 974912 975444 975914 975852 975132 974129 973252 972783 972594 972438 972094
403197I71686k50l1l2j88m38m07r4L44O27N95M07L13N32Q77J254J284J158R40I79392
409228I80174O26K51l14q14j096j221j285j409j660j816j848j691j535j441j535I61820
414355I60348j222r39p83p20p20o90n01l44k51k82l44l77l75k82l13m38n33n64I50169
420386I49825k51k19k19k19o3R4K51K19J88J25J25J25J57R4l1j25r5o3l1o2j26I49511
427322I49387r5o3j25l13n32o89p84p82o90n94m70l14r3O3J87J88R3j56n01r39I41274
433957I39239k506k882l132l289l476l664l853l978m040m040m072m166m353m573H82611
438782H78164m041l413k914k693k756k944k757j785J25K506M573N356M447K099H73058
443607H69738m479m259l039j315O57K914N669Q801J1964J4439J5535J4751J2341I52675
$$ plain form
403197 971686 971436 971405 971373 971185 970747 970340 970246 970590 971217 971812 972219 972532 973064 973941 975195 976479 977637 978577 979392
409228 980174 980800 981051 980737 979923 978827 977606 976321 974912 973252 971436 969588 967897 966362 964921 963386 961820
414355 960348 959126 958187 957404 956684 955964 955274 954773 954429 954178 953896 953552 953175 952800 952518 952205 951767 951234 950670 950169
420386 949825 949574 949355 949136 948917 948854 948948 949199 949418 949606 949731 949856 949981 950138 950232 950201 950076 949981 949918 949887 949825 949699 949511
427322 949387 949292 949229 949104 948791 948259 947570 946786 946004 945314 944720 944250 943936 943843 943906 944093 944281 944374 944218 943717 942778 941274
433957 939239 936733 933851 930719 927430 923954 920290 916437 912459 908419 904379 900307 896141 891788 887215 882611
438782 878164 874123 870710 867796 865103 862347 859403 856646 854861 854986 857492 862065 867421 871868 873967 873058
443607 869738 865259 861000 857961 856646 857303 860217 865886 874687 886651 901090 916625 931376 943717 952675
448130I58187K663Q45l1k82k20j24j26j25j88j88l45n63q15q46k50R71K694M228I70465
454162I74881K662K51j942l195l320k536j442n01l0R3l2j87k20j87j88k51l44I63011
459891I62446n94n95n65n94n95n96n00k20J25N33P83R08P84N32K19r4l13m39m70I60222
466224I59659o26o58o89p52q14q77q77n63J56J191K222K882K788J910N33q15j534I61601
471954I60787J56J003J409J347R40M07r5m69p20q14q47q14p82o90n96n63n01n01I58156
477986I57592n64n01m07j88O3K81M70O89Q14Q77Q47P19N02K19o3l44m70n63n96I58814
484318I58249n31n33n64n33m07o2L76Q77J253J378J159O26l1o89j128j347j378I55399
490048I54178j127j002p21l13L45R38J410J504J222N31l75j191j754j973j785I48510
$$ plain form
448130 958187 960850 961695 961664 961382 961162 961038 960912 960787 960599 960411 960066 959503 958688 957842 957592 958563 961257 965485 970465
454162 974881 977543 977794 975852 972657 969337 966801 965359 964858 964828 964921 964889 964702 964482 964295 964107 963856 963512 963011
459891 962446 961852 961257 960692 960098 959503 958907 958407 958187 958312 958845 959628 960536 961320 961852 962071 961977 961664 961225 960755 960222
466224 959659 959033 958375 957686 956934 956120 955243 954366 953803 953959 955150 957372 960254 963042 964952 965485 964670 963136 961601
471954 960787 960943 961946 963355 964702 965642 966049 965954 965485 964765 963951 963104 962290 961508 960818 960222 959659 959158 958657 958156
477986 957592 957028 956527 956120 955932 955995 956276 956746 957435 958249 959126 959973 960692 961194 961413 961350 961006 960536 959973 959377 958814
484318 958249 957718 957185 956621 956088 955681 955619 955995 956872 958125 959503 960662 961288 961257 960568 959440 958093 956715 955399
490048 954178 953051 952049 951328 951015 951360 952298 953708 955212 956434 956965 956590 955399 953645 951672 949887 948510
495175I47538o89n63n33l13J57R70J880K568K725K129J065j56j128j472j315q14I51798
500603I51986M07N01N95P83J002J191J190J002P20L77J56R3L2r4l13o89r39r09I56746
506634I57342J659K412K568K068R71k51j253j816j817j410p82r5M39Q77J127J191I64263
512063I64952K20l44q16j127j253j127r40o58m07j88R5M38Q46J347J847K162K066I68648
517793I69306m39j440k099k286j973j441q14l76r4J88M38Q77J254J503J408Q77I65015
523221I64295j253j441j253q45l77l0R3J26L1r4r4j57j87j88k51k50k51k51k19I57185
529554I56965k19j88k19j88j87j88j57j57j56r4o2o3o3o3o2o3l1l2o2l1o3l2l1I54522
537093I54522L2L1L2O3O2L1L2L1L1L2O2O3L1O3O2O3O3O3L0O3O3L2O2%%%%l1%%I55588
$$ plain form
495175 947538 946849 946286 945753 945440 945597 946567 948447 951015 953740 955869 956934 956778 955650 954178 952863 952049 951798
500603 951986 952393 952894 953489 954272 955274 956465 957655 958657 959377 959754 959910 960003 960035 959941 959628 958939 958000 957091 956746
506634 957342 959001 961413 963981 966049 967020 966769 965516 963700 961883 960473 959691 959596 960035 960912 962039 963230 964263
512063 964952 965172 964828 964012 962885 961632 960505 959565 958907 958500 958312 958407 958845 959691 961038 962885 965047 967113 968648
517793 969306 968867 967427 965328 963042 961069 959628 958814 958438 958344 958532 958970 959847 961101 962604 964012 964889 965015
523221 964295 963042 961601 960348 959503 959126 959096 959189 959315 959346 959252 959158 959001 958814 958626 958375 958125 957874 957623 957404 957185
529554 956965 956746 956558 956339 956151 955964 955776 955619 955462 955306 955212 955150 955087 955024 954961 954899 954836 954805 954773 954711 954680 954617 954585 954554 954522
537093 954522 954554 954585 954617 954680 954742 954773 954805 954836 954867 954899 954961 955024 955055 955118 955180 955243 955306 955369 955399 955462 955525 955557 955619 955619 955619 955619 955619 955588 955588 955588 955588
546743I55588%%%L1%L1%L1L2L1%%%%L2%%%L1%L1L1%L2L1%L2L1L2%O1O3O3O2L2I56339
557901I56308o2r5j24r5j25j26r3r4r5o2o3l1%O3O3L0L2o2r5k19k19k82k51k19I53928
565742I53833%%L2O3R4J88K50K82J88R4o3j88k19k19j25%O2R4J26L0%%o2l1l1I54366
573884I54303r3j26j56j57j87j89j57k19j88j87j57l1O2K19L77M38M39M38L76I55087
580217I55337J88J56O3L2l2o3o2r4o3o3r3o3o3o2o3r4r4r4j25j26r3j26j56r5I53928
588058I53865o2%L0L2R4O3L0l0j89l44m38n33m69l77k19r3O2J57J56J56J26J25I52268
595296I52361L2o3j56k51l44m39m70n64n32n01l13o3K83O26Q77J001J003P83N63I54115
601628I54178r4j88k19k19k20j56j56k19l46n01o88q15q14o89m07o3L13O58Q77I51234
$$ plain form
546743 955588 955588 955588 955588 955619 955619 955650 955650 955681 955713 955744 955744 955744 955744 955744 955776 955776 955776 955776 955807 955807 955838 955869 955869 955901 955932 955932 955964 955995 956027 956027 956088 956151 956214 956276 956308 956339
557901 956308 956246 956151 956027 955932 955807 955681 955588 955494 955399 955337 955274 955243 955243 955306 955369 955399 955431 955369 955274 955055 954836 954554 954303 954084 953928
565742 953833 953833 953833 953865 953928 954022 954210 954460 954742 954930 955024 954961 954773 954554 954335 954210 954210 954272 954366 954492 954522 954522 954522 954460 954429 954398 954366
573884 954303 954210 954084 953928 953771 953584 953395 953238 953019 952831 952644 952487 952456 952518 952737 953114 953552 953991 954429 954805 955087
580217 955337 955525 955681 955744 955776 955744 955681 955619 955525 955462 955399 955306 955243 955180 955118 955055 954961 954867 954773 954648 954522 954429 954303 954147 954052 953928
588058 953865 953803 953803 953833 953865 953959 954022 954052 954022 953833 953489 953051 952518 952049 951672 951453 951360 951422 951579 951735 951891 952017 952142 952268
595296 952361 952393 952330 952174 951923 951579 951140 950670 950106 949574 949073 948760 948697 948980 949606 950483 951484 952487 953270 953833 954115
601628 954178 954084 953896 953677 953458 953238 953082 952926 952707 952361 951860 951172 950357 949543 948854 948447 948384 948697 949355 950232 951234
607961I52268R07O90M70K50O3l1o3r4o2r5j25j26j24j25j26j25j26j25j26r3j26I52863
614897I52768r3j26j56k51m07n95p83r09r38r40q77p84o26m70l44j25L0J58L12I45251
621230I45690M70M38M39L76L13K19J56R5L1o3o3j56k19k19j88r4L1K19L14L75I48634
627865I49136N95O57P52P51P53O26N63M08L13K51K19K19J88K19J88J89J56J25I56402
633896I56465L0%%%l0%%%%L0%%l0l1r5r3j26j25j26j56j25j26j25j57j25j25j25I54680
642642I54554j25j26r3j26j25j26j25j24j26j25r5j24j26j25j26j25j25j26j24I52142
648975I52017j26j24j26j25j25r4j25r5j24j26r4j25j25r5j25r4r3j26r4r4r4I49543
655911I49448j24r5j25j24j58j25r4o2O2J88L13M39N63N96N95N63N01M07L14K82I53584
$$ plain form
607961 952268 953175 953865 954335 954585 954648 954617 954554 954460 954398 954303 954178 954052 953928 953803 953677 953552 953426 953301 953175 953082 952956 952863
614897 952768 952675 952549 952393 952142 951735 951140 950357 949448 948510 947570 946693 945909 945283 944813 944469 944344 944374 944532 944844 945251
621230 945690 946160 946598 947037 947413 947726 947945 948101 948196 948227 948164 948101 947945 947726 947507 947319 947225 947256 947475 947789 948164 948634
627865 949136 949731 950388 951140 951891 952644 953270 953833 954241 954554 954805 955024 955243 955431 955650 955838 956027 956183 956308 956402
633896 956465 956495 956495 956495 956495 956465 956465 956465 956465 956465 956495 956495 956495 956465 956434 956339 956246 956120 955995 955869 955713 955588 955462 955337 955180 955055 954930 954805 954680
642642 954554 954429 954303 954210 954084 953959 953833 953708 953584 953458 953333 953238 953114 952988 952863 952737 952612 952487 952361 952237 952142
648975 952017 951891 951767 951641 951516 951391 951297 951172 951077 950953 950827 950733 950608 950483 950388 950263 950169 950076 949950 949856 949762 949668 949543
655911 949448 949324 949229 949104 948980 948822 948697 948603 948541 948603 948791 949104 949543 950106 950702 951297 951860 952361 952768 953082 953364 953584
662545I53771J88J56J88J57J25J26R4O2O3L1O3R4O2R4O3R4O3O3O2L1L1L2L1L2I55807
670386I55838%%%l1l1l2o3l1o2l1o3o3o2o3o3o3l0o3%L1O2J26J25J26J24J57J26I56057
679131I56183R3O3O3%L2l2%o3o3j25j24j89j88j88j88k19j88k19k19k19j88k19I53614
686369I53426k19j88j88k50k51l13l45l75m07m07m70n33n95p21q14q77r71r70I43529
692400I42496j034j002r71q15o57m39j88%J57K50L14L76M38M38L46L0n32j284I35731
698432I32755l508l571l101k035n95J002K505L634M229M227L821L070K318J597I47475
703257I48290O27N01M69M08L44L44L45L44M07M39M70N64N63O27O57O58O58O89I58093
709288I58751O89O58O57O58O58O58O89O57N95N65M07L12J89O2%r3r5j25j57j56I65359
$$ plain form
662545 953771 953959 954115 954303 954460 954585 954711 954805 954867 954930 954961 955024 955118 955180 955274 955337 955431 955494 955557 955619 955650 955681 955713 955744 955776 955807
670386 955838 955838 955838 955838 955807 955776 955744 955681 955650 955588 955557 955494 955431 955369 955306 955243 955180 955150 955087 955087 955118 955180 955306 955431 955557 955681 955838 955964 956057
679131 956183 956276 956339 956402 956402 956434 956402 956402 956339 956276 956151 956027 955838 955650 955462 955274 955055 954867 954648 954429 954210 954022 953803 953614
686369 953426 953207 953019 952831 952581 952330 952017 951672 951297 950890 950483 950013 949480 948885 948164 947350 946473 945502 944532 943529
692400 942496 941462 940460 939489 938674 938017 937578 937390 937390 937547 937797 938111 938487 938925 939363 939709 939739 939207 937923 935731
698432 932755 929247 925676 922575 920540 919945 920947 923452 927086 931315 935542 939363 942433 944751 946348 947475
703257 948290 948917 949418 949887 950295 950639 950983 951328 951672 952079 952518 952988 953552 954115 954742 955399 956057 956715 957404 958093
709288 958751 959440 960098 960755 961413 962071 962729 963418 964075 964670 965235 965642 965954 966143 966205 966205 966112 966017 965892 965735 965579 965359
715923I65109k81k83k82k82k19k19j88j88j88k19k19k19k51k51k51k49k19k51I60599
721954I60348k50k51k51k50k50k51k82k82l13l45l44l75l46l44l45k81k82k19I54867
727986I54680j58j56j56r5r3o3o3l1l2l0o3l2l1%O3R3J58J87K20K19K19J88J88I55399
735525I55557J24J57R4J25J26R3J26O3R3O3O3O2O3R5J24R5J25J56J57J57J56J56I58219
742762I58375J25J26O2O3L1L2L1L2O2O2R5J25J56J57K20J87K20J56J56R5L1l1I60536
750000I60473l0l2l1%%%%L1L2O2R4R3R5J25O3O3%o3r4j57k19j88j88j56j26r3I59628
758444I59565o2o3l2o2j57j88j87j88r4l2L2R4L1%o3r4r3o3l2o3%l0%L0L2O3O3I58469
767189I58563O3O2R4O3O2O3L1O3O2O3L2O3O2R4O3O2O3O3R3O3R4R4J26J24J58J25I60724
$$ plain form
715923 965109 964828 964545 964263 963981 963762 963543 963355 963167 962979 962760 962541 962322 962071 961820 961569 961320 961101 960850 960599
721954 960348 960098 959847 959596 959346 959096 958845 958563 958281 957968 957623 957279 956904 956558 956214 955869 955588 955306 955087 954867
727986 954680 954522 954366 954210 954115 954022 953959 953896 953865 953833 953803 953740 953708 953677 953677 953740 953833 953991 954178 954398 954617 954836 955024 955212 955399
735525 955557 955681 955838 955932 956057 956183 956276 956402 956465 956558 956621 956684 956746 956809 956904 957028 957123 957248 957404 957561 957718 957874 958030 958219
742762 958375 958500 958626 958688 958751 958782 958814 958845 958877 958939 959001 959096 959221 959377 959534 959754 959941 960161 960317 960473 960568 960599 960568 960536
750000 960473 960443 960411 960380 960380 960380 960380 960380 960411 960443 960505 960599 960692 960787 960912 960975 961038 961038 960975 960881 960724 960505 960317 960129 959973 959847 959754 959628
758444 959565 959503 959440 959408 959346 959189 959001 958814 958626 958532 958500 958532 958626 958657 958657 958594 958500 958407 958344 958312 958249 958249 958219 958219 958249 958281 958344 958407 958469
767189 958563 958626 958688 958782 958845 958907 958970 959001 959064 959126 959189 959221 959284 959346 959440 959503 959565 959628 959691 959784 959847 959941 960035 960161 960285 960443 960568 960724
775633I60850J25R4O2L1%%%%L2L1%%L2%%L1%L2L0%L2%%%L1L2L1%%%l1%l2l1l2I61320
786791I61288l1%l2l1l2l1l0%l2l1l2l1l2l1l1l1l2%l1l2l1%o2l1o3r5o2r4r5I60129
796140I60035r4r4r3j26r4r4r4r4r4r4r4r3r5r4j25j25j26j87j88k19j88k19k20I56841
803679I56558l75m39n01n63n96n63n95n65n94n95o58o89p21p83q46q45r71j065I43341
809710I41807j879k255k538k631k411j911j252n33O3N32Q15R70J003R07N65j25I30061
815139I27995k819l008k504j410O3J503K599L289L602L633L602L476L320L038I49073
819964I51297J754J378J065Q45O58N01L13J57L2%o3o3o3o2r4r4j26j24j58j88I56809
826598I56621k19j88k19j88j26j24o3l2%%%L2%%L1L2L1O2L1L2L1L2L1L1O3O3R3I56120
$$ plain form
775633 960850 960975 961069 961131 961162 961162 961162 961162 961162 961194 961225 961225 961225 961257 961257 961257 961288 961288 961320 961350 961350 961382 961382 961382 961382 961413 961445 961476 961476 961476 961476 961445 961445 961413 961382 961350 961320
786791 961288 961257 961257 961225 961194 961162 961131 961101 961101 961069 961038 961006 960975 960943 960912 960881 960850 960818 960818 960787 960755 960724 960724 960662 960631 960568 960473 960411 960317 960222 960129
796140 960035 959941 959847 959754 959628 959534 959440 959346 959252 959158 959064 958970 958877 958782 958688 958563 958438 958312 958125 957937 957718 957530 957311 957091 956841
803679 956558 956183 955744 955243 954680 954084 953521 952926 952361 951767 951172 950514 949825 949104 948321 947475 946630 945659 944594 943341
809710 941807 939928 937673 935135 932504 930093 928182 926930 926397 926460 926992 927807 928777 929780 930687 931252 931127 930061
815139 927995 925176 922168 919664 918254 918317 919820 922419 925708 929310 932943 936545 940021 943341 946379 949073
819964 951297 953051 954429 955494 956339 956997 957498 957811 957968 958000 958000 957937 957874 957811 957749 957655 957561 957435 957311 957153 956965 956809
826598 956621 956402 956214 955995 955807 955681 955557 955494 955462 955462 955462 955462 955494 955494 955494 955525 955557 955588 955650 955681 955713 955744 955776 955807 955838 955901 955964 956057 956120
835344I56214O2R5O3O1O3L2%%o3o2l1o3o3r4r4r3j26j57j25j57j88j87k20k19I54429
843185I54210k19k20k50k20k82k51k50k50k51k50k51k51k82k81k82k51k82k19I49418
849216I49229k19j88j88j87k20j87j88j89j88k19k19k19k20j87j88j25j26j25I45784
855247I45753%R4J88K51L75M70N02N94N95N96N95N01L76K19O3r5k82m38n32o26I48510
861882I47757p82o89n96m39k49o3O3J56K19J88K19J88J88J88J88J57J56J56J58I47350
868215I47538J88K19K19K51K19K51K19K20K50K82L76M38N32N65O26O89O58O89I55118
874246I55776O89O88O89P52P21P83P52P82P84P82P21O26M70L13J26l2j87k51l45I64232
880579I63793m70n32n32o27o57p21q46r39j065j158j191j222j252j284j284j316I47413
$$ plain form
835344 956214 956276 956371 956434 956495 956558 956590 956590 956590 956527 956465 956434 956371 956308 956214 956120 956027 955901 955744 955619 955462 955274 955087 954867 954648 954429
843185 954210 953991 953771 953521 953301 953019 952768 952518 952268 952017 951767 951516 951265 950983 950702 950420 950169 949887 949668 949418
849216 949229 949010 948822 948634 948447 948227 948040 947852 947663 947475 947256 947037 946818 946598 946411 946223 946098 945972 945847 945784
855247 945753 945753 945847 946035 946286 946661 947131 947633 948227 948822 949418 950013 950514 950890 951109 951172 951077 950795 950357 949825 949199 948510
861882 947757 946975 946286 945690 945251 945002 944939 945002 945158 945377 945565 945784 945972 946160 946348 946536 946693 946849 947005 947163 947350
868215 947538 947726 947945 948164 948415 948634 948885 949104 949324 949574 949856 950232 950670 951202 951767 952393 953082 953740 954429 955118
874246 955776 956465 957153 957842 958594 959315 960098 960850 961632 962416 963198 963919 964545 965015 965328 965454 965422 965235 964984 964639 964232
880579 963793 963323 962791 962259 961632 960975 960254 959408 958469 957404 956246 955055 953833 952581 951297 950013 948697 947413
886007I46098j285j346j410j503j629j754j848k067k318k631k943l258l477l664I11112
890832I07010m354m667m949n105n262n418n512n607n637n607n481n450n449n575H27080
895657H20910o828p862r427j1401j3436j4909j5378j4564j2748j0461q363o828F82661
899879F76993n420m979m323l476k694k035j410p21K51J786M165P454J1526J5817G12071
904704G31959J6757R271j379j2496k1048k4868k3616j8511j1463m165K099O702F58795
908926F69788J1339J1181J0711J0242R929R646R366Q738P736O263M699L446K850G79128
913450G83325N700P205Q362R052R270R083Q644Q081P392O672N919N230M541L978H85931
918275H88969K724K443K193K099K066K194K380K568K662K663K506K254J973J754I22982
$$ plain form
886007 946098 944813 943467 942057 940554 938925 937171 935323 933256 930938 928307 925364 922106 918629 914965 911112
890832 907010 902656 897989 893040 887935 882673 877255 871743 866136 860499 854892 849411 843961 838512 832937 827080
895657 820910 814082 806220 796793 785392 771956 757047 741669 727105 714357 703896 695533 688705 682661
899879 676993 671573 666594 662271 658795 656101 654066 652656 651935 652186 653972 658137 665591 677117 692934 712071
904704 731959 748716 757987 756608 744112 723064 698196 674580 656069 644606 640441 642540 649242 658795
908926 669788 681127 692308 703019 713261 723190 732836 742202 750940 758676 764939 769638 773084 775934 779128
913450 783325 789025 796230 804592 813644 822914 831997 840641 848722 856114 862786 868705 873935 878476 882454 885931
918275 888969 891693 894136 896329 898428 900494 902688 905068 907636 910298 912961 915467 917721 919694 921448 922982
923100I24392J284J191J065R40Q14O89N94N33N02N00N02N01M38M39L75L14K81I35605
928830I35824J56R5R4O2L2O3O3L0O3R4O2R5O3R3O3O3R3O3O3O3O2L1O3L2O2L1%I37610
937575I37641L2L1L1L1L1O3L2L1l1r5k19l75m70o27o57o58n64m69l14j56o3O3I33381
944813I33538K20L44M38N64O89P20P52O58N32M07K82J88J57R4R4R3O3O3O2R5O3I40209
951749I40303J25R5R3R4R5R3O3R3O3R5O2O3R4L1O2L2L1%L2%%%%%%%l2%l1l2%l1I41462
962002I41462l1l1%l2%l1%l2%l1%l1%l1l2%%%%%l1%L1%L2L1%L1L1%L2L1%L2%%I41400
973462I41431%L1%%l1o3o3o2r4r5r3o3r3r5r4r3r5r3r5r3r4r5r3r5o1r5r4r4r4I39239
982811I39144o3r3o3r3r5o3r3o3l1l2%l1l1%l1%l2%l1%l2%l1%l2%l0%l2l1l1l2I37985
$$ plain form
923100 924392 925676 926867 927932 928872 929686 930375 930969 931502 932004 932504 933006 933507 933945 934384 934759 935073 935354 935605
928830 935824 935980 936075 936169 936231 936263 936326 936389 936419 936482 936576 936638 936733 936796 936889 936952 937015 937108 937171 937234 937297 937359 937390 937453 937485 937547 937578 937578 937610
937575 937641 937673 937704 937735 937766 937797 937860 937892 937923 937892 937797 937578 937203 936733 936106 935449 934791 934227 933758 933444 933288 933225 933288 933381
944813 933538 933758 934102 934540 935104 935793 936513 937265 937923 938455 938862 939144 939332 939489 939583 939677 939770 939833 939896 939958 940053 940116 940209
951749 940303 940428 940523 940616 940710 940805 940898 940961 941054 941117 941212 941274 941337 941431 941462 941524 941556 941587 941587 941619 941619 941619 941619 941619 941619 941619 941619 941587 941587 941556 941524 941524 941493 941462
962002 941462 941431 941400 941400 941368 941368 941337 941337 941305 941305 941274 941274 941243 941243 941212 941180 941180 941180 941180 941180 941180 941149 941149 941180 941180 941212 941243 941243 941274 941305 941305 941337 941368 941368 941400 941400 941400 941400
973462 941431 941431 941462 941462 941462 941431 941368 941305 941243 941149 941054 940961 940898 940805 940710 940616 940523 940428 940335 940240 940147 940053 939958 939865 939770 939709 939614 939520 939426 939332 939239
982811 939144 939081 938988 938925 938832 938737 938674 938581 938518 938487 938455 938455 938424 938393 938393 938362 938362 938330 938330 938299 938299 938267 938267 938236 938236 938204 938204 938174 938174 938142 938111 938080 938048 937985
993064I37923l1o3o3o2l1o3l2o2l1o3l2o3l0%%%%L0%L2%%J26K81N33P82R40R72I41775
1002111I42214%m39p51r40r40q14o89n33m07k82k50j89j56j25r4o3%%%%l0l2l1I35386
1009650I35354o2l1o3l2l1l1l1%%%L1%%%%%%%%%%%%l1%%%%%%L1%L1O3L1O3O2O3I35449
1021713I35512L0O3O3L1O2O3O3R3R5R4J25R5J24J25R5J25R4R4J25R4R4R4J25R5I37797
1029554I37955K19K50L13L44L77L44L75L77M07L76L75M39M39M69N64O58O89O89I46254
1035585I46693J56r3l77n95p52q77r39j034j002r71q14o26l76j57L1J57K50K51I39176
1041616I39426K20K50K20K19K19K19J88J88J88J56J57J57J56J57J56J57J57J88I42934
1047648I43090J58J88J56J88J56J57J57J56J26J56J25J57J25J56J89J88K19J88I46223
$$ plain form
993064 937923 937892 937829 937766 937704 937673 937610 937578 937516 937485 937422 937390 937327 937297 937297 937297 937297 937297 937327 937327 937359 937359 937359 937485 937766 938299 939081 940021 940993 941775
1002111 942214 942214 941775 941024 940084 939144 938330 937641 937108 936701 936419 936169 935980 935824 935699 935605 935542 935542 935542 935542 935542 935512 935480 935449 935386
1009650 935354 935292 935261 935198 935166 935135 935104 935073 935073 935073 935073 935104 935104 935104 935104 935104 935104 935104 935104 935104 935104 935104 935104 935104 935073 935073 935073 935073 935073 935073 935073 935104 935104 935135 935198 935229 935292 935354 935417 935449
1021713 935512 935542 935605 935668 935699 935761 935824 935887 935980 936075 936169 936294 936389 936513 936638 936733 936858 936952 937046 937171 937265 937359 937453 937578 937673 937797
1029554 937955 938174 938424 938737 939081 939458 939802 940177 940554 940961 941337 941712 942151 942590 943059 943623 944281 944970 945659 946254
1035585 946693 946849 946756 946379 945784 945032 944155 943216 942182 941180 940209 939395 938769 938393 938236 938267 938424 938674 938925 939176
1041616 939426 939646 939896 940116 940335 940554 940773 940961 941149 941337 941493 941650 941807 941963 942120 942276 942433 942590 942778 942934
1047648 943090 943248 943436 943592 943780 943936 944093 944250 944406 944532 944688 944813 944970 945095 945251 945440 945628 945847 946035 946223
1053679I46442J88J88J87K20J88J88K19J88K19J88J88J88J89K19J88J87J57J25I49950
1059710I50013L1%l1o3l2l1%l1%o2o3r4j26j87k20k82k81k51j57l2O3J57J89J87I48854
1067551I48948J25J26J56J88J56J57J25J57J57J56J57J87K20K19K50K51K51K19I52330
1073583I52393o3j56k51m39n63p20p83q47p51o26n33l75k82o3J87N33R40J253J441I51735
1079916I52988R40O26K82R4%o3o2l2l1%L1O3O3R3R5J25R4O3O2L1o3j25j87k20k82I54335
1088058I54052k49k51k51k19j26l0J56L13L76M07L44K20R4l1o3o2o3l2O3J88L44I55650
1094994I56246N95N63M38K83J24o2j87k82m07n02n63n96o58o57o27o26n64n01m70I51109
1101327I50795r3K19O26R71J285J347J284J001O90K82o3l76o57q46r40j003r70I52612
$$ plain form
1053679 946442 946630 946818 947005 947225 947413 947601 947820 948008 948227 948415 948603 948791 948980 949199 949387 949574 949731 949856 949950
1059710 950013 950044 950044 950013 949950 949918 949887 949887 949856 949856 949794 949731 949637 949511 949324 949104 948822 948541 948290 948133 948101 948164 948321 948510 948697 948854
1067551 948948 949073 949199 949355 949543 949699 949856 949981 950138 950295 950451 950608 950795 951015 951234 951484 951735 951986 952205 952330
1073583 952393 952330 952174 951923 951484 950921 950201 949418 948571 947820 947194 946661 946286 946004 945941 946128 946661 947601 948854 950295 951735
1079916 952988 953928 954554 954836 954930 954930 954867 954805 954773 954742 954742 954773 954836 954899 954992 955087 955212 955306 955369 955431 955462 955399 955274 955087 954867 954585 954335
1088058 954052 953803 953552 953301 953082 952956 952926 953082 953395 953771 954178 954522 954742 954836 954805 954742 954680 954617 954585 954648 954836 955180 955650
1094994 956246 956841 957404 957842 958125 958249 958187 958000 957718 957311 956809 956246 955650 954992 954335 953708 953082 952518 952017 951547 951109
1101327 950795 950702 950921 951547 952518 953803 955150 956434 957435 958125 958407 958344 957968 957311 956465 955525 954522 953552 952612
1107057I51767o90n63m38l45l44m39n96q14r71j002q77o58l13%K82M70N33O26N95I46818
1113390I47382M70M07L44K82J88J26L0j25k82l44l77l75l13k50j88r5L2R3K20K82I47852
1120024I48259M70M70N00M70M39M38M07M07M08L44K82K51K19J88K19J88J25R4L2I54147
1126357I54052k19l12m39n01n64o26p83r09r70r40p52n01l13k19j57o3R5K19L44I46693
1132690I46849J26K50L76M07J56p88J25K18R4K18J25R3J25K17R4J24I48904
$$ plain form
1107057 951767 951077 950514 950076 949731 949387 948948 948352 947538 946567 945565 944688 944030 943717 943717 943999 944469 945002 945628 946223 946818
1113390 947382 947852 948259 948603 948885 949073 949199 949229 949104 948822 948478 948101 947726 947413 947163 946975 946880 946912 947005 947225 947507 947852
1120024 948259 948729 949199 949699 950169 950608 951046 951453 951860 952268 952612 952894 953145 953364 953552 953771 953959 954084 954178 954210 954147
1126357 954052 953833 953521 953082 952581 952017 951391 950608 949699 948729 947789 947037 946536 946223 946004 945847 945784 945879 946098 946442 946693
1132690 946849 946975 947225 947601 948008 948164 947376 947501 947719 947813 948031 948156 948249 948374 948591 948685 948809 948904
1138118I49027  $$checkpoint
##END=