##TITLE= Imported from UXNMR.
##JCAMP-DX= 5.01
##DATA TYPE= NMR SPECTRUM
##DATA CLASS= XYDATA
##ORIGIN= Department of Chemistry, UWI, Jamaica
##OWNER= public domain
##LONGDATE= 2012/02/12 14:14:48.0324 -0500 $$ export date from JSpecView
##SPECTROMETERDATASYSTEM= Bruker Avance
##SOLVENTNAME= CHLOROFORM-D
##.OBSERVE FREQUENCY= 200.131
##.ACQUISITIONMODE= SIMULTANEOUS
##.OBSERVENUCLEUS= ^1H
##.ZEROFILL= 8192
##.ACQUISITIONTIME= 1.979
##XUNITS= HZ
##YUNITS= ARBITRARY UNITS
##XFACTOR= 2.1198175E-3
##YFACTOR= 3.93107578E1
##FIRSTX= -101.88818874
##FIRSTY= 28223.73742676
##LASTX= 2017.92931126
##NPOINTS= 8391
##XYDATA= (X++(Y..Y))
-48065 718 718 718 718 749 718 656 749 656 687 687 749 656 749 687 718 656 687 656 718
-45681 780 593 812 718 718 656 780 656 718 843 718 687 749 687 718 687 687 843 624 718
-43297 749 718 812 687 687 780 656 718 718 718 687 780 749 780 749 749 687 780 749 780
-40914 780 656 656 749 812 749 687 812 749 749 780 687 780 780 749 718 749 718 780 718
-38530 843 812 812 812 812 749 780 718 718 780 780 718 718 749 718 718 749 718 749 780
-36146 749 812 812 843 812 843 843 812 749 687 812 843 780 780 812 749 874 749 780 718
-33763 749 812 812 812 780 749 780 812 780 749 812 718 812 780 749 749 718 780 780 843
-31379 812 718 780 749 905 812 780 812 812 780 780 843 780 812 780 812 843 812 843 718
-28995 812 843 812 812 780 780 874 874 874 812 874 874 874 936 812 936 718 874 812 812
-26612 780 843 812 874 843 874 843 843 780 843 749 780 874 812 812 812 749 843 843 843
-24228 780 843 905 905 812 843 874 874 874 874 843 905 812 874 874 968 968 905 874 905
-21844 999 968 874 843 874 905 780 874 843 843 905 905 968 905 905 874 905 999 843 905
-19461 905 874 968 936 936 968 968 968 905 874 968 999 968 905 1061 1030 999 999 1030
-17196 1093 968 905 1030 968 999 936 936 936 968 874 968 1030 1030 936 905 968 968 936
-14932 968 999 999 999 999 968 968 968 936 968 936 936 905 905 968 936 1030 968 999 968
-12548 968 968 1030 999 999 968 936 999 905 905 936 1061 999 936 968 1030 936 936 936
-10284 999 1030 905 1030 968 968 968 936 968 968 1061 1030 999 1061 1030 1030 968 1030
-8138 936 968 999 999 1030 968 999 1030 936 1030 1061 1124 1061 999 1124 1093 999 999
-5993 1124 968 999 1124 1093 1061 1093 1061 1030 1061 1093 1030 1061 1093 1061 1030
-4086 1093 1093 1093 1030 1124 968 1061 1061 1124 1124 1061 968 1061 1093 1093 1124
-2179 1093 1093 1093 1124 1061 1124 1030 1061 1061 1186 1093 1093 1093 1155 1186
-392 1093 1093 1186 1155 1124 1093 1124 1186 1217 1155 1249 1217 1155 1155 1186
1396 1186 1186 1093 1061 1186 1124 1155 1186 1186 1217 1217 1124 1217 1217 1155
3184 1155 1155 1155 1093 1217 1217 1093 1249 1186 1186 1217 1186 1217 1155 1186
4972 1249 1217 1280 1249 1186 1217 1249 1311 1186 1217 1280 1186 1186 1155 1249
6759 1280 1249 1280 1124 1186 1249 1249 1249 1249 1280 1249 1217 1311 1217 1155
8547 1280 1280 1249 1186 1280 1280 1280 1280 1249 1311 1249 1342 1249 1311 1280
10335 1373 1342 1217 1342 1280 1249 1311 1342 1311 1342 1280 1311 1311 1373 1342
12123 1373 1280 1249 1280 1373 1311 1311 1373 1373 1311 1373 1311 1342 1342 1405
13910 1342 1373 1467 1405 1405 1373 1436 1373 1373 1436 1342 1311 1405 1342 1373
15698 1405 1405 1342 1342 1280 1373 1436 1405 1498 1467 1436 1498 1373 1373 1436
17486 1498 1561 1530 1561 1530 1530 1561 1561 1530 1498 1405 1561 1561 1467 1467
19273 1561 1530 1561 1436 1561 1561 1498 1498 1498 1498 1498 1592 1592 1592 1530
21061 1592 1498 1592 1654 1561 1561 1623 1623 1592 1592 1623 1623 1654 1686 1748
22849 1717 1717 1717 1686 1717 1654 1779 1779 1717 1842 1842 1811 1811 1935 1967
24637 1998 1998 2185 2029 2060 2029 2060 2060 1998 1998 1998 1998 2060 2185 2123
26424 2091 2123 2123 2091 2060 1967 2060 2029 2060 1967 1935 1998 2029 1935 1998
28212 2060 1967 1935 2060 1967 2029 2123 2060 2185 2154 2216 2310 2404 2497 2560
30000 2622 2809 2872 3090 3059 3122 3059 3153 3028 3059 3028 3153 3153 3028 3090
31788 3153 2997 3090 3215 3122 3090 2903 2966 2903 2903 2809 2841 2685 2716 2685
33575 2591 2560 2591 2466 2466 2528 2497 2404 2622 2622 2622 2685 2872 2903 3059
35363 3246 3340 3371 3403 3496 3496 3652 3683 3777 3715 3683 3683 3683 3871 3871
37151 3840 3840 3871 3808 3902 3808 3808 3746 3683 3683 3683 3715 3496 3434 3465
38939 3340 3278 3278 3246 3184 3153 3090 3184 3122 3215 3153 3246 3246 3153 3122
40726 3278 3246 3340 3403 3496 3434 3371 3465 3465 3527 3465 3496 3559 3621 3590
42514 3590 3652 3715 3652 3652 3621 3652 3683 3652 3746 3777 3652 3746 3652 3808
44302 3715 3808 3808 3808 3777 3777 3777 3871 3964 3964 3871 3933 3840 3902 4120
46090 4089 4152 4058 4027 4027 3996 4120 4058 4089 4152 4277 4183 4277 4339 4308
47877 4308 4277 4277 4370 4370 4433 4558 4620 4620 4776 4807 4807 4963 5026 5213
49665 5244 5369 5463 5619 5775 6118 6399 6680 6711 6930 7117 7273 7523 7898 8210
51453 8522 8959 9490 9864 10364 10863 11456 12299 13329 14359 15140 15670 17013
53002 18511 19604 21164 23100 25347 27220 28906 31060 33869 36866 40206 43359
54432 45825 47604 49415 51537 53566 56001 58779 60559 63212 66084 66459 65147
55863 64679 63805 61683 58686 56469 54534 52380 49852 47323 45076 43234 41767
57293 40362 39176 38333 38146 38239 39051 40612 43421 47292 51912 56563 62057
58723 70735 82847 97113 111565 124988 136757 149025 163165 175995 185641 193726
60034 201186 205556 207148 207398 208366 209833 210988 211550 209084 204651
61226 202279 199126 191853 182207 172062 162260 152115 141907 133229 125550
62418 118683 112065 105634 100109 94896 90089 86499 83877 82441 82441 84689 89590
63848 97175 107195 118620 131013 145123 161230 177462 192102 205869 218854 229093
65159 239457 251100 263118 273513 280162 286249 289371 287436 285126 283502
66351 279913 277571 278071 278227 276167 270829 262806 252630 239457 224661
67542 211831 200624 189137 178086 168035 158826 149961 140159 129733 119775
68734 111597 105291 100453 97081 96363 97862 99891 102763 107695 113407 119931
70045 127704 136413 145435 153457 159919 169128 181458 189293 189980 189605
71237 191603 196223 201124 204745 208647 213392 219510 226315 234244 237740
72429 232589 223911 212861 200999 190947 182145 174653 169689 164726 156516
73621 150179 143874 133885 124520 116685 109256 102076 96145 91525 88247 85438
74932 83971 83658 85719 89465 93554 98392 103449 110379 121711 140877 168659
76243 203933 236679 262400 277603 284189 292274 300796 304760 306571 313001
77434 319276 322210 320649 314718 307913 294366 271859 247230 226409 208928
78626 193570 179959 167785 154206 139348 125644 113001 102513 94334 87966 82878
79937 80006 79351 80443 82691 86811 91962 99610 107070 115592 127642 141002 151178
81367 155268 158327 164445 173935 186015 202060 221477 236554 246574 251912
82559 249696 244545 237646 230966 226253 225753 226533 227064 225191 219604
83751 211737 199781 185828 172280 159825 148213 137194 127298 118808 110816
84943 103481 97019 91057 85469 80412 75605 72358 71141 71266 72764 76135 80412
86373 84345 88372 92337 96114 99703 102575 106165 111004 116779 124614 134728
87684 145029 155549 163665 167005 168316 168316 167754 165694 164351 163665
88876 163477 164601 166755 167848 165787 160325 152521 143624 133666 123865
90067 115030 106914 99547 92992 86593 80443 74637 69424 64773 60902 56938 54003
91498 52037 51288 51288 51350 51600 52411 53972 54628 55564 57312 59154 60965
92928 63493 66989 71609 76011 80693 86218 90276 92836 95177 97144 99454 102045
94358 104885 108350 112346 115842 119088 123084 127829 133198 139348 146746
95550 156704 168597 182394 199313 220696 247729 281817 325363 381052 452973
96741 544717 656813 780646 893086 968441 998907 995723 972561 937443 894303
97933 844327 787139 723115 653972 581926 510660 443577 382925 329702 284189
99125 245544 212580 184049 159419 138068 119963 104885 93148 82129 72452 64742
100436 58374 53098 48322 44420 41143 38239 35492 33058 30997 29343 27657 26096
101866 24661 23568 22382 21383 20602 19853 19167 18605 18105 17637 17262 16857
103296 16263 15858 15421 15015 14671 14203 13953 13641 13423 13111 12799 12549
104727 12268 12018 11768 11519 11425 11269 11082 10957 10988 10832 10769 10801
106157 10645 10582 10582 10582 10520 10489 10707 10707 10863 10863 10988 11269
107587 11456 11612 11768 12081 12299 12674 13485 14328 15296 16139 17169 18605
109017 20290 21539 22475 23412 25035 27251 29468 31278 33058 35492 38333 41205
110447 44295 47698 50882 53192 55471 58218 61776 67457 72702 75355 77415 80818
111877 83939 86749 90089 92493 93929 95396 97113 99298 102607 105884 107944 108350
113307 108818 110816 113407 116622 119026 119869 120119 122397 125894 127548
114499 127080 124988 120930 118246 116248 114188 112783 111846 110972 107913
115691 104417 103637 106165 108975 107788 103730 100765 100047 100671 100421
116883 99610 100858 102107 101576 100297 101233 103949 106415 107070 106321 106727
118194 109412 114625 120743 124895 125675 125737 127392 129078 131013 134759
119386 139379 141720 141782 139847 138723 137818 136694 135414 134103 133885
120577 135570 135414 131044 128204 126050 123209 122023 122866 125769 130295
121769 138911 148775 155798 161729 168566 177962 187763 194069 199001 207991
122961 218917 228219 235742 243484 252162 260559 268519 276385 281629 284033
124153 282847 277134 268550 260465 255002 253379 253598 253785 252724 250851
125345 248666 242984 235430 229437 225222 219447 211862 205525 200562 195442
126537 190229 185453 180584 175964 171687 167567 164851 165007 165475 166381
127729 166037 166880 169596 170314 167473 164195 162635 161698 160169 159513
128921 161386 165569 170657 175277 177868 182894 189449 192571 193320 193257
130112 194631 198533 202903 208959 218480 229561 241517 256657 266677 270267
131304 276791 283627 288591 292805 297550 304760 313376 322741 328110 327954
132496 329015 331169 330357 324957 320368 319057 317840 312814 305915 298299
133688 291743 285781 279569 272452 264773 257281 249664 241611 232777 225098
134880 219010 215421 211706 205463 197628 189824 184611 182301 177056 168753
136072 163290 161417 163509 164476 162510 160044 158795 158889 158514 157265
137264 156235 155892 157827 160762 164945 171562 178086 184642 191166 197378
138456 201186 204932 211300 217138 221570 222944 221258 219541 220041 221882
139647 223506 223474 221164 217418 214547 212424 208303 202310 197378 191384
140839 184174 174216 163758 155236 147682 139972 130763 120868 111253 102825
142031 94771 86374 78196 71609 65366 58405 51600 45887 40768 36273 31934 27938
143461 24504 21601 19010 16700 14578 12861 11238 9864 8709 7773 7024 6274 5619 5244
145130 4682 4433 4089 3808 3590 3371 3184 2966 2841 2653 2560 2653 2560 2435 2341
146918 2341 2216 2029 2091 1904 1873 1904 1748 1873 1654 1561 1530 1467 1405 1342
148706 1217 1280 1155 1061 999 936 812 812 905 780 687 718 593 656 562 593 499 593 624
150970 531 531 593 531 593 562 562 531 437 562 499 499 499 531 562 499 562 499 656 656
153354 656 593 531 468 437 468 437 437 375 343 281 312 187 343 281 281 219 156 156 125
155738 125 187 250 94 31 62 -31 -62 -62 0 -94 -94 -94 -62 -62 -62 -62 0 -31 -62 -62 -94 -62 -62 62 -31 -125 -62 -187
159194 -125 -125 -125 -94 -94 -125 -125 -125 -62 -31 -156 -250 -125 -156 -187 -187 -187 -156 -94 -125 -94 -156
161816 -156 31 -31 31 94 125 156 125 250 375 437 499 468 437 499 531 687 687 624 812 718 687
164438 687 687 656 593 624 562 468 375 437 437 406 375 281 312 343 187 156 187 156 94 31
166941 94 31 125 125 156 219 156 250 343 375 343 562 562 656 718 780 905 936 1093 1186
169325 1249 1280 1249 1249 1155 1155 1124 936 999 936 843 812 749 624 780 749 749 687
171470 749 780 718 812 718 780 874 812 905 843 812 812 687 593 562 562 499 406 437 406
173854 375 312 343 281 281 312 375 437 468 499 499 593 531 531 562 562 593 624 656 468
176238 499 343 343 281 156 219 125 94 125 187 250 406 312 281 375 375 406 406 562 468 593
178741 656 624 624 593 499 499 499 437 437 312 468 375 468 593 624 812 812 812 905 812
181125 780 687 718 749 593 531 624 562 624 624 656 531 468 468 437 312 250 250 156 125
183508 125 62 94 31 0 -31 -94 -125 -187 -94 -187 -125 -125 -156 -94 -31 -62 -31 -94 -187 -156 -250 -281 -281 -343
186488 -281 -250 -343 -343 -343 -343 -343 -343 -343 -343 -437 -437 -437 -437 -437 -437 -437 -499 -531 -531
188872 -593 -562 -624 -656 -624 -656 -718 -624 -562 -656 -687 -656 -687 -624 -593 -624 -562 -624 -593 -593
191255 -593 -624 -531 -531 -562 -624 -562 -593 -499 -499 -531 -499 -468 -406 -312 -281 -375 -375 -375 -343
193639 -375 -406 -375 -343 -437 -375 -437 -375 -375 -250 -343 -406 -281 -312 -281 -343 -219 -343 -375 -219
196023 -281 -312 -281 -219 -219 -219 -187 -219 -156 -187 -250 -125 -219 -187 -94 -94 62 62 31 125 219 219
198645 219 187 312 187 250 343 406 343 281 468 437 499 499 656 624 687 780 812 905 936
201029 1030 1030 1186 1280 1249 1217 1342 1311 1498 1561 1561 1748 1873 2091 2123
202817 2123 2310 2591 2747 2934 3153 3434 3715 4058 4464 4838 5369 6025 6774 7585
204604 8865 10301 12018 14234 17731 23474 31840 39863 42766 41455 40456 40362 40487
206154 39925 39270 39956 41080 42547 44732 50757 63462 81130 93086 93148 86374
207584 80318 76198 72140 68269 65491 63961 62151 59778 57624 58561 64492 71796
209014 73857 69674 64523 61776 60777 60684 62307 66302 72452 79538 87529 92149
210445 91431 90027 87748 84376 81161 79101 79101 80537 83315 87404 94803 109068
211875 130389 153395 163384 157484 147745 139691 131762 123459 116342 111441
213067 107507 102981 98798 96800 101420 112970 121648 117559 106009 96301 89277
214378 83752 79070 76853 76479 75636 73888 71516 68269 64492 59560 54534 50258
215808 47573 46075 45450 45887 47354 49664 53379 60278 68862 74325 73607 69174
217238 64398 60684 57375 54253 51881 50226 48572 46418 44732 44420 47198 51256
218668 51319 47136 41767 37771 34618 31684 29000 27127 25285 23037 20415 17512
220099 15046 13079 11113 8897 7086 5650 4620 3808 3309 2934 2497 1998 1405 1061 749
221887 531 281 94 -31 -94 -187 -281 -343 -375 -406 -593 -562 -593 -656 -593 -718 -656 -749 -687 -593 -656
224389 -812 -749 -812 -843 -780 -905 -874 -936 -843 -905 -843 -812 -874 -874 -843 -874 -936 -905 -936 -936
226773 -968 -905 -905 -905 -936 -905 -905 -999 -874 -905 -905 -874 -999 -905 -968 -968 -874 -905 -999 -905
229157 -874 -968 -999 -999 -874 -999 -999 -936 -968 -999 -968 -999 -936 -874 -936 -812 -874 -874 -999 -936
231541 -936 -999 -936 -999 -968 -968 -999 -999 -968 -936 -968 -999 -968 -999 -1061 -1030 -968 -1030 -968
233805 -1061 -905 -905 -936 -968 -968 -936 -968 -968 -999 -968 -936 -968 -936 -905 -905 -936 -936 -936 -812
236189 -905 -749 -812 -656 -687 -749 -780 -843 -687 -749 -718 -812 -780 -687 -749 -718 -562 -531 -562 -531
238573 -562 -499 -624 -687 -687 -624 -656 -687 -593 -718 -656 -656 -562 -593 -593 -749 -749 -624 -749 -718
240956 -624 -593 -593 -499 -499 -468 -406 -593 -499 -562 -562 -593 -593 -624 -499 -437 -437 -250 -156 0 -156
243459 -187 -281 -375 -375 -343 -437 -437 -437 -437 -437 -406 -343 -375 -343 -437 -562 -562 -562 -624 -656
245843 -593 -687 -593 -780 -687 -593 -749 -718 -749 -812 -780 -718 -812 -812 -780 -687 -687 -624 -593 -656
248226 -624 -624 -780 -749 -812 -780 -749 -812 -780 -749 -812 -718 -749 -656 -749 -843 -936 -874 -843 -812
250610 -874 -905 -968 -905 -874 -999 -905 -999 -1030 -905 -936 -905 -999 -936 -874 -968 -999 -999 -936 -1030
252993 -1030 -1030 -968 -936 -1061 -1030 -905 -999 -1030 -1030 -999 -999 -936 -968 -1030 -1030 -1030
255019 -968 -905 -968 -1093 -905 -936 -968 -936 -874 -905 -936 -905 -999 -936 -968 -936 -1030 -905 -936 -936
257402 -999 -936 -936 -936 -905 -968 -936 -905 -936 -999 -936 -968 -999 -968 -968 -905 -999 -968 -1030 -968
259786 -999 -1061 -843 -905 -905 -968 -936 -1061 -968 -968 -936 -874 -968 -905 -936 -905 -936 -999 -968 -936
262169 -999 -874 -905 -905 -936 -968 -968 -874 -936 -968 -936 -843 -936 -874 -936 -968 -843 -968 -905 -905
264553 -936 -1030 -905 -874 -905 -936 -905 -905 -874 -843 -905 -843 -812 -843 -905 -905 -874 -843 -874 -749
266936 -874 -749 -905 -780 -843 -874 -780 -812 -905 -936 -780 -780 -812 -843 -812 -812 -812 -812 -905 -780
269320 -780 -780 -749 -843 -749 -749 -718 -843 -780 -687 -749 -687 -749 -718 -749 -687 -749 -749 -718 -718
271703 -718 -656 -656 -749 -624 -687 -718 -749 -593 -687 -718 -780 -656 -718 -656 -749 -656 -656 -656 -624
274087 -656 -624 -562 -531 -562 -531 -531 -562 -562 -624 -593 -624 -593 -531 -531 -593 -531 -531 -499 -468
276470 -437 -468 -406 -531 -437 -531 -468 -437 -531 -468 -468 -437 -468 -437 -468 -437 -468 -406 -375 -468
278853 -437 -468 -468 -468 -468 -468 -531 -437 -468 -531 -499 -499 -499 -468 -531 -499 -562 -531 -499 -468
281237 -499 -406 -499 -468 -406 -531 -531 -437 -531 -531 -562 -531 -531 -531 -468 -593 -531 -593 -562 -562
283620 -593 -593 -624 -593 -656 -531 -562 -624 -499 -499 -624 -656 -624 -687 -624 -624 -624 -656 -780 -687
286004 -687 -624 -656 -812 -593 -749 -656 -780 -812 -656 -687 -718 -843 -656 -718 -687 -718 -687 -780 -718
288387 -687 -749 -718 -780 -812 -718 -749 -780 -812 -718 -749 -780 -780 -843 -812 -718 -780 -812 -718 -687
290771 -874 -749 -780 -843 -812 -780 -718 -812 -718 -718 -718 -718 -812 -718 -749 -843 -780 -843 -749 -812
293154 -749 -749 -780 -749 -687 -656 -812 -812 -812 -749 -749 -780 -718 -749 -780 -718 -718 -687 -687 -749
295538 -687 -656 -718 -687 -656 -656 -531 -562 -593 -656 -562 -687 -718 -593 -624 -624 -749 -624 -593 -749
297921 -593 -562 -624 -687 -656 -718 -687 -687 -593 -656 -562 -562 -531 -499 -499 -531 -499 -593 -562 -687
300305 -624 -593 -624 -656 -624 -624 -624 -656 -562 -562 -656 -593 -624 -687 -593 -562 -656 -562 -624 -624
302688 -656 -624 -687 -687 -687 -656 -624 -718 -718 -780 -687 -687 -780 -749 -718 -780 -780 -780 -843 -780
305071 -780 -843 -749 -718 -780 -718 -718 -780 -843 -749 -749 -780 -843 -749 -687 -749 -718 -687 -780 -749
307455 -749 -780 -812 -687 -687 -780 -749 -687 -624 -812 -656 -656 -687 -718 -718 -718 -718 -624 -624 -593
309838 -718 -656 -656 -656 -687 -593 -562 -624 -624 -562 -593 -499 -624 -562 -624 -593 -531 -562 -468 -531
312222 -593 -499 -531 -531 -499 -437 -468 -499 -468 -499 -437 -437 -437 -375 -531 -499 -406 -437 -437 -406
314605 -375 -437 -468 -281 -406 -437 -375 -406 -468 -406 -437 -406 -468 -406 -343 -375 -375 -343 -312 -468
316989 -437 -375 -406 -375 -437 -499 -437 -406 -375 -468 -375 -468 -406 -343 -437 -499 -437 -406 -406 -375
319372 -437 -406 -437 -406 -375 -437 -468 -499 -468 -562 -468 -531 -499 -499 -531 -531 -499 -562 -562 -593
321756 -624 -562 -562 -593 -531 -531 -593 -562 -593 -593 -624 -624 -593 -687 -656 -624 -656 -624 -593 -687
324139 -593 -687 -718 -687 -718 -749 -718 -656 -718 -593 -656 -718 -718 -718 -718 -780 -749 -749 -780 -843
326523 -843 -718 -687 -749 -749 -687 -749 -780 -812 -780 -624 -780 -749 -718 -749 -780 -812 -718 -780 -749
328906 -812 -749 -718 -780 -843 -812 -749 -780 -812 -749 -843 -687 -718 -905 -749 -780 -749 -812 -812 -812
331289 -874 -812 -749 -812 -749 -749 -687 -749 -780 -718 -812 -874 -905 -718 -780 -874 -843 -812 -843 -812
333673 -812 -812 -749 -843 -780 -843 -874 -749 -905 -874 -718 -687 -718 -874 -780 -843 -843 -843 -780 -812
336056 -749 -812 -780 -812 -843 -749 -843 -843 -780 -780 -843 -749 -749 -780 -843 -812 -843 -780 -780 -780
338440 -843 -749 -780 -718 -780 -780 -749 -812 -780 -812 -780 -812 -812 -812 -780 -780 -749 -780 -718 -718
340823 -749 -843 -780 -749 -780 -843 -812 -812 -780 -780 -874 -780 -843 -780 -780 -780 -780 -749 -843 -718
343207 -749 -749 -843 -780 -843 -812 -905 -812 -843 -874 -843 -749 -780 -812 -749 -780 -749 -718 -718 -843
345590 -780 -749 -749 -812 -749 -749 -812 -780 -812 -718 -718 -780 -718 -812 -718 -780 -780 -749 -812 -749
347974 -780 -780 -749 -718 -749 -749 -718 -812 -843 -780 -780 -718 -749 -843 -843 -749 -843 -718 -812 -687
350357 -812 -843 -749 -843 -718 -843 -749 -749 -749 -843 -687 -780 -749 -749 -687 -780 -812 -812 -780 -780
352741 -812 -749 -718 -749 -687 -780 -749 -718 -687 -718 -687 -780 -718 -749 -656 -687 -687 -687 -624 -718
355124 -687 -749 -749 -749 -687 -687 -718 -687 -718 -687 -687 -749 -749 -812 -718 -687 -718 -624 -749 -718
357508 -687 -780 -687 -687 -656 -656 -718 -687 -780 -718 -656 -624 -624 -718 -718 -687 -593 -593 -687 -687
359891 -593 -656 -593 -499 -687 -593 -624 -656 -687 -624 -624 -531 -593 -656 -656 -593 -624 -624 -624 -531
362274 -562 -562 -531 -624 -531 -656 -624 -499 -593 -468 -593 -499 -687 -531 -593 -624 -593 -593 -593 -531
364658 -593 -562 -562 -562 -562 -624 -593 -624 -562 -593 -562 -624 -562 -656 -562 -531 -562 -656 -656 -624
367041 -624 -624 -624 -624 -656 -624 -624 -562 -624 -593 -624 -656 -624 -687 -687 -780 -656 -656 -656 -593
369425 -624 -687 -624 -656 -624 -656 -656 -624 -718 -656 -687 -656 -718 -687 -687 -718 -812 -749 -656 -718
371808 -687 -749 -718 -687 -718 -718 -687 -593 -749 -780 -780 -718 -780 -718 -812 -749 -749 -749 -718 -780
374192 -749 -812 -687 -812 -749 -687 -749 -749 -718 -749 -749 -780 -687 -718 -718 -749 -780 -718 -718 -687
376575 -718 -749 -812 -843 -718 -843 -749 -780 -718 -780 -749 -749 -718 -718 -656 -780 -812 -812 -718 -780
378959 -749 -780 -812 -687 -749 -749 -812 -749 -780 -812 -780 -718 -718 -812 -780 -718 -749 -687 -749 -780
381342 -749 -780 -687 -656 -780 -656 -780 -812 -718 -687 -812 -749 -812 -687 -749 -812 -687 -749 -749 -780
383725 -780 -718 -718 -749 -749 -718 -718 -718 -749 -780 -687 -718 -749 -780 -780 -780 -874 -718 -718 -687
386109 -749 -780 -780 -780 -718 -718 -812 -656 -749 -812 -749 -656 -624 -749 -687 -874 -749 -780 -812 -843
388492 -749 -749 -687 -749 -749 -718 -780 -812 -812 -749 -780 -718 -718 -749 -718 -718 -780 -718 -749 -687
390876 -718 -718 -780 -812 -749 -812 -843 -812 -780 -780 -624 -780 -780 -687 -749 -749 -749 -780 -718 -718
393259 -749 -812 -749 -780 -780 -749 -812 -780 -718 -687 -749 -656 -780 -749 -718 -749 -812 -656 -687 -780
395643 -843 -718 -812 -812 -749 -718 -780 -749 -718 -812 -718 -687 -749 -718 -718 -718 -780 -780 -749 -749
398026 -656 -780 -687 -718 -687 -718 -749 -749 -749 -780 -749 -749 -749 -687 -718 -780 -749 -812 -749 -718
400410 -687 -718 -718 -718 -718 -749 -749 -687 -718 -749 -718 -749 -749 -718 -718 -718 -749 -749 -718 -624
402793 -687 -843 -749 -780 -687 -749 -687 -780 -749 -656 -812 -656 -718 -780 -687 -718 -656 -687 -812 -718
405177 -656 -749 -749 -718 -812 -718 -656 -718 -812 -687 -749 -780 -687 -749 -749 -749 -656 -687 -718 -718
407560 -687 -656 -749 -718 -749 -687 -780 -718 -687 -812 -749 -780 -749 -718 -687 -656 -718 -718 -749 -687
409944 -780 -687 -780 -780 -718 -749 -687 -749 -718 -687 -780 -687 -718 -687 -780 -749 -718 -718 -718 -687
412327 -718 -749 -593 -812 -718 -718 -687 -780 -749 -718 -718 -687 -687 -718 -656 -656 -780 -718 -718 -780
414710 -718 -718 -687 -749 -780 -656 -687 -718 -687 -687 -780 -687 -749 -687 -687 -624 -624 -656 -812 -749
417094 -718 -718 -593 -780 -718 -749 -593 -687 -687 -718 -718 -718 -656 -687 -656 -718 -656 -780 -718 -687
419477 -687 -718 -687 -656 -624 -687 -656 -718 -749 -624 -687 -780 -718 -656 -687 -656 -749 -687 -780 -687
421861 -687 -718 -656 -656 -656 -656 -749 -656 -718 -718 -687 -593 -749 -624 -656 -718 -656 -656 -656 -718
424244 -718 -687 -687 -656 -749 -593 -624 -718 -718 -624 -780 -562 -624 -687 -718 -780 -749 -624 -593 -656
426628 -656 -718 -531 -718 -749 -656 -718 -687 -687 -687 -687 -624 -656 -656 -718 -656 -749 -656 -687 -624
429011 -656 -718 -687 -718 -687 -718 -624 -656 -593 -718 -656 -687 -656 -593 -624 -656 -624 -718 -718 -656
431395 -749 -718 -749 -687 -656 -687 -656 -718 -656 -562 -687 -656 -687 -531 -593 -718 -562 -624 -593 -593
433778 -562 -687 -531 -499 -593 -624 -593 -562 -562 -624 -562 -499 -562 -656 -531 -531 -468 -499 -531 -406
436162 -437 -437 -468 -531 -531 -499 -468 -593 -499 -531 -531 -499 -593 -499 -499 -499 -499 -531 -531 -593
438545 -562 -499 -562 -531 -531 -531 -499 -499 -499 -531 -499 -531 -624 -499 -531 -499 -624 -593 -468 -624
440928 -593 -562 -562 -593 -562 -687 -656 -593 -593 -624 -531 -656 -656 -687 -593 -687 -624 -624 -656 -687
443312 -562 -593 -624 -656 -687 -624 -656 -531 -624 -624 -624 -624 -624 -624 -593 -718 -656 -499 -656 -687
445695 -749 -593 -687 -593 -656 -624 -624 -656 -718 -687 -687 -687 -687 -656 -687 -656 -687 -593 -624 -656
448079 -687 -656 -656 -656 -749 -562 -656 -624 -624 -656 -656 -656 -718 -687 -718 -624 -687 -749 -656 -656
450462 -656 -624 -562 -656 -593 -749 -687 -687 -687 -749 -593 -624 -656 -656 -656 -562 -656 -749 -749 -593
452846 -718 -687 -656 -749 -624 -656 -656 -656 -562 -624 -687 -593 -687 -656 -656 -656 -687 -687 -624 -593
455229 -656 -593 -593 -624 -531 -656 -656 -656 -656 -687 -656 -624 -593 -656 -687 -656 -656 -624 -656 -656
457613 -593 -687 -687 -624 -624 -656 -656 -656 -593 -656 -656 -531 -624 -718 -749 -624 -656 -624 -656 -593
459996 -624 -687 -656 -718 -593 -593 -593 -593 -656 -656 -624 -718 -562 -562 -624 -656 -687 -624 -593 -624
462380 -656 -624 -656 -656 -687 -687 -593 -624 -531 -656 -624 -656 -718 -593 -624 -656 -593 -687 -718 -656
464763 -656 -593 -656 -624 -562 -593 -656 -624 -562 -624 -562 -593 -656 -624 -624 -624 -656 -687 -593 -593
467146 -687 -687 -531 -624 -624 -593 -624 -656 -656 -624 -687 -499 -593 -624 -562 -531 -593 -624 -531 -499
469530 -593 -593 -718 -624 -593 -562 -593 -656 -624 -718 -593 -624 -593 -624 -562 -562 -593 -562 -687 -624
471913 -656 -624 -531 -656 -656 -656 -593 -562 -624 -593 -687 -624 -624 -562 -656 -562 -593 -531 -780 -656
474297 -624 -718 -624 -624 -593 -624 -624 -656 -562 -562 -656 -593 -656 -656 -593 -656 -562 -593 -718 -593
476680 -562 -656 -531 -593 -624 -562 -531 -624 -624 -656 -624 -562 -656 -687 -656 -624 -468 -656 -687 -593
479064 -562 -656 -656 -624 -656 -624 -624 -656 -687 -656 -624 -624 -562 -593 -562 -687 -718 -624 -562 -593
481447 -687 -593 -624 -593 -656 -656 -687 -624 -656 -593 -624 -593 -593 -624 -562 -624 -687 -562 -624 -593
483831 -593 -656 -624 -624 -593 -718 -687 -656 -687 -687 -593 -624 -593 -562 -656 -593 -656 -624 -749 -593
486215 -562 -656 -593 -656 -531 -624 -562 -656 -562 -562 -624 -624 -656 -624 -593 -593 -499 -656 -624 -624
488599 -562 -593 -562 -593 -624 -562 -562 -624 -624 -593 -749 -624 -624 -499 -593 -624 -624 -531 -593 -562
490983 -593 -562 -531 -624 -624 -656 -562 -656 -499 -656 -499 -624 -531 -656 -656 -593 -624 -624 -624 -624
493367 -656 -531 -656 -624 -624 -562 -624 -656 -531 -624 -593 -562 -593 -562 -624 -531 -624 -624 -656 -593
495751 -562 -593 -624 -593 -562 -531 -687 -593 -593 -593 -562 -593 -562 -624 -531 -624 -593 -562 -531 -624
498135 -531 -562 -531 -593 -593 -499 -468 -499 -531 -437 -499 -562 -499 -531 -562 -468 -531 -499 -593 -531
500519 -562 -593 -468 -562 -593 -499 -562 -531 -593 -593 -593 -562 -593 -593 -624 -624 -624 -656 -656 -562
502903 -531 -562 -593 -593 -593 -562 -562 -562 -562 -593 -624 -624 -562 -718 -687 -562 -562 -593 -593 -624
505287 -593 -562 -687 -562 -593 -624 -687 -593 -624 -624 -656 -531 -499 -499 -531 -593 -562 -624 -624 -593
507671 -656 -593 -531 -624 -593 -593 -562 -687 -593 -562 -593 -656 -624 -593 -624 -593 -593 -562 -531 -593
510055 -624 -687 -656 -593 -562 -593 -562 -624 -562 -593 -624 -624 -593 -562 -562 -624 -624 -593 -593 -468
512439 -593 -624 -531 -593 -531 -593 -499 -656 -656 -624 -593 -593 -593 -593 -468 -593 -562 -656 -562 -562
514823 -656 -562 -656 -562 -593 -499 -531 -499 -593 -593 -593 -656 -562 -531 -531 -531 -656 -656 -656 -562
517207 -593 -593 -624 -624 -593 -562 -593 -624 -499 -624 -624 -593 -437 -593 -593 -531 -562 -593 -499 -624
519591 -562 -499 -562 -531 -531 -562 -656 -624 -593 -656 -624 -624 -593 -593 -562 -593 -624 -593 -562 -499
521975 -624 -562 -562 -499 -656 -624 -656 -499 -499 -562 -562 -593 -624 -562 -593 -593 -531 -624 -531 -624
524359 -531 -593 -468 -499 -562 -593 -593 -562 -562 -562 -624 -499 -531 -624 -624 -562 -531 -593 -562 -624
526743 -593 -593 -531 -562 -624 -593 -593 -593 -499 -531 -624 -499 -593 -656 -562 -624 -562 -624 -562 -562
529127 -562 -562 -562 -468 -593 -499 -562 -687 -624 -562 -624 -499 -624 -593 -531 -531 -531 -531 -593 -531
531511 -499 -562 -656 -593 -531 -593 -593 -531 -499 -531 -531 -562 -468 -499 -562 -531 -593 -531 -624 -499
533896 -624 -531 -437 -499 -499 -562 -531 -562 -562 -624 -499 -531 -593 -437 -531 -562 -624 -562 -531 -499
536280 -531 -531 -531 -531 -499 -437 -562 -468 -406 -468 -499 -562 -499 -562 -531 -437 -468 -499 -531 -562
538664 -468 -562 -499 -562 -437 -468 -562 -531 -562 -593 -562 -531 -499 -593 -531 -499 -593 -499 -499 -468
541048 -499 -593 -593 -562 -562 -562 -499 -562 -562 -531 -593 -499 -562 -624 -624 -562 -531 -624 -562 -624
543432 -499 -531 -499 -531 -531 -499 -562 -437 -499 -531 -499 -593 -531 -531 -562 -499 -562 -593 -468 -437
545816 -499 -531 -562 -624 -499 -562 -562 -656 -562 -468 -562 -562 -593 -562 -624 -531 -531 -593 -531 -593
548200 -562 -562 -499 -437 -499 -562 -531 -624 -531 -656 -562 -499 -562 -593 -562 -593 -593 -499 -656 -531
550584 -562 -593 -562 -499 -562 -468 -562 -531 -531 -593 -562 -562 -624 -531 -531 -624 -499 -562 -593 -499
552968 -593 -531 -593 -499 -531 -562 -531 -499 -562 -499 -562 -656 -593 -531 -531 -624 -656 -499 -531 -562
555352 -593 -624 -499 -531 -499 -562 -624 -499 -437 -562 -593 -562 -531 -499 -531 -531 -499 -531 -562 -499
557736 -562 -468 -468 -468 -562 -624 -531 -656 -499 -562 -562 -499 -531 -624 -562 -562 -531 -562 -531 -562
560120 -531 -593 -468 -531 -593 -562 -593 -531 -562 -593 -562 -531 -531 -562 -624 -531 -562 -593 -562 -531
562504 -624 -624 -562 -531 -562 -468 -624 -531 -499 -531 -562 -499 -562 -531 -562 -499 -624 -499 -562 -499
564888 -499 -562 -531 -562 -499 -593 -468 -624 -624 -468 -562 -531 -562 -468 -531 -531 -562 -562 -624 -499
567272 -531 -562 -531 -499 -406 -531 -468 -562 -437 -499 -656 -656 -499 -562 -593 -531 -562 -437 -468 -499
569656 -406 -531 -499 -624 -562 -562 -562 -562 -562 -624 -499 -624 -562 -499 -437 -593 -531 -499 -562 -562
572040 -531 -562 -562 -499 -468 -468 -531 -499 -531 -531 -531 -562 -562 -593 -531 -562 -624 -468 -499 -499
574424 -499 -437 -531 -656 -531 -499 -562 -593 -593 -531 -593 -562 -562 -468 -499 -468 -468 -499 -499 -562
576808 -562 -562 -468 -562 -531 -499 -499 -468 -499 -562 -499 -499 -468 -531 -437 -499 -468 -437 -531 -499
579192 -499 -531 -531 -499 -593 -437 -499 -437 -562 -375 -624 -687 -499 -562 -531 -562 -531 -499 -562 -593
581576 -656 -531 -499 -531 -468 -531 -656 -562 -531 -531 -624 -531 -499 -499 -531 -499 -531 -499 -499 -499
583960 -437 -531 -624 -593 -499 -562 -437 -562 -499 -499 -531 -406 -531 -531 -499 -531 -531 -468 -593 -562
586344 -468 -531 -468 -531 -468 -531 -499 -531 -593 -406 -593 -468 -562 -437 -499 -499 -468 -468 -562 -562
588728 -499 -499 -499 -531 -531 -531 -468 -562 -499 -499 -499 -499 -375 -499 -468 -468 -531 -406 -468 -437
591112 -437 -468 -499 -499 -468 -437 -499 -406 -343 -499 -437 -437 -281 -437 -375 -499 -499 -437 -499 -437
593496 -468 -406 -437 -531 -468 -499 -499 -468 -437 -499 -468 -499 -468 -343 -437 -468 -406 -281 -375 -406
595880 -343 -343 -406 -406 -343 -406 -406 -375 -343 -499 -437 -468 -499 -499 -499 -406 -562 -499 -406 -562
598264 -406 -499 -531 -468 -499 -499 -531 -531 -499 -468 -468 -531 -468 -468 -437 -499 -468 -593 -468 -437
600648 -437 -468 -593 -437 -437 -531 -437 -499 -468 -468 -375 -499 -468 -531 -531 -406 -468 -499 -468 -562
603032 -468 -531 -406 -531 -531 -499 -468 -499 -499 -499 -499 -437 -437 -437 -531 -468 -531 -531 -499 -468
605416 -562 -437 -531 -437 -531 -468 -499 -531 -437 -531 -499 -531 -468 -437 -499 -312 -468 -531 -468 -499
607801 -468 -406 -406 -468 -468 -437 -531 -406 -531 -531 -562 -499 -468 -531 -531 -468 -437 -468 -468 -468
610185 -562 -437 -437 -437 -406 -468 -562 -406 -499 -406 -375 -437 -468 -437 -531 -468 -437 -437 -406 -437
612568 -562 -499 -406 -468 -468 -468 -499 -468 -531 -468 -499 -437 -437 -531 -562 -499 -437 -468 -468 -499
614953 -406 -437 -531 -468 -437 -437 -562 -437 -437 -437 -531 -499 -468 -531 -468 -499 -593 -468 -406 -468
617337 -531 -499 -468 -531 -499 -437 -437 -562 -406 -468 -531 -499 -531 -499 -468 -406 -468 -499 -499 -468
619721 -437 -499 -499 -531 -499 -499 -468 -437 -468 -499 -406 -531 -531 -437 -499 -499 -499 -562 -499 -468
622105 -437 -531 -499 -593 -531 -499 -406 -375 -468 -499 -468 -531 -375 -468 -375 -437 -499 -406 -437 -468
624489 -406 -437 -437 -468 -468 -437 -531 -499 -468 -437 -468 -499 -375 -406 -375 -499 -468 -499 -312 -499
626873 -499 -468 -468 -437 -531 -406 -437 -531 -437 -499 -499 -468 -499 -406 -531 -343 -343 -531 -406 -375
629257 -406 -437 -375 -406 -406 -437 -406 -312 -343 -375 -437 -406 -375 -468 -437 -437 -406 -406 -437 -468
631641 -468 -437 -406 -468 -437 -437 -343 -375 -406 -375 -281 -406 -406 -375 -375 -281 -375 -281 -250 -187
634025 -125 219 219 219 -62 -125 -312 -343 -406 -468 -406 -406 -375 -406 -375 -437 -437 -406 -437 -281 -437
636528 -406 -406 -406 -468 -375 -468 -437 -437 -406 -437 -343 -437 -437 -437 -468 -499 -437 -499 -437 -468
638912 -375 -437 -437 -468 -468 -375 -406 -531 -406 -468 -406 -375 -406 -406 -531 -437 -468 -437 -531 -468
641296 -406 -375 -375 -437 -468 -468 -437 -437 -406 -437 -406 -468 -531 -437 -375 -499 -375 -468 -437 -499
643680 -468 -468 -468 -468 -406 -437 -468 -468 -499 -406 -343 -437 -437 -437 -406 -468 -468 -406 -375 -468
646064 -437 -437 -437 -437 -406 -437 -468 -468 -375 -437 -499 -375 -406 -406 -437 -343 -406 -343 -406 -437
648448 -343 -343 -468 -281 -437 -437 -468 -375 -437 -343 -499 -437 -406 -437 -437 -406 -499 -468 -531 -375
650832 -499 -468 -437 -375 -437 -437 -437 -343 -406 -343 -406 -343 -343 -437 -468 -437 -437 -406 -468 -312
653216 -531 -437 -468 -375 -468 -406 -437 -375 -468 -406 -375 -343 -499 -468 -468 -437 -343 -343 -437 -343
655600 -406 -406 -437 -281 -437 -375 -343 -219 -312 -219 -343 -219 -250 -125 -156 0 -31 343 562 2528 5057
658103 2903 2216 2185 2060 1935 1561 1311 1467 1561 1405 1093 843 624 749 624 187 31
660130 -156 -312 -281 -250 -187 -281 -187 -312 -375 -406 -437 -406 -375 -468 -406 -499 -406 -437 -437 -468
662514 -281 -499 -406 -499 -406 -499 -437 -406 -375 -499 -406 -468 -375 -531 -468 -562 -468 -499 -406 -375
664898 -343 -312 -375 -406 -375 -531 -375 -499 -406 -437 -437 -468 -437 -437 -406 -437 -437 -531 -437 -531
667282 -375 -406 -406 -499 -437 -531 -531 -499 -437 -531 -437 -499 -437 -437 -499 -531 -437 -406 -406 -375
669666 -312 -531 -468 -406 -437 -437 -406 -468 -406 -437 -375 -375 -406 -499 -437 -343 -468 -406 -468 -468
672050 -468 -437 -437 -437 -468 -375 -437 -437 -437 -312 -468 -406 -437 -406 -406 -406 -437 -375 -468 -437
674434 -531 -343 -468 -312 -406 -406 -468 -312 -468 -312 -499 -406 -562 -437 -468 -312 -468 -312 -499 -312
676818 -437 -375 -531 -343 -624 -250 -468 -187 -531 -312 -499 -281 -593 -312 -499 -250 -437 -219 -468 -281
679202 -499 -187 -499 -125 -437 -125 -312 -125 -468 -156 -406 -94 -375 -125 -375 -62 -343 187 -62 375 156
681705 531 250 656 312 780 562 968 656 1155 874 1561 1280 1998 2279 3871 4870 9927 15983
683851 22163 28219 54316 105947 120493 114375 68456 41361 19635 5369 2903 1155
685281 936 94 187 -281 -187 -375 -31 -437 -94 -468 -187 -499 -281 -656 -281 -468 -156 -437 -125 -281 62 -281
687904 125 -312 125 -312 -62 -343 0 -281 -31 -250 -156 -375 -94 -343 -94 -343 -156 -375 -62 -125 0 -312 -94 -281
690765 -187 -343 -62 -343 -31 -375 -187 -437 -250 -437 -219 -375 -187 -375 -125 -343 -156 -312 -250 -312 -250
693268 -343 -187 -219 -94 -281 -219 -343 -156 -312 -281 -375 -281 -343 -281 -281 -281 -406 -375 -406 -312 -437
695771 -468 -437 -312 -437 -406 -468 -281 -343 -343 -406 -437 -499 -406 -499 -437 -437 -406 -406 -468 -312
698155 -375 -406 -406 -468 -406 -375 -437 -437 -343 -250 -468 -343 -468 -437 -531 -468 -531 -437 -531 -375
700539 -406 -406 -468 -406 -499 -437 -499 -437 -437 -406 -499 -437 -468 -406 -468 -406 -531 -499 -406 -343
702923 -406 -406 -499 -468 -499 -437 -437 -468 -406 -437 -562 -406 -468 -468 -468 -375 -437 -437 -531 -343
705307 -406 -437 -531 -437 -531 -499 -562 -437 -531 -437 -531 -437 -499 -531 -531 -406 -593 -531 -468 -437
707691 -468 -437 -437 -406 -437 -375 -468 -499 -499 -437 -375 -437 -531 -406 -468 -437 -468 -437 -468 -499
710075 -562 -437 -437 -468 -499 -406 -499 -406 -406 -499 -406 -499 -499 -562 -375 -531 -437 -468 -531 -406
712459 -468 -437 -531 -499 -437 -531 -468 -499 -437 -437 -499 -437 -468 -499 -499 -499 -406 -499 -468 -437
714843 -468 -437 -437 -593 -468 -593 -499 -531 -531 -499 -437 -593 -437 -499 -531 -562 -499 -437 -343 -468
717227 -375 -499 -499 -468 -406 -499 -406 -562 -499 -406 -468 -343 -406 -593 -499 -531 -499 -499 -437 -406
719612 -468 -468 -468 -468 -531 -562 -437 -406 -406 -468 -468 -468 -437 -468 -468 -499 -499 -406 -406 -437
721996 -437 -437 -406 -531 -343 -499 -468 -468 -406 -499 -468 -406 -468 -468 -406 -375 -468 -499 -499 -468
724380 -343 -375 -468 -343 -343 -312 -406 -187 -343 -343 -375 -281 -312 -343 -343 -343 -375 -343 -312 -437
726764 -343 -375 -343 -375 -343 -343 -375 -437 -437 -343 -437 -437 -437 -437 -375 -437 -406 -437 -406 -531
729148 -375 -375 -468 -468 -468 -499 -468 -468 -437 -437 -562 -406 -406 -375 -468 -437 -468 -406 -406 -468
731532 -531 -375 -437 -499 -437 -437 -499 -406 -437 -468 -437 -406 -375 -406 -312 -343 -343 -250 -156 125
733916 125 62 -187 -250 -437 -375 -499 -468 -468 -437 -468 -375 -531 -437 -499 -499 -499 -468 -406 -437 -468
736419 -406 -437 -499 -499 -375 -406 -437 -468 -499 -437 -468 -437 -406 -437 -406 -406 -343 -437 -531 -468
738803 -437 -437 -531 -468 -499 -406 -406 -437 -499 -406 -531 -468 -437 -468 -437 -406 -468 -531 -468 -562
741187 -437 -437 -499 -375 -406 -468 -468 -468 -531 -468 -499 -468 -499 -406 -437 -437 -437 -437 -499 -499
743571 -531 -499 -406 -468 -437 -468 -468 -468 -499 -499 -406 -375 -499 -499 -468 -468 -499 -406 -375 -468
745955 -406 -468 -531 -437 -437 -468 -437 -437 -499 -437 -437 -437 -437 -375 -593 -468 -499 -562 -468 -499
748339 -406 -312 -406 -468 -406 -499 -531 -468 -468 -468 -499 -406 -468 -312 -406 -437 -468 -468 -468 -437
750723 -468 -531 -468 -437 -437 -406 -468 -468 -531 -531 -437 -437 -531 -406 -468 -499 -375 -406 -499 -468
753107 -437 -468 -406 -406 -406 -531 -468 -375 -468 -375 -468 -499 -531 -437 -468 -468 -406 -531 -499 -468
755491 -437 -406 -468 -437 -406 -406 -499 -437 -406 -468 -499 -499 -375 -499 -437 -437 -468 -499 -406 -499
757875 -406 -499 -406 -406 -499 -531 -468 -468 -375 -375 -437 -406 -406 -531 -468 -468 -375 -531 -468 -468
760259 -499 -343 -468 -499 -468 -499 -468 -499 -437 -437 -406 -437 -499 -468 -406 -499 -406 -406 -406 -499
762643 -437 -468 -406 -468 -437 -468 -375 -437 -499 -531 -468 -499 -468 -437 -437 -406 -437 -468 -468 -531
765027 -468 -499 -499 -499 -375 -437 -468 -437 -499 -531 -499 -468 -562 -499 -437 -499 -531 -343 -499 -437
767411 -468 -406 -499 -499 -468 -437 -406 -437 -531 -375 -468 -499 -437 -375 -406 -437 -499 -562 -437 -562
769795 -531 -468 -468 -437 -437 -343 -499 -406 -437 -468 -468 -499 -437 -343 -468 -468 -406 -468 -406 -468
772179 -499 -468 -468 -375 -468 -437 -531 -375 -437 -406 -499 -468 -437 -499 -437 -468 -531 -437 -406 -406
774564 -406 -468 -468 -375 -499 -468 -437 -437 -437 -406 -343 -468 -468 -437 -531 -437 -406 -531 -468 -406
776948 -406 -406 -468 -468 -406 -437 -499 -437 -468 -468 -499 -406 -406 -437 -468 -437 -468 -375 -499 -468
779332 -437 -406 -437 -406 -499 -437 -343 -406 -187 -281 -312 -281 -281 -281 -406 -375 -343 -406 -281 -531
781716 -343 -437 -406 -437 -406 -437 -499 -468 -499 -468 -406 -468 -375 -437 -437 -406 -437 -406 -468 -468
784100 -406 -437 -437 -468 -468 -499 -437 -531 -437 -437 -406 -531 -406 -406 -437 -468 -468 -437 -499 -437
786484 -437 -499 -499 -468 -406 -406 -468 -437 -437 -562 -437 -343 -468 -437 -437 -499 -375 -437 -468 -375
788868 -406 -437 -375 -468 -531 -375 -437 -437 -437 -468 -375 -437 -499 -406 -437 -312 -468 -499 -499 -499
791252 -406 -437 -468 -437 -406 -437 -531 -437 -406 -437 -499 -437 -437 -499 -406 -499 -437 -468 -499 -468
793636 -468 -406 -406 -468 -437 -468 -406 -343 -343 -406 -437 -437 -468 -531 -375 -406 -468 -468 -499 -406
796020 -468 -437 -406 -375 -468 -406 -499 -468 -437 -499 -499 -437 -468 -375 -406 -531 -437 -375 -593 -499
798404 -468 -499 -499 -499 -406 -375 -437 -468 -406 -343 -437 -406 -437 -406 -499 -406 -499 -468 -375 -375
800788 -437 -406 -437 -312 -468 -406 -406 -499 -406 -531 -499 -406 -437 -437 -468 -437 -343 -437 -437 -499
803172 -375 -499 -437 -531 -375 -468 -468 -499 -406 -437 -375 -531 -468 -499 -375 -406 -499 -406 -499 -375
805556 -406 -406 -437 -375 -406 -406 -531 -406 -437 -437 -468 -437 -437 -406 -343 -531 -406 -437 -499 -437
807940 -562 -499 -468 -437 -437 -375 -499 -406 -437 -343 -499 -468 -406 -499 -406 -343 -437 -437 -406 -375
810324 -406 -437 -437 -437 -406 -375 -343 -499 -343 -499 -406 -468 -499 -406 -406 -437 -406 -406 -499 -375
812708 -343 -499 -406 -468 -468 -437 -437 -343 -437 -437 -437 -468 -468 -468 -375 -437 -499 -406 -468 -437
815092 -499 -468 -375 -406 -437 -531 -343 -437 -468 -437 -499 -531 -468 -468 -437 -437 -375 -406 -437 -406
817476 -406 -468 -406 -468 -406 -437 -437 -406 -437 -437 -406 -406 -468 -406 -499 -468 -531 -499 -437 -406
819860 -375 -437 -468 -437 -468 -375 -406 -468 -468 -437 -406 -375 -343 -406 -406 -343 -437 -406 -531 -468
822244 -437 -468 -406 -468 -437 -406 -468 -375 -437 -406 -499 -406 -375 -531 -437 -437 -468 -531 -406 -406
824628 -468 -468 -531 -406 -437 -406 -468 -499 -468 -468 -437 -406 -406 -375 -437 -437 -437 -437 -499 -468
827012 -437 -437 -499 -562 -468 -437 -437 -499 -499 -437 -437 -437 -375 -499 -375 -406 -468 -437 -468 -437
829396 -406 -437 -468 -437 -437 -468 -468 -406 -406 -468 -375 -406 -406 -437 -406 -406 -437 -406 -499 -437
831780 -406 -375 -437 -406 -312 -468 -499 -437 -499 -406 -468 -499 -437 -468 -468 -437 -343 -343 -406 -343
834164 -343 -468 -437 -437 -437 -375 -406 -406 -437 -437 -531 -499 -499 -406 -406 -437 -343 -437 -468 -375
836548 -499 -437 -406 -406 -468 -437 -437 -375 -437 -406 -375 -437 -468 -375 -375 -437 -437 -468 -437 -499
838932 -375 -437 -499 -406 -468 -437 -437 -406 -406 -499 -375 -406 -499 -468 -499 -437 -499 -375 -499 -437
841316 -406 -437 -468 -406 -406 -406 -468 -406 -343 -406 -406 -375 -437 -406 -343 -468 -406 -406 -406 -468
843700 -437 -437 -468 -437 -375 -468 -437 -468 -468 -406 -499 -593 -437 -468 -468 -437 -312 -375 -343 -562
846084 -406 -437 -468 -468 -437 -562 -406 -375 -375 -406 -468 -343 -437 -499 -406 -406 -437 -437 -406 -468
848468 -468 -468 -406 -437 -437 -437 -468 -437 -437 -375 -468 -437 -375 -375 -531 -406 -437 -499 -468 -437
850852 -562 -437 -468 -406 -499 -468 -468 -437 -437 -406 -531 -375 -375 -468 -499 -437 -562 -406 -468 -499
853236 -437 -499 -406 -406 -343 -468 -437 -499 -437 -562 -406 -468 -437 -406 -406 -437 -437 -437 -437 -375
855621 -375 -468 -437 -437 -406 -437 -562 -406 -437 -437 -406 -375 -437 -468 -499 -406 -375 -437 -406 -437
858005 -468 -437 -468 -468 -437 -406 -499 -499 -437 -468 -437 -437 -499 -468 -406 -343 -468 -406 -468 -437
860389 -406 -437 -437 -406 -437 -437 -437 -375 -375 -437 -375 -499 -468 -437 -468 -437 -437 -437 -437 -468
862773 -468 -437 -468 -531 -468 -437 -406 -437 -437 -437 -468 -468 -375 -406 -499 -375 -406 -437 -406 -375
865157 -499 -437 -468 -406 -375 -437 -406 -468 -437 -468 -437 -531 -406 -406 -375 -437 -468 -437 -468 -499
867541 -375 -375 -437 -437 -406 -562 -437 -468 -406 -437 -406 -343 -437 -468 -437 -406 -437 -499 -406 -499
869925 -437 -406 -437 -437 -375 -468 -468 -468 -468 -406 -375 -437 -468 -375 -437 -531 -406 -406 -499 -468
872309 -343 -468 -531 -343 -437 -406 -437 -375 -468 -437 -375 -468 -437 -468 -437 -375 -437 -406 -375 -437
874693 -406 -375 -343 -343 -468 -375 -437 -406 -406 -375 -406 -375 -468 -468 -343 -406 -375 -468 -406 -406
877077 -406 -468 -437 -406 -437 -468 -499 -468 -499 -499 -375 -468 -468 -312 -437 -437 -437 -406 -499 -406
879461 -375 -437 -468 -468 -375 -468 -406 -468 -312 -468 -406 -406 -406 -343 -406 -375 -468 -468 -406 -343
881845 -468 -375 -499 -406 -437 -437 -343 -468 -375 -406 -437 -406 -406 -343 -406 -375 -499 -468 -375 -437
884229 -406 -375 -375 -437 -531 -375 -406 -375 -375 -406 -468 -406 -406 -406 -406 -468 -468 -406 -406 -406
886613 -468 -437 -406 -468 -406 -437 -375 -437 -437 -468 -406 -406 -499 -406 -406 -499 -375 -250 -499 -406
888997 -499 -437 -437 -437 -375 -343 -375 -406 -406 -468 -406 -406 -437 -468 -406 -468 -437 -406 -343 -562
891381 -437 -406 -499 -375 -375 -531 -437 -468 -375 -437 -375 -468 -406 -375 -468 -406 -406 -437 -375 -375
893765 -468 -406 -343 -343 -375 -499 -468 -468 -437 -406 -468 -468 -437 -375 -406 -406 -406 -437 -375 -406
896149 -468 -406 -406 -375 -437 -406 -437 -468 -468 -375 -437 -468 -375 -406 -499 -499 -406 -437 -375 -437
898533 -562 -437 -343 -406 -375 -406 -406 -499 -406 -375 -343 -375 -406 -437 -468 -468 -437 -437 -499 -406
900917 -312 -406 -468 -468 -406 -406 -437 -499 -375 -343 -375 -437 -437 -406 -437 -437 -499 -406 -406 -437
903301 -437 -437 -437 -406 -375 -375 -406 -437 -343 -468 -531 -343 -437 -468 -343 -437 -375 -468 -437 -406
905685 -531 -375 -468 -406 -437 -437 -437 -375 -406 -375 -437 -468 -437 -375 -406 -375 -375 -375 -437 -406
908069 -468 -437 -437 -343 -406 -406 -375 -406 -437 -562 -343 -406 -375 -406 -468 -531 -375 -468 -343 -406
910453 -406 -406 -437 -406 -437 -437 -406 -437 -375 -437 -437 -406 -375 -343 -343 -468 -499 -406 -375 -406
912837 -437 -437 -499 -312 -375 -375 -375 -406 -437 -437 -437 -468 -499 -468 -406 -406 -406 -375 -406 -406
915221 -437 -375 -406 -406 -437 -468 -437 -406 -343 -468 -406 -437 -375 -343 -375 -343 -375 -406 -499 -406
917605 -437 -468 -375 -375 -406 -406 -375 -437 -343 -375 -468 -343 -406 -406 -437 -468 -343 -343 -375 -437
919989 -437 -468 -375 -406 -406 -468 -437 -375 -406 -468 -437 -406 -406 -343 -437 -468 -437 -437 -343 -343
922373 -406 -343 -499 -437 -375 -375 -468 -468 -531 -437 -406 -499 -375 -343 -468 -437 -437 -375 -406 -531
924757 -343 -468 -406 -312 -406 -406 -406 -343 -343 -375 -406 -468 -343 -375 -406 -406 -468 -437 -468 -406
927141 -437 -437 -375 -406 -406 -343 -343 -406 -437 -406 -406 -437 -375 -437 -406 -437 -437 -437 -406 -343
929526 -406 -375 -406 -406 -375 -437 -437 -375 -499 -406 -437 -437 -343 -499 -343 -375 -406 -375 -468 -468
931910 -406 -343 -406 -437 -406 -343 -406 -406 -406 -375 -499 -375 -343 -437 -406 -468 -375 -375 -375 -468
934294 -281 -531 -437 -406 -406 -343 -343 -406 -375 -437 -437 -406 -406 -406 -468 -437 -406 -437 -437 -468
936678 -375 -312 -437 -343 -531 -343 -406 -468 -406 -468 -406 -375 -437 -406 -468 -406 -375 -406 -375 -343
939062 -343 -375 -468 -437 -343 -343 -437 -375 -375 -468 -406 -406 -437 -406 -343 -375 -406 -437 -499 -375
941446 -375 -468 -468 -343 -406 -406 -468 -437 -406 -406 -375 -437 -437 -437 -375 -468 -343 -499 -468 -375
943830 -437 -468 -468 -406 -468 -406 -406 -375 -375 -375 -375 -312 -437 -375 -375 -375 -343 -499 -375 -437
946214 -468 -406 -375 -406 -406 -406 -406 -406 -406 -468 -437 -375 -406 -281 -406 -437 -375 -437 -406 -343
948598 -468 -406 -375 -437 -468 -406 -375 -375 -406 -468 -437 -437 -343 -406 -406 -437 -375 -343 -343 -406
950982 -343 -375 -468 -406 -562 -437 -343 -437 -312
##END=