##TITLE= Cinnamaldehyde
##JCAMP-DX= 5.01
##DATA TYPE= LINK
##BLOCKS=2
##ORIGIN= Department of Chemistry, UWI, Jamaica
##OWNER= public domain
##TITLE= Cinnamaldehyde-400 MHz  CDCl3
##JCAMP-DX= 5.01
##DATA TYPE= NMR SPECTRUM
##DATA CLASS= XYDATA
##BLOCK ID=1
##ORIGIN= UWSP.EDU
##OWNER= public domain
##LONGDATE= 2012/03/16 15:54:02.0551 -0500 $$ export date from JSpecView
##.ACQUISITION TIME= 2.520
##.ZERO FILL= 0
##$$.SHIFT REFERENCE= INTERNAL,  ,1, -0.5
##.ACQUISITION MODE= SIMULTANEOUS
##SOLVENT NAME= CHLOROFORM-D
##SPECTROMETER/DATA SYSTEM= ??
##$MODELS=
<Models>
 <ModelData id="cinnam" type="MOL">
cinnamaldehyde
RLDSViewer          3D                             0

 18 18  0  0  0  0  0  0  0  0999 V2000
   23.4177  -17.7826   -0.0005 O   0  0  0  0  0  0  0  0  0  1
   24.5177  -18.3464   -0.0007 C   0  0  0  0  0  0  0  0  0  2
   24.5916  -19.8054   -0.0004 C   0  0  0  0  0  0  0  0  0  3
   23.4649  -20.5217    0.0000 C   0  0  0  0  0  0  0  0  0  4
   23.4636  -22.0047    0.0003 C   0  0  0  0  0  0  0  0  0  5
   24.6413  -22.7501    0.0002 C   0  0  0  0  0  0  0  0  0  6
   22.2380  -22.6610    0.0007 C   0  0  0  0  0  0  0  0  0  7
   24.5875  -24.1392    0.0005 C   0  0  0  0  0  0  0  0  0  8
   22.1843  -24.0497    0.0010 C   0  0  0  0  0  0  0  0  0  9
   23.3599  -24.7898    0.0009 C   0  0  0  0  0  0  0  0  0 10
   25.4089  -17.7706   -0.0010 H   0  0  0  0  0  0  0  0  0 11
   25.5368  -20.2795   -0.0005 H   0  0  0  0  0  0  0  0  0 12
   22.5349  -20.0124    0.0001 H   0  0  0  0  0  0  0  0  0 13
   25.5827  -22.2683   -0.0001 H   0  0  0  0  0  0  0  0  0 14
   21.3395  -22.0978    0.0008 H   0  0  0  0  0  0  0  0  0 15
   25.4854  -24.7034    0.0004 H   0  0  0  0  0  0  0  0  0 16
   21.2462  -24.5441    0.0014 H   0  0  0  0  0  0  0  0  0 17
   23.3203  -25.8496    0.0011 H   0  0  0  0  0  0  0  0  0 18
  1  2  2  0  0  0
  2  3  1  0  0  0
  2 11  1  0  0  0
  3  4  2  0  0  0
  3 12  1  0  0  0
  4  5  1  0  0  0
  4 13  1  0  0  0
  5  6  4  0  0  0
  5  7  4  0  0  0
  6  8  4  0  0  0
  6 14  1  0  0  0
  7  9  4  0  0  0
  7 15  1  0  0  0
  8 10  4  0  0  0
  8 16  1  0  0  0
  9 10  4  0  0  0
  9 17  1  0  0  0
 10 18  1  0  0  0
M  END
</ModelData>
</Models>
##$PEAKS=
<Peaks type="HNMR" xUnitsExpected="ppm"  >
<PeakData id="1" title=" group ~6.7" peakShape="singlet" model="cinnam" atoms="12" xMax="6.85" xMin="6.55"    />
<PeakData id="2" title="H ~7.40" peakShape="multiplet" model="cinnam"  atoms="16,17" xMax="7.45" xMin="7.4"    />
<PeakData id="3" title="H ~7.48" peakShape="multiplet" model="cinnam" atoms="18" xMax="7.51" xMin="7.455"    />
<PeakData id="4" title="H ~7.54" peakShape="multiplet" model="cinnam" atoms="14,15" xMax="7.55" xMin="7.52"    />
<PeakData id="5" title="H ~7.56" peakShape="multiplet" model="cinnam" atoms="13" xMax="7.6" xMin="7.55"    />
<PeakData id="6" title="H ~9.7" peakShape="multiplet" model="cinnam" atoms="11" xMax="10" xMin="9.4"    />
</Peaks>
##.OBSERVE FREQUENCY= 400.132
##.OBSERVE NUCLEUS= ^1H
##XUNITS= HZ
##YUNITS= ARBITRARY UNITS
##XFACTOR= 1
##YFACTOR= 5.661446E-01
##FIRSTX= 5.001708E+03
##FIRSTY= 2.830723
##LASTX= -2.000338E+02
##NPOINTS= 20727
##MINY= -1.613512E+07
##MAXY= 1811662750
##XYDATA= (X++(Y..Y))
5001.70800781EkJKkJlK%JjJ%jJkKjTKj%J%TlK%VjK%Uj%JkjNklLkJ%JjJ%TjD
$$ 5 3 4 6 4 5 2 4 4 5 4 5 5 4 5 3 5 4 3 5 4 4 5 5 5 2 4 4 4 4 4 3 5 5 5 5 4 4 5 3 2 7 5 2 5 3 4 4 5 4 5 5 5 4 4
4987.9043287738D%JjKkJjT%J%TJ%j%TJj%Jj%jJ%j%Kj%J%kJjKjTKkJkNk%JjUKD
$$ 4 4 5 4 6 4 5 4 3 3 4 4 4 5 5 4 4 4 5 4 4 5 4 4 3 4 4 3 3 5 4 4 5 5 3 4 3 5 4 3 5 3 4 2 7 5 5 6 5 4 3 5 4
4974.6025287738EkJ%JjJ%Vj%jJTjTK%j%jJjJKj%Jj%kKjKkJ%j%LmK%Uj%j%JTjD
$$ 5 3 4 4 5 4 5 5 5 5 5 4 4 3 4 5 4 3 5 5 4 4 3 4 3 4 6 5 5 6 5 5 3 5 4 6 4 5 5 4 4 7 3 5 5 5 5 4 4 3 3 4 5 4 4
4960.7988707015Ek%KjJk%J%jKJk%KlLlKjKlKjTKjJjJkJ%UJj%Kjk%K%k%KjLmD
$$ 5 3 3 5 4 5 3 3 4 4 3 5 6 4 4 6 3 6 3 5 4 6 3 5 4 3 5 4 5 4 5 3 4 4 4 4 5 4 4 6 5 3 3 5 5 3 3 5 4 7 3 4
4947.7480497376Ej%Jj%TjKjJ%JmMk%TJj%KkJj%jKkKk%VJ%JkKj%Jj%kKjJkLjF
$$ 5 4 4 5 4 4 4 3 5 4 5 5 6 2 6 4 4 4 5 4 4 6 4 5 4 4 3 5 3 5 3 3 3 3 3 4 4 5 3 5 4 4 5 4 4 2 4 3 4 2 5 4 6
4934.4463287738CKjJ%JlJ%jK%kLlKj%YjJT%jLjk%UJT%kK%jkKj%J%jJ%j%MljE
$$ 3 5 4 5 5 6 3 4 4 3 5 5 3 6 3 5 4 4 4 4 4 4 4 4 3 4 5 5 4 7 6 4 4 4 4 5 6 6 4 6 6 5 3 5 4 4 5 5 4 5 5 4 4 8 5 4 5
4920.1406287738FkjJT%j%J%jTK%Jj%TKkJj%Uj%JkLj%lKJ%jJjJTkJ%JjTJkK%D
$$ 6 4 3 4 5 5 4 4 5 5 4 3 5 5 6 5 5 5 7 5 6 5 5 5 5 4 4 5 3 6 5 5 2 4 5 5 4 5 4 5 6 4 5 5 6 5 4 5 3 5 5 4
4907.08980781E%kJ%KkjJT%j%UK%jTJ%TjJj%Wj%KjJ%TjJj%TJjJlM%kjKj%TjE
$$ 5 5 3 4 4 6 4 3 4 5 5 4 4 4 4 6 6 5 4 5 5 5 4 5 4 4 4 4 4 4 3 3 5 4 5 5 5 4 5 4 4 4 5 4 5 2 6 6 4 3 5 4 4 4 3 5
4893.0351497376EjLl%jJ%KkJj%JjJ%TkKj%TJ%TkJT%JkjLlKj%J%UkJTkJT%WjE
$$ 5 4 7 4 4 3 4 4 6 4 5 4 4 5 4 5 5 5 3 5 4 4 4 5 5 5 3 4 5 5 6 4 3 6 3 5 4 4 5 5 5 5 3 4 5 3 4 5 5 5 5 5 5 4 5
4879.23140781EjJ%kJ%TJjJ%kKj%TJj%Kj%jTJjJK%kKlJjLkjKjKj%JkjLj%jE
$$ 5 4 5 5 3 4 4 4 5 4 5 5 3 5 4 4 4 5 4 4 6 5 5 4 3 4 3 4 6 6 4 6 3 4 3 6 4 3 5 4 6 5 5 6 4 3 6 5 5 4 5
4866.4316497376DJ%j%UJ%TjJkKj%TJj%UJjKj%j%j%K%kK%UjTJ%Kk%K%jkJjJ%D
$$ 4 5 5 4 4 4 4 5 5 5 4 5 3 5 4 4 4 5 4 4 4 4 5 4 6 5 5 4 4 3 3 5 5 3 5 5 5 5 4 3 4 4 6 4 4 6 6 5 3 4 3 4 4 4
4852.8788707015CJT%jTKjJjTK%TjKlKj%KlK%UJ%k%J%jJTj%jJjKkJ%Vj%Kl%JE
$$ 3 4 5 5 4 3 5 4 5 4 3 5 5 5 4 6 3 5 4 4 6 3 5 5 5 5 6 6 4 4 5 5 4 5 6 5 5 4 5 4 6 4 5 5 5 5 5 4 4 6 3 3 4 5
4839.3261707015D%J%jTJTjKlJTjJjJ%j%TJ%jJ%Vj%TJj%JTkJj%JKlJjJjTKkJE
$$ 4 4 5 5 4 3 4 5 4 6 3 4 5 4 5 4 5 5 4 4 4 5 5 4 5 5 5 5 5 4 4 4 5 4 4 5 6 4 5 4 4 5 7 4 5 4 5 4 3 5 3 4 5
4826.0243707015DJjJTk%JjJ%JjJj%UjTKjJk%TJTjJjJjTJTj%J%j%Ll%TJTj%JF
$$ 4 5 4 5 6 4 4 5 4 5 5 6 5 6 5 5 5 5 4 3 5 4 5 3 3 3 4 5 4 5 4 5 4 3 4 5 4 4 5 5 4 4 7 4 4 4 5 6 5 5 6 6
4812.9736497376EjT%J%KlJKkJjJj%kKJj%KjT%J%WJjJ%lLjJkLk%jJj%jK%kLjD
$$ 5 4 3 3 4 4 6 3 4 6 4 5 4 5 4 4 2 4 5 4 4 6 5 4 4 5 5 5 5 5 5 6 5 6 6 3 6 5 6 4 7 5 5 4 5 4 4 3 5 5 3 6 5 4
4799.4208707015DJk%LjkJ%KkJj%TJj%JTkJ%TjJTj%j%jJTjJ%TjJk%JU%TjT%JE
$$ 4 5 3 3 6 5 3 4 4 6 4 5 4 4 4 5 4 4 5 6 4 5 5 5 4 5 6 5 5 4 4 3 4 5 4 5 5 5 4 5 3 3 4 5 6 6 6 5 4 4 5 5
4786.3701287738EKkj%J%TjJTkKjJjTJ%Tj%K%TJjkKkjL%kK%jTKjJjkKj%JjJ%D
$$ 5 7 5 4 4 5 5 5 4 5 6 4 6 5 6 5 4 5 5 5 4 4 6 6 6 7 6 4 6 4 3 6 6 4 6 6 5 4 6 5 6 5 3 5 4 4 5 4 5 5 4
4773.5702707015Fj%KlJ%j%J%Jk%JjJjJjJ%TJkJjK%TkKjJ%TkJ%jKj%jTJj%JKD
$$ 6 5 5 7 4 5 5 4 4 5 5 6 4 4 5 4 5 4 5 4 5 5 5 6 4 5 4 6 6 6 4 6 5 6 6 6 4 5 5 4 6 5 5 4 3 4 3 3 4 6 4
4760.7705287738CKkK%j%TJTk%J%J%jJj%VJjJj%J%j%Tj%TJ%TkJ%JkJTlL%TJkD
$$ 3 5 3 5 5 4 4 4 5 6 4 4 5 5 6 6 5 6 5 5 5 5 5 6 5 6 5 5 6 6 5 5 5 4 4 4 5 5 5 3 4 4 5 3 4 5 2 5 5 5 6 4 4
4747.4687287738DJjJjLlKjUKjJjJ%JTkJj%Tj%JTkJj%JjT%LjT%J%J%kKkKk%JF
$$ 4 5 4 5 4 7 4 6 5 4 3 5 4 5 4 5 5 6 7 5 6 5 5 5 4 4 5 6 4 5 4 4 5 4 3 3 6 5 4 4 5 5 6 6 4 6 4 6 4 4 5 6
4734.41800781DKj%jLk%TjJ%TjJ%TJjTJjJKk%TjKj%JkJ%j%JjJKm%J%VJTlJE
$$ 4 6 5 5 4 7 5 5 5 4 5 5 5 4 5 5 5 6 5 4 5 4 5 7 5 5 5 4 6 5 5 6 4 5 5 4 4 5 4 5 7 3 3 4 4 4 4 4 5 6 3 4 5
4721.1161707015EJ%kKJm%JU%jTKk%WJ%J%j%KjU%TLkJjJjTKJkJjTJjJjKj%J%E
$$ 5 6 6 4 6 7 3 3 4 5 6 6 5 4 6 4 4 4 4 4 4 5 5 6 6 5 5 7 6 5 4 4 4 7 5 6 5 6 5 4 6 7 5 6 5 4 5 4 5 4 6 5 5 6 6 5
4707.0615497376EjK%jJjTJ%Tj%J%Tj%TJKlJ%jJ%jJj%TKkJKjT%jJ%TjkMjKmJE
$$ 5 4 6 6 5 6 5 4 5 5 5 4 4 5 5 5 4 4 4 5 7 4 5 5 4 5 5 4 5 4 4 4 6 4 5 7 6 5 5 4 5 5 5 4 2 6 5 7 3 4 5
4694.26170781EJTk%TjKkKjJj%JkJjK%j%KjTJjTJ%TJkJTj%VlKJ%jJT%JjTJE
$$ 5 6 7 5 5 5 4 6 4 6 5 6 5 5 6 4 5 4 6 6 5 5 7 6 5 6 5 4 5 5 5 6 4 5 6 5 5 5 5 5 2 4 5 5 4 5 6 6 7 6 5 6 5
4680.96000781E%UJj%Jk%JTkjL%Tj%UJjTKkJ%jJ%TJj%jJTjJ%jTKkJ%JkTL%G
$$ 5 5 5 5 6 5 5 6 4 4 5 6 4 3 6 6 6 5 5 5 5 6 5 4 6 4 5 5 4 5 5 5 6 5 5 4 5 6 5 6 6 5 4 6 4 5 5 6 4 2 5 5 7
4667.6581707015DKjJkLkjT%K%JjJjTKkTNlLjk%JT%kKj%TJjkKj%TJ%UKk%WJ%G
$$ 4 6 5 6 4 7 5 4 3 3 5 5 6 5 6 5 4 6 4 2 7 4 7 6 4 4 5 6 6 4 6 5 5 5 6 5 3 5 4 4 4 5 5 5 5 7 5 5 5 5 5 5 6 6 7
4653.8545287738E%J%TkKkJ%JkJTjT%UK%jJ%TjJjTJUk%TkLJk%UJTj%jJ%kJjJE
$$ 5 5 6 6 6 4 6 4 5 5 6 4 5 6 5 4 4 4 4 6 6 5 6 6 6 5 6 5 4 5 6 7 5 5 5 3 6 7 5 5 5 5 6 7 6 6 5 6 6 4 5 4 5 5
4640.3017497376E%TKk%TKjkK%lJT%TjJTkLmLJj%k%J%JjJk%KjJlJ%Jj%J%jKjD
$$ 5 5 5 7 5 5 5 7 6 4 6 6 3 4 5 5 5 4 5 6 4 7 3 6 7 6 6 4 4 5 5 6 5 6 4 4 6 5 6 3 4 4 5 4 4 5 5 4 6 5 4
4627.50200781Gk%UK%kJ%jKk%TJ%TlJKlKJkJjJjLk%jKkJ%UjLjTJj%Jj%UJ%F
$$ 7 5 5 5 5 7 7 5 6 6 5 7 5 5 5 6 6 6 3 4 6 3 5 6 4 5 4 5 4 7 5 5 4 6 4 5 5 5 5 4 7 6 5 6 5 5 6 5 5 5 5 6 6 6
4613.94920781FkK%k%J%UjKj%Jj%TJjJ%j%jK%kJ%TJkJ%Kj%jTK%k%K%jTJ%JE
$$ 6 4 6 6 4 4 5 5 5 5 4 6 5 5 6 5 5 5 6 5 6 6 5 5 4 6 6 4 5 5 5 6 4 5 5 7 6 6 5 4 6 6 4 4 6 6 5 4 5 5 6 5
4600.8984707015E%J%jK%kj%UKj%J%Jkj%K%k%KlJK%kJ%WJj%JjJ%jJ%kK%jKlKE
$$ 5 5 6 6 5 7 7 5 4 4 4 4 6 5 5 6 6 7 5 4 4 6 6 4 4 6 3 4 6 6 4 5 5 5 5 5 5 6 5 5 6 5 6 6 5 6 6 4 6 6 5 7 4 6 5
4587.0947287738D%KkKj%TJk%J%TJk%KJlJTj%j%KjJjTKj%JT%k%jK%TjTJjK%jD
$$ 4 4 6 4 6 5 5 5 6 4 4 5 5 5 6 4 4 6 7 4 5 6 5 5 4 4 6 5 6 5 4 6 5 5 6 7 7 5 5 4 6 6 6 5 4 5 4 6 6 5 4
4574.2949707015Gl%Kj%JTk%Jj%jJ%jK%TJjkJ%jMkTLj%lMjUJ%XJjT%Kj%VJjJF
$$ 7 4 4 6 5 5 6 7 5 5 6 5 5 4 5 5 4 6 6 6 7 6 4 5 5 4 8 6 4 7 6 6 3 7 6 5 4 5 5 5 5 5 5 5 6 5 4 4 6 5 5 5 5 5 6 5 6 6
4559.7382707015DJjJjKjJ%Tj%KmK%JkLjTJj%WJTj%jJkJ%jJTj%K%Tk%TJ%jJjD
$$ 4 5 4 5 4 6 5 6 6 6 5 5 7 3 5 5 6 4 7 6 5 6 5 5 5 5 5 5 6 7 6 6 5 6 4 5 5 4 5 6 5 5 7 7 7 5 5 5 6 6 5 6 5 4
4546.18550781G%lJ%JjTMmLjJlJ%Lkj%Jj%Jj%JjJ%TJkJjJ%kLkJkK%jJ%kK%G
$$ 7 7 4 5 5 6 5 4 8 4 7 6 7 4 5 5 8 6 5 5 6 5 5 6 5 5 6 5 6 6 6 7 5 6 5 6 6 4 7 5 6 4 6 6 5 6 6 4 6 6 7
4533.3857497376EJkJTjJT%j%jKj%j%TKlLkJ%jKj%jTJ%jJ%VjJ%KlKjTLk%K%kE
$$ 5 6 4 5 6 5 6 7 7 6 6 5 7 6 6 5 5 5 7 4 7 5 6 6 5 7 6 6 5 4 5 5 4 5 5 5 5 5 4 5 5 7 4 6 5 4 7 5 5 7 7 5 5
4520.0839497376EjKj%JKl%TJ%jJTk%JjTLjT%JjTJ%TK%k%JlLj%JjJ%TjJ%jJjF
$$ 5 4 6 5 5 6 8 5 5 5 6 6 5 6 7 5 5 6 5 4 7 6 5 5 6 5 4 5 5 5 7 7 5 5 6 3 6 5 5 6 5 6 6 6 5 6 6 5 6 5 6
4507.2841707015EJ%JjJjTJ%jKkTLkKJjTJj%TLjkJ%TjLk%j%TKjT%J%kK%jT%JF
$$ 5 6 6 7 6 7 6 5 6 6 5 7 5 3 6 4 6 7 6 5 6 5 5 5 8 7 5 6 6 6 5 8 6 6 5 5 5 7 6 5 5 6 6 4 6 6 5 4 4 5 6
4494.4844287738EjL%jT%JjKkJ%UjJkJU%kjLkJkJ%JjJTj%jJjJj%KkJTlJTj%LF
$$ 5 4 7 7 6 5 5 6 5 7 5 6 6 6 6 5 6 4 5 6 7 7 5 4 7 5 6 4 5 5 6 5 6 7 6 6 5 6 5 6 5 5 7 5 6 7 4 5 6 5 5 8 6
4481.1826287738GjJjJjT%TKj%Vj%JT%j%jJ%VjKkJjKlJT%J%l%J%JTkJ%TjKk%F
$$ 7 6 7 6 7 6 5 5 5 7 6 6 6 6 6 5 5 6 7 7 6 6 5 6 6 6 6 6 5 7 5 6 5 7 4 5 6 6 7 7 4 4 5 5 6 7 5 6 6 6 5 7 5 5 6
4467.3788707015EJTjKk%JlKkJKlLj%JkJTjJjTJ%lL%Tj%jLkJjLkjJ%jKlKjJ%G
$$ 5 6 7 6 8 6 6 7 4 6 4 5 7 4 7 6 6 7 5 6 7 6 7 6 5 6 6 3 6 6 6 5 5 4 7 5 6 5 8 6 5 6 6 5 7 4 6 5 6 6 7
4454.57910781EJ%UjJj%TJkJU%jTJ%TkJKkJT%TlK%JmKTkJjJTkKjJjTJTjTJF
$$ 5 6 6 6 6 5 6 5 5 5 6 4 5 6 7 7 6 5 6 6 6 4 5 7 5 6 7 7 7 4 6 6 7 3 5 7 5 6 5 6 7 5 7 6 7 6 5 6 7 6 5 6 6
4441.27730781EJTj%kK%J%kJ%J%TjTJ%Jj%JjJkJ%JTk%kKJkK%kJ%j%TKkjJUkF
$$ 5 6 7 6 6 4 6 6 7 7 5 6 6 7 7 7 6 5 6 6 7 6 6 7 6 7 5 6 6 7 8 6 6 4 6 7 5 7 7 5 6 6 5 5 5 7 5 4 5 6 7 5 6
4427.97560781EJjJKjk%jKjK%jJj%j%TK%kKjTJ%jJ%Kl%TJ%TjJjJ%TK%lKjJG
$$ 5 6 5 6 8 7 5 5 4 6 5 7 7 6 7 6 6 5 5 5 7 7 5 7 6 5 6 6 5 6 6 8 5 5 5 6 6 6 5 6 5 6 6 6 8 8 5 7 6 7 7
4415.1757497376HjkKkJ%jJjJjKj%UJjKkJjJ%j%WjJ%JTjJjTJjJTkJ%jTK%jJkD
$$ 8 7 5 7 5 6 6 5 6 5 6 5 7 6 6 6 6 7 6 8 6 7 6 7 7 6 6 6 6 6 6 5 6 6 7 8 7 8 7 6 7 6 7 8 6 7 7 6 5 7 7 6 7 5 4
4401.3720916653EJkKJjJl%JT%kKTlKj%TJjTKkK%jJT%Tk%UJ%Uj%jKj%TJ%j%UjE
$$ 5 6 4 6 7 6 7 4 4 5 6 6 4 6 8 5 7 6 6 6 7 6 5 7 5 7 7 6 7 8 8 8 6 6 6 6 7 7 7 7 6 6 5 7 6 6 6 7 7 6 6 6 6 5 5
4387.5683287738DLj%Jk%J%jJT%jkK%TKk%WjTKJj%J%jJ%JmJT%jMlKkJj%jJTjF
$$ 4 7 6 6 7 5 5 6 6 5 6 7 7 6 4 6 6 6 8 6 6 6 6 6 6 5 4 6 7 6 6 7 7 6 7 7 8 4 5 6 6 5 9 6 8 6 7 6 6 5 6 7 6 6
4374.0156497376HlKJjT%JkK%jJkK%TjJjJlLj%WKj%j%XjKkK%kK%j%jKJjTKmKG
$$ 8 5 7 8 7 6 6 7 5 7 7 6 7 5 7 7 7 6 7 6 7 4 7 6 6 6 6 6 6 8 7 7 6 6 6 6 6 6 6 5 7 5 7 7 5 7 7 6 6 5 7 8 7 6 8 4 6 7
4359.4589707015EJ%JkJTk%JUkJ%UjJ%TJj%kJT%jTJjJ%TJ%Vj%TJj%J%Tj%Kk%H
$$ 5 6 6 7 5 6 7 5 5 6 7 8 6 7 7 7 7 6 7 7 7 8 7 7 5 6 7 7 6 5 6 5 6 6 6 7 7 7 7 7 6 6 6 7 6 6 7 7 7 6 6 8 6 6 8
4345.65530781Hk%UKk%Kj%TkKJk%UJTjJk%JTlJjJ%VJ%JjT%KjkJ%jJKjTKjKG
$$ 8 6 6 6 6 8 6 6 8 7 7 7 5 7 8 6 6 6 6 7 8 7 8 6 6 7 8 5 6 5 6 6 6 6 6 7 7 8 7 6 6 8 7 5 6 6 5 6 8 7 6 8 7 9 7
4331.8515497376HkJ%TJj%j%JjKk%J%UKkj%KkJjTKJ%kJj%jLkJTjkLk%Kj%VjTLG
$$ 8 6 7 7 7 8 7 7 6 6 7 6 8 6 6 7 7 7 7 9 7 6 6 8 6 7 6 5 7 8 8 6 7 6 6 5 8 6 7 8 7 5 8 6 6 8 7 7 7 7 7 6 5 8 7
4318.04790781FKj%TjJ%UJkKkJ%j%JjKj%TjMnLlLkJ%jJKkjLkJj%jKjTJKkTLG
$$ 6 8 7 7 7 6 7 7 7 7 8 6 8 6 7 7 6 6 7 6 8 7 7 7 6 10 5 8 5 8 6 7 7 6 7 9 7 6 9 7 8 7 7 6 8 7 6 7 9 7 5 8 7
4304.7460916653FkKJjK%kKjTJT%lL%UjT%J%UjKjKJkTJTj%KjT%JjL%mJjKk%JG
$$ 6 4 6 7 6 8 8 6 8 7 6 7 8 8 5 8 8 8 8 7 6 6 7 7 7 7 6 8 7 9 10 8 6 7 8 7 7 9 8 7 7 8 7 10 10 6 7 6 8 6 6 7 7
4291.4443707015G%Tj%KjkMj%TkJjKj%JjJjUK%VJ%JlJKmKJjJ%j%JjJ%jJjJkKG
$$ 7 7 7 6 6 8 7 5 9 8 8 8 6 7 6 8 7 7 8 7 8 7 6 5 7 7 7 7 7 8 8 9 6 7 9 5 7 8 7 8 8 7 7 8 7 8 8 7 8 7 8 6 8 7
4277.89160781G%jLkjKjTKJj%kKjJjTLkJjTK%jKlLlJKj%JkjKJjJj%TkKj%JI
$$ 7 7 6 9 7 6 8 7 6 8 9 8 8 6 8 7 8 7 6 9 7 8 7 6 8 8 7 9 6 9 6 7 9 8 8 9 7 6 8 9 8 9 8 8 8 6 8 7 7 8 9
4265.0918497376H%Tj%J%kK%Jk%JjJj%K%k%UJj%J%kKjJ%kKJjJkJ%J%kjL%jTJG
$$ 8 8 8 7 7 8 8 6 8 8 9 7 7 8 7 8 7 7 9 9 7 7 7 7 8 7 7 8 8 6 8 7 8 8 6 8 9 8 9 7 8 8 9 9 7 6 9 9 8 7 8 7
4252.0410287738G%JUj%TkJTj%JkKjJj%JjJ%jJj%kJ%JjKk%JjLkJjJj%JkJT%jG
$$ 7 7 8 9 10 9 9 9 7 8 9 8 8 9 7 9 8 9 8 8 9 8 9 9 8 9 8 8 6 7 7 8 7 9 7 7 8 7 10 8 9 8 9 8 8 9 7 8 9 9 8 7
4238.9902707015A0lJTKkj%jLlJKjT%JTkKkJj%Jj%Jj%J%k%K%UjJk%J%TKkKlJI
$$ 10 7 8 9 11 9 8 8 7 10 7 8 10 9 8 8 9 10 8 10 8 9 8 8 9 8 8 9 8 8 9 9 7 7 9 9 9 9 8 9 7 7 8 8 8 10 8 10 7 8 9
4226.1904287738H%Jk%J%UJkJKk%Jk%JKkJjTJ%TJjTKk%TLlJjLjTKkTKJj%Jj%I
$$ 8 8 9 7 7 8 8 8 8 9 7 8 10 8 8 9 7 7 8 10 8 9 8 7 8 8 8 9 8 7 9 7 7 7 10 7 8 7 10 9 8 10 8 6 8 9 8 8 9 8 8 9
4213.13960781HKjkJjJKj%UkLj%j%TjK%J%j%jTJKjkKjJ%TjJT%kJj%J%kjMlI
$$ 8 10 9 7 8 7 8 10 9 9 9 9 7 10 9 9 8 8 8 7 9 9 10 10 9 9 8 7 8 10 9 7 9 8 9 9 9 8 9 10 10 8 9 8 8 9 9 7 6 10 7 9
4200.0888707015I%kLj%WjKlK%kK%j%JT%Jj%UkLkjKj%J%TjT%JTj%JkjJT%JjTJI
$$ 9 9 7 10 9 9 9 9 9 9 8 10 7 9 9 7 9 9 8 8 9 10 10 11 10 10 10 10 8 11 9 8 10 9 9 10 10 10 9 8 8 9 10 9 9 10 8 7 8 9 9 10 9 8 9 9
4186.0342287738A0j%TKkjKJkjKj%UjJ%TkK%kLJjKJKjKjUk%k%jJjMl%UkK%jMA0
$$ 10 9 9 9 11 9 8 10 11 9 8 10 9 9 9 9 8 9 9 9 7 9 9 7 10 11 10 12 13 15 14 16 15 14 13 11 11 9 9 8 9 8 12 9 9 9 9 7 9 9 8 12 10
4172.7324287738H%KkJ%UkKJ%j%JjT%JTjTJKmJ%J%JjTKj%UJj%J%jJkLlKjTKjI
$$ 8 8 10 8 9 9 9 9 7 9 10 10 9 9 10 9 8 8 9 10 9 8 9 11 7 8 8 9 9 10 9 8 10 9 9 9 9 10 9 9 10 10 9 10 8 11 8 10 9 8 10 9 9
4159.4306287738GJTjJT%TjJkJjJj%K%UjT%KjJjJjUL%UjTK%TJk%jJ%KmJKj%TjA0
$$ 7 8 9 8 9 10 10 10 9 10 8 9 8 9 8 8 10 10 10 10 9 8 8 10 9 10 9 10 9 8 7 10 10 10 10 9 8 10 10 10 11 9 9 8 9 9 11 7 8 10 9 9 9 8 10
4145.6269707015IJj%Jk%K%j%J%TkKJjT%Tj%Kj%JjJjUJT%TjKjJ%WJjlLj%JkJI
$$ 9 10 9 9 10 8 8 10 10 9 9 10 10 10 8 10 11 10 9 9 9 8 8 10 9 9 10 9 10 9 8 7 8 9 9 9 8 10 9 10 10 10 10 10 10 11 10 7 10 9 9 10 8 9 9
4131.82320781HKlK%JjJjJkKJk%VJjKkjKjJjJ%Vk%J%JTjkKjJkJLlKjT%jJTjA0
$$ 8 10 7 9 9 10 9 10 9 10 8 10 11 9 9 9 9 9 10 9 11 9 8 10 9 10 9 10 10 10 10 10 8 8 9 9 10 11 10 8 10 9 10 8 9 12 9 11 10 9 9 8 9 10 9 10
4117.7685707015A0j%TJTjT%J%UjJ%JjKjT%TjKj%JkK%k%KlJ%J%j%JUk%TJk%JA0
$$ 10 9 9 9 10 11 10 9 9 10 10 10 10 9 10 10 11 10 12 11 10 10 10 9 11 10 10 11 9 11 11 9 9 11 8 9 9 10 10 9 9 10 11 12 10 10 10 11 9 9 10 10
4104.7177497376A0%TJkJj%TjKJjkLj%TjK%j%kKTjTJj%KkK%mK%J%k%LlKJjTJA0
$$ 10 10 10 11 9 10 9 9 9 8 10 11 10 8 11 10 10 10 9 11 11 10 10 8 10 12 11 10 11 10 10 12 10 12 12 8 10 10 11 11 9 9 12 9 11 12 11 10 11 10
4092.1689707015A2%TkJkK%TjJTjkK%JjJk%TjKJkJ%j%JTjJjTJ%TjJ%j%JT%j%A1
$$ 12 12 12 10 11 9 11 11 11 10 11 12 11 9 11 11 12 11 12 10 10 10 9 11 12 10 11 11 10 10 11 12 11 12 11 10 11 11 11 10 11 11 10 10 11 12 12 11 11 11
4079.6200916653A1%TjJj%UJ%TjJ%J%TkJ%J%jTJKk%TKj%kJjKkJ%UJ%jKk%JjTKA1
$$ 11 11 11 10 11 10 10 10 10 11 11 11 10 11 11 12 12 12 10 11 11 12 12 11 10 11 13 11 11 11 13 12 12 10 11 10 12 10 11 11 11 11 12 12 11 13 11 11 12 11 10 12 11
4066.3183707015A1%j%KlK%J%j%UJ%jJTjTJjKj%J%TkJjTKJjTLmK%Tj%Lk%J%kA2
$$ 11 11 10 10 12 9 11 11 12 12 11 11 11 11 12 12 11 12 13 12 11 12 11 13 12 12 13 13 13 11 12 11 10 12 13 12 11 14 10 12 12 12 11 11 14 12 12 13 13 11 12
4053.5185287738A3k%TjLkJjJj%KJlL%kJ%UkK%kJ%JTk%TjJKj%jKjk%L%k%VKkA1
$$ 13 11 11 11 10 13 11 12 11 12 11 11 13 14 11 14 14 12 13 13 13 13 11 13 13 11 12 12 13 14 12 12 12 11 12 14 13 13 12 14 13 11 11 14 14 12 12 12 12 12 14 12 11
4040.2168287738A4k%J%TJj%jKjJj%Tj%TJ%JTlJjKj%Kk%TjK%Tk%J%kMkjK%jkA4
$$ 14 12 12 13 13 13 14 13 13 12 14 13 14 13 13 13 12 12 12 13 13 14 15 12 13 12 14 13 13 15 13 13 13 12 14 14 14 12 12 13 13 11 15 13 12 14 14 13 11 14
4027.6679497376A5j%jLjk%TKkKkJkJKk%KkTMj%Uj%K%TkJ%j%JUjTJTkTK%jKjA4
$$ 15 14 14 13 16 15 13 13 13 15 13 15 13 14 12 13 15 13 13 15 13 11 15 14 14 14 14 13 13 15 15 15 13 14 14 13 13 14 15 16 15 14 15 16 14 12 14 14 13 15 14 14
4014.61720781A5%TJjTK%Tkj%LjTJTjJ%jJ%j%j%UJ%TjKjJKjJj%JjKJNOJ1K0I5
$$ 15 15 15 16 15 14 16 16 16 14 13 13 16 15 14 15 16 15 16 16 15 16 16 15 15 14 14 14 14 15 15 15 14 16 15 16 18 17 18 17 17 18 17 19 20 25 31 42 62 95
4002.0683287738A29K0mk5l7k9k0j0njl%Kk%JmJT%jJT%jTJ%JjJjJjJ%VK%kjLA7
$$ 129 149 145 120 83 54 34 24 19 18 15 15 17 15 15 16 12 13 14 14 13 14 15 15 14 13 14 14 15 14 15 14 15 14 15 15 15 15 15 17 17 15 14 17 17
3990.7744287738A7JjKkKJLRJ4J2Jj4j3qmkj%jUJLj%TJkJjJ%TJ%ULKNJ4J3PnD0
$$ 17 18 17 19 17 19 20 23 32 46 58 59 45 32 24 20 18 17 17 16 15 14 15 18 17 17 17 18 16 17 16 17 17 17 18 18 18 18 21 23 28 42 55 62 57 40
3979.2294497376B8njl%kJkK%kKjJjJ%kKJkJKjTJ%j%JjKJkJj%TK%jLjk%MKjPD2
$$ 28 23 22 19 19 17 18 16 18 18 16 18 17 18 17 18 18 16 18 19 17 18 20 19 18 19 19 18 18 19 18 20 21 19 20 19 19 19 21 21 20 23 22 20 20 24 26 25 32 42
3966.6806707015G1M2L5Qk9m3l2j9j0jUkJTkJKj%JUj%JKTMTJ4L5M1L2nl6m2k8C3
$$ 71 113 148 156 127 84 52 33 23 22 21 20 18 19 20 18 19 21 20 20 21 22 23 22 22 23 25 27 31 35 49 84 125 157 152 116 74 46 33
3956.8926287738B4kj%j%kJ%Kj%JT%jJj%kJKkKj%TJkLk%TJ%JTkJjTK%Tj%K%jB4
$$ 24 22 21 21 20 20 18 19 19 21 20 20 21 22 22 21 22 21 21 19 20 22 20 22 21 21 21 22 20 23 21 21 21 22 22 23 24 22 23 22 21 23 23 23 22 22 24 24 23 24
3944.3437497376B3Lj%J%KjT%jKJTjJjlKJjJkJlJjKj%K%J%lJjJ%J%UJj%TJkJB8
$$ 23 26 25 25 26 26 28 27 26 26 25 27 28 29 28 29 28 25 27 28 27 28 26 27 24 25 24 26 25 25 27 27 28 28 25 26 25 26 26 27 27 27 27 28 27 27 27 28 26 27 28
3931.54390781B9jTKkKjJTlKJj%Tj%JT%jJKj%jJT%TJTKkTL%KkKjJjJ%jJKkC8
$$ 29 28 27 29 27 29 28 29 30 27 29 30 29 29 29 28 28 29 30 30 29 30 32 31 31 30 31 32 32 32 33 34 36 34 32 35 35 37 35 37 36 37 36 37 37 36 37 39 37 38
3918.99510781C7jK%JkKj%KTkjK%K%jJ%jJjkKkKj%Kj%K%J%TKj%J%K%TjJUjE0
$$ 37 36 38 38 39 37 39 38 38 40 42 40 39 41 41 43 43 42 43 43 42 43 42 40 42 40 42 41 41 43 42 42 44 44 45 45 45 47 46 46 47 47 49 49 49 48 49 50 51 50 50
3906.1953497376D9%K%K%TJUkjJU%KkJj%L%TKT%L%KJTK%JTKM%KL%LKNPJ3L3M2B22
$$ 49 49 51 51 53 53 53 54 55 56 54 53 54 55 56 56 58 56 57 56 56 59 59 59 61 63 63 66 66 68 69 70 72 72 73 74 76 80 80 82 85 85 88 90 95 102 115 148 190 222
3893.6464707015B20l3l5k7j4o%OQNM%KjNMOJLKL%ORJ3J2J1K3L8N3M8K2mj0j1C63
$$ 220 187 152 125 111 105 105 111 119 124 128 128 130 129 134 138 144 145 148 150 153 153 159 168 181 193 204 227 265 318 366 388 384 374 363 363
3884.6113497376C88M7O1P7Q9J06J34K07L90P46J884M775O815N800J535m549A1448
$$ 388 435 496 573 662 768 902 1109 1499 2245 4129 8904 15719 21519 23054 18505 11448
3880.3447707015E891l253j351n60k71j36r6o2k5J3L0J9KNK6N9O5O0N8Q4J48I74
$$ 5891 2638 1287 727 456 320 224 162 137 150 180 199 201 206 232 291 356 416 474 558 706 974
3874.82320781A473R51K571N618O984N188k32o055o913m858k678j074m87k27A30
$$ 1473 2424 4995 10613 17597 22785 22553 16498 9585 4727 2049 975 488 261 130
3871.0585707015C2p2l9j0jkj2oNL1N3TL1j2m5m1k3nkJmlT%jJTMKjKTNTMK%Kd3
$$ 32 -40 -79 -89 -90 -92 -104 -110 -105 -74 -21 32 63 51 6 -35 -58 -63 -65 -64 -68 -71 -74 -74 -75 -74 -73 -69 -67 -68 -66 -64 -59 -54 -50 -48 -48 -46 -43
3861.2705287738c5K2L8L6J8j7l9l4j9rkjKk%jJK%TkL%L%jKJ%TLJj%k%JjJUjc2
$$ -35 -13 25 61 79 62 23 -11 -30 -39 -41 -42 -40 -42 -42 -43 -42 -40 -40 -40 -42 -39 -39 -36 -36 -37 -35 -34 -34 -34 -31 -30 -31 -31 -33 -33 -32 -33 -32 -31 -30 -31 -32
3850.4784707015c3%KJT%JT%K%lJlJK%kJ%LkJ%JTjKkKjJj%KjJTkJ%JkJ%kJ%jb2
$$ -33 -33 -31 -30 -29 -29 -28 -27 -27 -25 -25 -28 -27 -30 -29 -27 -27 -29 -28 -28 -25 -27 -26 -26 -25 -24 -25 -23 -25 -23 -24 -23 -24 -24 -22 -23 -22 -21 -23 -22 -22 -21 -23 -22 -22 -24 -23 -23 -24 -22
3837.92970781b2J%j%K%VjJT%jLlKj%TjJjL%TjK%TjJTkJjJ%Jj%JkLkJ%TJja7
$$ -22 -21 -21 -22 -22 -20 -20 -20 -20 -20 -21 -20 -19 -19 -20 -17 -20 -18 -19 -19 -19 -20 -19 -20 -17 -17 -17 -18 -16 -16 -16 -17 -16 -15 -17 -16 -17 -16 -16 -15 -16 -16 -15 -17 -14 -16 -15 -15 -15 -14 -15 -17
3824.8788707015a5j%JTLmKkK%J%jJjJj%JTKj%KJjV%jTJTjJjJ%TJj%UJ%kJjTKa1
$$ -15 -16 -16 -15 -14 -11 -15 -13 -15 -13 -13 -12 -12 -13 -12 -13 -12 -13 -13 -12 -11 -9 -10 -10 -8 -7 -8 -9 -10 -11 -11 -12 -13 -12 -11 -12 -11 -12 -11 -11 -11 -10 -11 -11 -11 -11 -10 -10 -12 -11 -12 -13 -11 -11
3811.3261707015a0j%JjK%Tk%TJ%jKjJj%KjkJU%j%VjKjJ%JkJjJ%kKTk%K%TKlf
$$ -10 -11 -11 -10 -11 -9 -9 -9 -11 -11 -11 -10 -10 -11 -9 -10 -9 -10 -10 -8 -9 -11 -10 -9 -8 -8 -9 -9 -9 -9 -9 -10 -8 -9 -8 -8 -7 -9 -8 -9 -8 -8 -10 -8 -6 -8 -8 -6 -6 -6 -4 -7 -6
3798.0243707015g%Kj%TJT%JKJPJ3L4M0L1kl6l9k8j4olkj%jK%k%K%kJTK%j%NA
$$ -7 -7 -5 -6 -6 -6 -5 -4 -4 -3 -1 0 7 20 54 94 125 123 87 48 20 6 0 -3 -5 -6 -6 -7 -5 -5 -7 -7 -5 -5 -7 -6 -5 -3 -3 -4 -4 1 1
3787.2324287738A0J9L8M2K4j4m1l9k4j2mljkKlJKj%TjTJT%j%Jj%LjT%jJT%UJe
$$ 10 29 67 109 133 119 78 39 15 3 -1 -4 -5 -7 -5 -8 -7 -5 -6 -6 -6 -7 -8 -7 -6 -6 -7 -7 -6 -7 -7 -4 -5 -6 -6 -7 -6 -5 -5 -5 -5 -4 -5
3776.4404707015ekKj%UJ%TjJjJL%k%jJk%JjKkJkMj%Uj%JjJKjT%j%TjLj%Tj%e
$$ -5 -7 -5 -6 -6 -6 -6 -5 -5 -5 -6 -5 -6 -5 -2 -2 -4 -4 -5 -4 -6 -6 -5 -6 -4 -6 -5 -7 -3 -4 -4 -4 -4 -5 -5 -4 -5 -4 -2 -3 -4 -4 -5 -5 -5 -6 -3 -4 -4 -4 -5 -5 -5
3763.1386707015ejJU%TlLkJjJ%J%J%j%kJ%KjTJjJ%j%Tj%JT%jKjkKlK%Jj%Kjb
$$ -5 -6 -5 -4 -3 -3 -3 -6 -3 -5 -4 -5 -4 -4 -3 -3 -2 -2 -3 -3 -5 -4 -4 -2 -3 -4 -3 -4 -3 -3 -4 -4 -4 -5 -5 -4 -3 -3 -4 -2 -3 -5 -3 -6 -4 -4 -3 -4 -4 -2 -3 -2
3750.0878497376c%K%j%k%J%j%L%k%JTkJTjkJ%J%kK%JkKlKjKJmKJk%J%Tj%J%a
$$ -3 -3 -1 -1 -2 -2 -4 -4 -3 -3 -4 -4 -1 -1 -3 -3 -2 -1 -3 -2 -1 -2 -4 -3 -3 -2 -2 -4 -2 -2 -1 -3 -1 -4 -2 -3 -1 0 -4 -2 -1 -3 -3 -2 -2 -2 -3 -3 -2 -2 -1
3737.2880916653cJjJjJlMkJ%VJjT%TJ%JTj%JjJkJ%jKlJT%j%Jj%J%TjJTkJ%kb
$$ -3 -2 -3 -2 -3 -2 -5 -1 -3 -2 -2 -2 -2 -2 -1 -2 -3 -3 -3 -2 -2 -1 0 -1 -1 0 -1 0 -2 -1 -1 -2 0 -3 -2 -1 -1 -2 -2 -1 -2 -2 -1 -1 -1 -2 -1 0 -2 -1 -1 -3 -2
3723.9863707015akJUj%TjKj%j%Lk%JTjT%j%TJ%jJkJLljJT%JkJKkJjJk%KkJ%a
$$ -1 -3 -2 -1 0 -1 -1 -1 -2 0 -1 -1 -2 -2 1 -1 -1 0 1 0 -1 -1 -2 -2 -2 -1 -1 -2 -1 -3 -2 1 -2 -3 -2 -1 -1 0 -2 -1 1 -1 0 -1 0 -2 -2 0 -2 -1 -1 -1
3710.9355497376b%JT%TjTLkJjJkJ%KjlKjTK%JjTJ%JjKlKjKkK%lKj%jK%j%JTka
$$ -2 -2 -1 0 0 0 -1 -2 1 -1 0 -1 0 -2 -1 -1 1 0 -3 -1 -2 -3 -1 -1 0 -1 -2 -1 -1 0 -1 1 -2 0 -1 1 -1 1 1 -2 0 -1 -1 -2 0 0 -1 -1 0 1 -1 -1
3697.8847287738@%jJ%kjNkjJ%jJTkK%j%TjKJjUJTjkLj%VJk%JTj%JjKk%JjT%@
$$ 0 0 -1 0 0 -2 -3 2 0 -1 0 0 -1 0 1 -1 1 1 0 0 0 -1 1 2 1 0 -1 0 1 0 -2 1 0 0 0 0 0 1 -1 -1 0 1 0 0 1 0 2 0 0 1 0 -1 -1 0
3684.3320497376AJlKkJ%j%Kj%UJj%JjTJTjJULjUkJk%TjJ%JkKjJKkjJjJKTJ%C
$$ 1 2 -1 1 -1 0 0 -1 -1 1 0 0 0 0 1 0 0 1 0 -1 0 1 0 1 2 3 6 5 4 3 1 2 0 0 0 -1 0 0 1 -1 1 0 1 3 1 0 1 0 1 3 5 6 6 3
3670.7793497376AJjJjT%TJ%j%J%WjJj%LjlJTjJ%Uj%Kk%JTjkK%jJj%K%kJTjJA
$$ 1 2 1 2 1 0 0 0 1 1 0 0 1 1 1 1 1 1 0 1 0 0 3 2 -1 0 1 0 1 1 1 1 0 0 2 0 0 1 2 1 -1 1 1 0 1 0 0 2 2 0 1 2 1 2 1
3656.97560781aJ%JTkKjTJkLkJKk%UJ%TJjT%TJ%UkJ%TJ%Tj%Jk%K%TkLjT%JB
$$ -1 0 0 1 2 0 2 1 0 1 -1 2 0 1 3 1 1 1 1 2 2 2 3 2 1 1 1 2 2 2 2 0 1 1 1 2 2 2 1 1 2 0 0 2 2 2 0 3 2 1 1 2 2
3643.67380781B%UjJ%YkJT%kJ%JkJT%JkLjkLk%J%kjJTjJKk%jJTj%XJj%Uj%D
$$ 2 2 2 2 1 2 2 2 2 2 2 2 2 0 1 2 2 0 1 1 2 0 1 2 2 3 1 4 3 1 4 2 2 3 3 1 0 1 2 1 2 4 2 2 1 2 3 2 2 2 2 2 2 2 3 2 2 2 2 1 1 4
3628.11330781B%jK%TJlJTjTL%lJKj%kJT%Jkj%TJ%TK%kJ%j%TJj%K%j%jTJ%B
$$ 2 2 1 3 3 3 4 1 2 3 2 1 4 4 1 2 4 3 3 1 2 3 3 4 2 1 1 1 2 2 2 4 4 2 3 3 2 2 2 3 2 2 4 4 3 3 2 1 2 2 2
3615.3134497376B%Jj%K%jlKJTkJTk%JjJjJTlK%WkLj%jKjTJj%J%JjJj%JkJ%UJB
$$ 2 2 3 2 2 4 4 3 0 2 3 4 2 3 4 2 2 3 2 3 2 3 4 1 3 3 3 3 3 3 1 4 3 3 2 4 3 2 3 2 2 3 3 4 3 4 3 3 4 2 3 3 3 3 4 2
3601.2588287738D%j%jKj%j%KjTJT%TjT%jKJj%jJj%J%JkKkjJKkJ%UKkTLjTK%C
$$ 4 4 3 3 2 4 3 3 2 2 4 3 2 3 4 4 4 3 2 2 1 3 4 3 3 2 3 2 2 3 3 4 2 4 2 1 2 4 2 3 3 3 3 5 3 1 4 3 2 4 4 3
3588.20800781DjKj%TjJkKjJj%UKlKjJ%j%KkjKkJ%TJ%kJTlK%jK%kLk%jJj%D
$$ 4 3 5 4 4 4 3 4 2 4 3 4 3 3 3 3 5 2 4 3 4 4 3 3 5 3 2 4 2 3 3 3 4 4 2 3 4 1 3 3 2 4 4 2 5 3 3 2 3 2 2 4
3575.1572497376C%TJTlKjJ%jKjJjJjT%VKkJKkj%K%kJ%YJkKk%K%TlJ%TjJ%TJC
$$ 3 3 3 4 5 2 4 3 4 4 3 5 4 5 4 5 4 3 3 3 3 3 5 3 4 6 4 3 3 5 5 3 4 4 4 4 4 4 4 4 5 3 5 3 3 5 5 5 2 3 3 3 2 3 3 3 4 3
3560.6005707015B%JTjJkK%jTK%j%K%TJmKkLlMljKJkJjJ%JkJ%VjK%kJ%j%K%TkC
$$ 2 2 3 4 3 4 2 4 4 3 2 4 4 3 3 5 5 5 6 2 4 2 5 2 6 3 2 4 5 3 4 3 4 4 5 3 4 4 4 4 4 3 5 5 3 4 4 3 3 5 5 5 3 3
3547.04790781C%J%Uj%TKkK%j%J%Tj%j%KJl%jJKjJjKlKJlJ%KkKkJ%kJ%jJTlE
$$ 3 3 4 4 4 4 3 3 3 5 3 5 5 4 4 5 5 5 4 4 3 3 5 6 3 3 2 3 5 4 5 4 6 3 5 6 3 4 4 6 4 6 4 5 5 3 4 4 3 4 5 2 5
3533.7460916653Ej%JjTJjJK%j%Tj%TJj%jJTkKj%J%kJjLkJk%KlJT%TJkK%UJkD
$$ 5 4 4 5 4 3 4 3 4 6 6 5 5 5 4 4 4 5 4 4 3 4 5 3 5 4 4 5 5 3 4 3 6 4 5 3 3 5 2 3 4 4 4 5 3 5 5 5 5 6 4 4
3520.6953497376EjKj%jTJT%jTK%jJTk%TJjJkKJ%Tj%UjJj%TJ%J%k%TKk%J%TjD
$$ 5 4 6 5 5 4 3 4 5 5 4 3 5 5 4 5 6 4 4 4 5 4 5 3 5 6 6 6 5 5 5 5 4 5 4 4 4 5 5 6 6 4 4 4 6 4 4 5 5 5 4 4
3507.6445287738CLj%UjTJKjTJlL%TJkjK%JjTJ%jTKjJkLkKjTJTkJjLkj%JTjKD
$$ 3 6 5 5 5 5 4 3 4 6 5 4 5 2 5 5 5 6 4 3 5 5 6 5 4 5 5 4 3 5 4 5 3 6 4 6 5 4 5 6 4 5 4 7 5 4 4 5 6 5 7 4
3494.59380781DK%jT%J%Jj%JmMkJ%Jj%UjJlLJjJj%jJ%Tj%JjKkJKkj%JKjkJF
$$ 4 6 6 5 4 4 5 5 6 5 5 6 2 6 4 5 5 6 5 5 5 5 4 5 2 5 6 5 6 5 5 4 5 5 5 4 4 5 4 6 4 5 7 5 4 4 5 7 6 4 5 6
3481.5429707015DJT%k%TJjK%j%Kk%TjJ%J%jJj%UKmLjTJ%TJjJjkL%kJ%TJjJjF
$$ 4 5 6 6 4 4 4 5 4 6 6 5 5 7 5 5 5 4 5 5 6 6 5 6 5 5 5 5 7 3 6 5 4 5 5 5 6 5 6 5 3 6 6 4 5 5 5 6 5 6 5 6
3468.4922287738D%J%TJ%kKkKjJkJTj%UjJT%jTJj%TjKJlKJ%kJKj%k%Kj%TJjJG
$$ 4 4 5 5 5 6 6 4 6 4 6 5 6 4 5 6 5 5 5 5 4 5 6 6 5 4 5 4 4 4 3 5 6 3 5 6 6 4 5 7 6 6 4 4 6 5 5 5 6 5 6 7
3455.44140781DK%jTJjKjJj%Jj%kKJTjTJkJT%k%J%TkKTlJKkJjJjJTkj%Kj%E
$$ 4 6 6 5 4 5 4 6 5 6 5 5 6 5 5 3 5 6 7 6 5 6 4 5 6 6 4 4 5 5 5 3 5 7 4 5 7 5 6 5 6 5 6 7 5 4 4 6 5 5 5
3442.6416497376D%TJjJjJjJjKjJjTLjTJlJK%jJTk%JmL%TKk%jK%TkJT%jJ%jJF
$$ 4 4 4 5 4 5 4 5 4 5 4 6 5 6 5 4 7 6 5 6 3 4 6 6 5 6 7 5 5 6 2 5 5 5 7 5 5 4 6 6 6 4 5 6 6 5 6 6 5 6 6
3429.84180781F%TkJ%J%UjJj%JkK%j%JT%kjJTjKk%TJT%kJjKk%JjJ%TKk%TjH
$$ 6 6 6 4 5 5 6 6 6 6 5 6 5 5 6 4 6 6 5 5 6 7 7 5 4 5 6 5 7 5 5 5 6 7 7 5 6 5 7 5 5 6 5 6 6 6 8 6 6 6 5 8
3416.7909707015E%J%TjJ%TjKj%jLk%jJ%Jj%TkJKJlLlKlJ%J%j%TJjJ%J%j%UjF
$$ 5 5 6 6 6 5 6 6 6 5 7 6 6 5 8 6 6 5 6 6 7 6 6 6 4 5 7 8 5 8 5 7 4 5 5 6 6 5 5 5 6 5 6 6 7 7 6 6 6 6 5 6
3403.7402287738GlKkK%JkKkK%j%TJjTJTkJjJ%jJjJ%UjK%j%Jk%JjJT%VjJjJ%F
$$ 7 4 6 4 6 6 7 5 7 5 7 7 6 6 6 7 6 5 6 7 5 6 5 6 6 5 6 5 6 6 6 6 5 7 7 6 6 7 5 5 6 5 6 7 7 7 7 7 6 7 6 7 7 6
3390.1875497376GJkKljKJ%jJkjLk%L%jT%UJj%jK%lLj%KkJk%JT%jJ%TJj%jJjF
$$ 7 8 6 8 5 4 6 7 7 6 7 5 4 7 5 5 8 8 7 6 6 6 6 7 6 6 5 7 7 4 7 6 6 8 6 7 5 5 6 7 7 6 7 7 7 8 7 7 6 7 6 6
3377.1367287738IkJjTKkJ%jJj%TkLjJ%Tj%JjJj%K%jTJTjTJj%TjJjL%kJ%kK%G
$$ 9 7 8 7 6 8 6 7 7 6 7 6 6 6 4 7 6 7 7 7 6 6 7 6 7 6 6 8 8 7 6 7 8 7 6 7 6 6 6 5 6 5 8 8 6 7 7 5 7 7 7
3364.3368707015G%UjJ%XKkjK%jJjJjJkJ%jTK%UJj%TjJjKjkKJ%jTLk%LnKTk%E
$$ 7 7 7 7 6 7 7 7 7 7 7 7 9 7 6 8 8 7 8 7 8 7 8 6 7 7 6 5 7 7 7 7 8 7 7 7 6 7 6 8 7 5 7 8 8 7 6 9 7 7 10 5 7 9 7 7 5
3350.0312497376GjKk%J%JTk%XjJ%TJ%J%kL%kjTJTj%J%JjU%jMj%jlL%TjJTjkG
$$ 7 6 8 6 6 7 7 8 9 7 7 7 7 7 7 7 6 7 7 7 8 8 9 9 7 10 10 8 7 6 7 8 7 7 8 8 9 8 7 6 6 5 9 8 8 7 4 7 7 7 6 7 8 7 5 7
3335.9765287738FLjT%JjJ%jJj%TJ%KkTJKk%TJ%TjTL%kJT%jJkJ%kKjJjKJjT%F
$$ 6 9 8 7 7 8 7 8 8 7 8 7 7 7 8 8 10 8 6 7 9 7 7 7 8 8 8 7 6 9 9 7 8 9 9 8 9 7 8 8 6 8 7 8 7 9 10 9 8 8 6
3323.1767707015A0mLkjKTmK%UJkJ%TjJkJ%TJ%J%jJj%kJKj%UjJKkjJTk%JkLlG
$$ 10 6 9 7 6 8 10 6 8 8 8 8 9 7 8 8 8 7 8 6 7 7 7 8 8 9 9 8 9 8 8 6 7 9 8 8 8 8 7 8 10 8 7 8 9 7 7 8 6 9 6 7
3310.1259497376Ij%Kk%UjJ%XJjTJ%TkJUjT%K%k%JTjT%Kj%jJ%JTjTKkJjTJ%JH
$$ 9 8 8 10 8 8 8 8 7 8 8 8 8 8 8 8 9 8 7 8 8 8 6 7 8 9 8 7 7 9 9 7 7 8 9 8 7 7 9 8 8 7 8 8 9 10 9 8 10 8 9 8 7 8 8 9 8
3295.8203287738H%jKjJ%UjUKJkJT%TkJUj%kK%jJLmJkLj%Jj%kKjJ%Vj%J%UKjA0
$$ 8 8 7 9 8 9 9 9 9 8 7 6 8 9 7 8 9 9 9 7 8 9 10 9 9 7 9 9 8 9 12 8 9 7 10 9 9 10 9 9 7 9 8 9 9 9 9 9 8 8 9 9 9 9 11 10 10
3281.5146287738GJT%Jk%TJ%K%kJkJjK%jTKj%WJj%Jj%UJTj%TLl%jJ%jKj%jJ%A2
$$ 7 8 9 9 10 8 8 8 9 9 11 11 9 10 8 9 8 10 10 9 8 10 9 9 9 9 9 9 10 9 9 10 9 9 9 9 10 11 10 10 10 13 10 10 9 10 10 9 11 10 10 9 10 10 12
3267.7109707015A0%j%J%KlLj%k%KjTJ%UJ%TjJ%j%jJTkJjLkJjJTkJT%LjKj%mA0
$$ 10 10 9 9 10 10 12 9 12 11 11 9 9 11 10 9 10 10 10 10 11 11 11 10 11 11 10 10 9 10 11 9 10 9 12 10 11 10 11 12 10 11 12 12 15 14 16 15 15 11 10
3254.91110781A1jJjJjJ%UJ%Jj%J%JKkJjKMOKT%TJLjmTljJjlkUKj%TJK%L%A7
$$ 11 10 11 10 11 10 11 11 11 11 12 12 13 12 12 13 13 14 16 14 15 14 16 20 26 28 30 30 30 31 34 33 29 25 22 21 22 21 18 16 14 12 14 13 13 13 14 16 16 19 19 17
3241.8603707015A9jKOPNKjmjRJ2J1PLKmj0nqkPL6Q6J08P5qj07j02o8l5j3omA7
$$ 19 18 20 26 33 38 40 39 35 34 43 55 66 73 76 78 74 64 59 51 49 56 92 178 286 361 353 246 144 76 41 28 22 18 17
3233.0761287738A5%lj%K%j%j%kKjJjJ%UJ%lK%TJkJTjJ%Wj%J%jJjT%JKjTJT%A3
$$ 15 15 12 11 11 13 13 12 12 11 11 9 11 10 11 10 11 11 11 11 12 12 9 11 11 11 12 10 11 12 11 12 12 12 12 12 12 11 11 12 12 11 12 11 10 10 11 13 12 11 12 13 13 13
3219.5234497376A3jK%JT%TjKkKlj%TKj%j%jT%JUj%JjJkKL%Vk%jMkT%JjlJ%JA2
$$ 13 12 14 14 15 16 16 16 15 17 15 17 14 13 13 13 15 14 14 13 13 12 11 11 12 13 14 13 13 14 13 14 12 14 17 17 17 17 17 15 15 14 18 16 14 14 15 14 11 12 12 13 12
3206.2216497376A2%K%kKlKJj%TkJT%J%KjJ%Tj%TjJUkj%kKJkJjKjJk%jKjJKJA8
$$ 12 12 14 14 12 14 11 13 14 13 13 13 11 12 13 13 14 14 16 15 16 16 16 15 15 15 14 15 16 17 15 14 14 12 14 15 13 14 13 15 14 15 13 13 12 14 13 14 16 17 18
3193.42190781A9kjTJKk%j%KJj%Tj%jJk%KjJ%KkJkJ%jJ%JkLkKk%JkKkjJ%jA5
$$ 19 17 16 15 16 18 16 16 15 15 17 18 17 17 17 16 16 15 16 14 14 16 15 16 16 18 16 17 15 16 16 15 16 16 17 15 18 16 18 16 16 17 15 17 15 14 15 15 14 15
3180.8730287738A5%XL%jT%jMkJj%Tj%jL%kKjKJjTJl%J%K%UKkJKjTKjTJkT%TJA7
$$ 15 15 15 15 15 15 15 18 18 17 16 16 15 19 17 18 17 17 17 16 16 15 18 18 16 18 17 19 20 19 18 19 16 16 17 17 19 19 19 19 21 19 20 22 21 20 22 21 20 21 19 17 17 17 18 17
3166.8183707015A6%TJ%J%UkL%kMKPJ2J5J1Mmrj2j0pokUJjUK%jKj%TJ%KUJTkB8
$$ 16 16 16 17 17 18 18 18 18 16 19 19 17 21 23 30 42 57 68 72 68 59 47 37 30 24 22 20 18 19 18 17 16 18 18 17 19 18 18 18 19 19 21 23 25 26 27 25 28
3154.5204707015C8J3J5QjMOLKj0j4pnjlnpMJ0J1QKkqj1oj%klkOJ4K0TQqk2j3F6
$$ 38 51 66 74 73 77 83 86 88 78 64 57 52 51 48 43 36 40 50 61 69 71 69 61 50 44 43 43 41 38 36 42 56 76 96 104 96 74 61 66
3144.4814497376G8Qqj8j6j2plTJ%TjU%J%KlJ%TJ%JkjKJk%J%TJjKk%Kk%J%jJB1
$$ 78 86 78 60 44 32 25 22 19 20 20 20 19 18 17 17 18 18 20 17 18 18 18 19 19 20 18 17 19 20 18 18 19 19 19 20 19 21 19 19 21 19 19 20 20 19 20 21
3132.4345287738B1LkJKj%j%jTK%kJ%UlJLkJj%VKJjKjk%TjKkL%jTLjTJT%UJjB5
$$ 21 24 22 23 25 24 24 23 23 22 21 23 23 21 22 22 22 22 19 20 23 21 22 21 21 21 21 21 23 24 23 25 24 22 22 22 21 23 21 24 24 23 22 25 24 23 24 25 25 25 25 26 25 25
3118.8818497376B6%jTLjJKTjMTK%NKLOJ2K6N3Q6J14J24Q7J5o4j15j18r9o6l5E7
$$ 26 26 25 24 27 26 27 29 31 30 34 38 40 40 45 47 50 56 68 94 147 233 347 471 558 573 509 394 276 177 111 76 57
3110.5996497376D9mTlJljUJKMLTMPNM%kTNJ1J6PMqpkMOJnqTkNUlqnqKMJ1RJ0A13
$$ 49 45 41 38 39 36 35 34 33 34 36 40 43 46 50 57 62 66 66 64 62 67 78 94 101 105 97 90 88 92 98 99 94 86 78 76 81 86 91 88 80 75 67 69 73 84 93 103 113
3098.3017497376A33M0O7J10J37J29P9qr4j36j28j00o5l2j9j4Tj3j6qonjTm%C1
$$ 133 173 240 350 487 616 695 687 593 457 329 229 164 132 113 99 85 72 56 48 42 37 36 35 31 31 31
3091.52540781C2%TJ%JkjKjK%j%k%TJT%kJj%Lj%jJjkJ%J%XLjTKj%TjJTkjJC3
$$ 32 32 32 33 33 34 32 31 33 32 34 34 33 33 31 31 31 32 33 33 31 32 31 31 34 33 33 32 33 32 30 31 31 32 32 32 32 32 32 32 35 34 33 35 34 34 34 33 34 35 33 32 33 33
3077.9726287738C2Kk%JKjTkKJ%J%LkL%jKlJU%MjJLPJ3J9K2K0J3mj4k1Tj6j3D9
$$ 32 34 32 32 33 35 34 33 31 33 34 34 35 35 38 36 39 39 38 40 37 38 39 40 40 44 43 44 47 54 67 86 108 128 141 137 123 102 81 65 52 49
3067.4316497376D5%j%Jj%J%TKkJT%TJTKTNOLKJNMPJolTjKj%JOUJmTJPKjmlQA15
$$ 45 45 44 44 45 44 44 45 45 45 47 45 46 47 47 47 48 49 51 53 58 64 67 69 70 75 79 86 87 81 78 75 74 76 75 75 76 82 88 94 95 91 87 88 95 97 96 92 89 97 115
3054.63180781A40K7TL2K8J9kk7l5l4k3j3romjT%jOJ8K9K8J0ok0j8pJMJTjA72
$$ 140 167 194 226 254 273 271 244 209 175 152 139 130 124 120 119 118 118 117 123 141 170 198 208 202 182 164 157 158 162 163 164 163 172
3046.0986287738A79Jj0j6j1jQNjonjJTlnkLTPJ1RJ4J0kj6j9j5plJKOKTOQJ0A77
$$ 179 180 170 154 143 142 150 155 154 148 143 142 143 144 141 136 134 137 140 147 158 167 181 191 189 173 154 139 132 129 130 132 138 140 142 148 156 166 177
3036.3105707015A90J5J3J5J2QOKRK1L4L6N3N1M7M5J6K2M7O6R9J33J82J75L9A269
$$ 190 205 218 233 245 253 259 261 270 291 325 361 414 465 512 557 573 595 642 708 807 940 1122 1297 1336 1269
3029.78520781A125j11l6M4K12M34O72J089J859K377K666J525m58j684k329F347
$$ 1125 1014 978 1022 1234 1668 2340 3429 5288 7665 10331 11856 11398 9714 7385 6347
3025.76950781G471K631K619K018k92j818k624l062j802q01j78M57J065J776I735
$$ 7471 10102 12721 14739 14447 12629 10005 6943 5141 4340 4162 4619 5684 7460 9735
3022.0048707015A1681J386J86l56k80p5K16l01r39j171j148j101p54k54Q84I589
$$ 11681 13067 13253 12897 12617 12542 12758 12457 11518 10347 9199 8098 7344 7090 7974 9589
3017.9892497376A1732K460K212P11j025k778l705l160k128r30j47K14k0m09B363
$$ 11732 14192 16404 17115 16090 13312 9607 6447 4319 3389 3242 3456 3436 3027 2363
3014.2246287738A636m93k43r1nL6J19J80J56nj87k46j39k8J2j9k1L7Q5P5J2H02
$$ 1636 1143 900 809 804 840 959 1139 1295 1290 1103 857 718 690 702 683 662 699 784 859 871 802
3008.7031497376F90r8o6m5k9j8j6qoJ4L3N5N4Km5p7q3n6m4l5Tl4k0qKOTJ4J2A75
$$ 690 592 526 481 452 434 418 410 404 418 451 506 560 562 517 440 357 301 257 222 187 153 133 125 127 133 139 153 165 175
3001.17380781A78mkT%NJ4J7K7K8J8J5KMJ4L7N6P1O8P2P8J43L28P58J514K553I476
$$ 178 174 172 170 170 175 189 206 233 261 279 294 296 300 314 351 407 478 546 618 696 839 1167 1925 3439 5992 9476
2994.3974497376A3329L070J218j156l212l853l457k533j473p62l57j82j19r6C33
$$ 13329 16399 17617 16461 13249 9396 5939 3406 1933 1171 814 632 513 417 333
2990.6328287738B65m0j8jNLjpj0TpqnOPTJ%JMJ2J8J6NJ2L4O8R9R2N6j2l1pL4G03
$$ 265 225 207 206 211 214 213 206 196 186 179 171 166 172 179 186 187 187 188 192 204 222 238 243 255 289 357 456 548 604 592 561 554 588 703
2981.8486707015I08K23J52mr5n9PJ07K56N75J183K149L287M152M142K988R62A9398
$$ 908 1131 1283 1279 1184 1125 1132 1239 1495 2070 3253 5402 8689 12841 16983 19971 20933 19398
2977.3310287738A5947m252l549j930n41K9J2k74o92k25N82J244J763K864N615B4088
$$ 15947 11695 8146 6216 5675 5704 5716 5442 4750 4525 5107 6351 8114 10978 16593 24088
2973.31540781C0367J633m437o962m368J54L515M865L842J527k030m672o283A0723
$$ 30367 32000 27563 20601 16233 16387 19902 24767 28609 30136 28106 23434 17151 10723
2969.8017497376F512k226n80M33J650L380L978L090M10k315k436j348J43J740A4822
$$ 6512 4286 3706 4139 5789 9169 13147 16237 16647 14332 11896 10548 10691 12431 14822
2966.03710781A5790j486l269l480k362j197n82n61m63r6N0l2o9J16M35O68C881
$$ 15790 14304 11035 7555 5193 3996 3414 2853 2390 2294 2344 2312 2243 2359 2794 3462 3881
2961.7705287738C662n18p10o49m70l69k27j24m4L2J32J98J87Q4J2J13K75L64B242
$$ 3662 3144 2434 1785 1315 946 719 595 551 583 715 913 1100 1184 1196 1309 1584 1948 2242
2957.00200781B298k03m11m45k90j22rM5R4J24Q1j5j56k15j62q1k1J3PpoK2E86
$$ 2298 2095 1684 1239 949 827 818 863 957 1081 1162 1147 991 776 614 533 512 525 532 525 519 541 586
2951.2294497376F79J03M9l1j32j66j20o9l6k1j1PJ2Rkj0j2j0j4j3j9j2%JTj0A60
$$ 679 782 831 800 668 502 382 313 277 256 245 252 264 273 271 261 249 239 225 212 193 181 181 182 183 173 160
2944.45310781A46j3j0l%PJ2TRMmj6Tj3mjMKLKNPJqj5TpKRNmrj1lKMT%nqoF7
$$ 146 133 123 120 120 127 139 151 160 164 160 144 128 115 111 110 114 116 119 121 126 133 134 126 111 96 89 91 100 105 101 92 81 78 80 84 88 88 83 75 69 67
2933.9121287738G0KkmnLjJLORTONJT%Tj%LKkmJJ5K8L8L5K5kk6m6m0j7NJ8K1A78
$$ 70 72 70 66 61 64 63 64 67 73 82 91 97 102 103 104 104 104 103 103 106 108 106 102 103 118 146 184 219 244 242 216 170 130 113 118 136 157 178
2924.12400781B01K1J1Okqk1k0j2kKjJTj1k6k2j9j1rlJPJ0J3J4J9J8TRjj3A53
$$ 201 222 233 239 237 229 208 188 176 174 176 175 176 177 166 140 118 99 88 79 76 77 84 94 107 121 140 158 176 185 184 171 153
2915.84180781A29j6j1mopTol%MNPL%mpTjLJ1K6P4J70J79J20r4j82j46r7m4G1
$$ 129 113 102 98 92 85 78 72 69 69 73 78 85 88 88 84 77 70 69 72 83 109 183 353 532 652 558 376 230 133 89 71
2907.8105707015F1lnlkjkTjJKL%klkTjJMONRQJ7K2K3K0Rpj6k5k0j0KLjklkTrF1
$$ 61 58 53 50 48 47 45 43 42 43 45 48 48 46 43 41 39 38 39 43 49 54 63 71 88 110 133 153 162 155 139 114 94 84 86 89 88 86 83 81 79 70 61
2897.0185287738E4%PRJ3O%TKO%ljMQTLmpnMJ0KTonkUpj0j3oKQJ5J8J9K2J1oA33
$$ 54 54 61 70 83 89 89 89 91 97 97 94 93 97 105 113 116 112 105 100 104 114 116 118 112 107 105 103 101 94 84 71 65 67 75 90 108 127 149 160 154 133
2886.4775497376A06k3qKNL%KLmj3j7pjMJmnomKNJ1J0Mnqj1oKJ0J2Pnj3j2ToA8
$$ 106 83 75 77 82 85 85 87 90 86 73 56 49 48 52 53 49 44 38 34 36 41 52 62 66 61 53 42 36 38 48 60 67 62 49 37 25 19 18
2876.68950781A7j%TKTjTkUK%jkK%j%Tj%UJjTJ%j%TkjJjKJjkMLT%jojTk%TJG
$$ 17 16 16 16 18 20 19 18 16 14 12 14 14 13 11 13 13 12 12 12 11 11 11 11 12 11 10 11 11 10 10 10 8 7 8 7 9 10 9 7 11 14 17 17 16 10 9 8 6 6 6 7 7
2863.38770781EJjT%jKkJ%WjJjJ%JjTJj%VjJTjT%J%Jk%JKJjJ%LTNJ4J8J2%D7
$$ 5 6 5 4 4 3 5 3 4 4 4 4 4 4 3 4 3 4 4 5 4 3 4 3 3 3 3 3 2 3 4 3 2 2 3 3 4 2 2 3 5 6 5 6 6 9 12 17 31 49 61 61 47
2850.08590781C1j4ol%jTJLNQJ2QKjqrqnj%JLPJ8K2K0Mqk1k0j6qnk%kJjkTKA
$$ 31 17 11 8 8 7 6 7 10 15 23 35 43 45 44 36 27 19 14 13 13 14 17 24 42 64 84 88 80 59 39 23 15 10 8 8 6 7 6 4 2 4 1
2839.2939497376AKJkjJ%KjkJ%TjK%Tj%j%Ll%J%KkK%TJTjU%k%VJ%jJj%WJ%j%A
$$ 1 3 4 2 1 2 2 4 3 1 2 2 2 1 3 3 3 2 2 1 1 4 1 1 2 2 4 2 4 4 4 5 6 5 4 3 3 1 1 1 1 1 2 2 1 2 1 1 1 1 1 1 2 2 1 1 1
2824.9883287738AJjJkJ%kJTkJT%WjJ%KkJ%jKjT%K%kjK%WJkJ%VjKjk%UJ%jJj@
$$ 1 2 1 2 0 1 1 -1 0 1 -1 0 1 1 1 1 1 1 0 1 1 3 1 2 2 1 3 2 1 1 3 3 1 0 2 2 2 2 2 2 3 1 2 2 2 2 2 1 3 2 0 0 0 0 1 1 0 1 0 0
2809.92970781@%TJ%jKj%TjJ%UMJTjTJ%jJTKkjmKlKJT%JTjkjJTjKjJTkJ%jD
$$ 0 0 0 1 1 0 2 1 1 1 0 1 1 1 1 5 6 7 6 5 6 6 5 6 7 9 7 6 2 4 1 3 4 5 5 6 7 6 4 3 4 5 4 6 5 6 7 5 6 6 5 4
2796.8788707015Ek%VjkJUjJKTJ%j%Jl%kjT%WJTjkKkJ%JjTJ%TjJ%TJ%J%jK%UjD
$$ 5 3 3 3 3 3 2 0 1 2 3 2 3 5 7 8 8 7 7 8 5 5 3 2 1 1 1 1 1 1 2 3 2 0 2 0 1 1 2 1 0 1 1 1 0 1 1 1 2 2 3 3 2 4 4 4 4 3 4
2782.07130781CJ%jJj%JlJTjJkKjJT%jJ%NTJ8K3J9Jj8k2j8plkjJK%j%jJjlB
$$ 3 4 4 3 4 3 3 4 1 2 3 2 3 1 3 2 3 4 4 3 4 4 9 14 32 55 74 75 57 35 17 10 7 5 4 5 7 7 6 6 5 6 5 2 2
2770.77730781B%kKJkL%LJ1K0K3J6nk3k1j4oljTJk%JjTJkLjJjJjTJTK%KLJ1D0
$$ 2 2 0 2 3 1 4 4 7 18 38 61 77 72 49 28 14 8 5 4 3 4 2 2 3 2 1 2 0 3 2 3 2 3 2 1 2 3 5 5 7 10 21 40
2759.7343707015F2J0pk2j6j4ml%JlLkKm%Uj%VJTjK%MJ4J7J9J0j5k2j1rmj%JG
$$ 62 72 65 43 27 13 9 6 6 7 4 7 5 7 3 3 3 3 2 2 2 2 2 3 4 3 5 5 9 23 40 59 69 54 32 21 12 8 7 7 8 7
2749.19340781Gk%k%JlJj%TjJjJ%jJK%J%TKJKjJ%j%j%k%jT%k%JT%jJ%WjJjA
$$ 7 5 5 3 3 4 1 2 1 1 1 0 1 0 1 1 0 1 3 3 4 4 4 6 7 9 8 9 9 8 8 7 7 5 5 4 3 3 1 1 2 3 3 2 3 3 3 3 3 3 2 3 2 1
2735.6406287738C%J%JjLjJ%jTJkj%jT%jKJ%jJj%VKkKJlNkJK%TKjkJjklJjKjD
$$ 3 3 4 4 5 4 7 6 7 7 6 5 6 4 3 3 2 1 1 0 2 3 3 2 3 2 2 2 2 2 4 2 4 5 2 7 5 6 8 8 8 10 9 7 8 7 5 2 3 2 4 3 4
2722.3388287738BjJKkJjJjTKkKjJjKj%UjJk%KkjKjJUjK%k%TJjL%k%TK%LlJjF
$$ 2 1 2 4 2 3 2 3 2 1 3 1 3 2 3 2 4 3 3 3 3 2 3 1 1 3 1 0 2 1 2 3 4 3 5 5 3 3 3 4 3 6 6 4 4 4 6 6 9 6 7 6 6
2709.03710781G%TJjJl%JLM%JT%jKJjLjlkKJLJMkJTPJ0J7J4MkOJ6L7M2L5K1B45
$$ 7 7 7 8 7 8 5 5 6 9 13 13 14 15 15 14 16 17 16 19 18 15 13 15 16 19 20 24 22 23 24 31 41 58 72 76 74 80 96 133 175 210 231 245
2697.9941707015B88J13K38M74J374L237L818K749k98l658l538k366j209n04D65
$$ 288 401 639 1113 2487 5724 9542 12291 11993 8335 4797 2431 1222 718 465
2694.2294497376C59o4n2n0l8j6rTj3kJ7M3TL3J5J1N0J34K68N91J853L622L762A2762
$$ 359 295 243 193 155 139 130 121 108 106 123 166 209 242 257 268 318 452 720 1311 3164 6786 10548 12762
2688.2060497376A1215l962l205k074r45m15j91q0n6n1n7m5k0oJqrJJ6L0M0K9B25
$$ 11215 7253 4048 1974 1029 614 423 343 287 236 179 134 114 108 109 101 92 93 109 139 179 208 225
2682.43360781B29RN9J42K69O35J984L404L315J637k013l632k729j699p39E30
$$ 229 238 297 439 708 1343 3327 6731 10046 11683 9670 6038 3309 1610 871 530
2678.41800781C78o9m9m6m5k7j2oj1j0NK8M1L5K1LJ9O7J69L20Q62K426L411A0424
$$ 378 309 260 214 169 142 130 124 113 103 108 136 177 212 233 236 255 322 491 811 1673 4099 7510 10424
2672.3945707015A1216k733l400k385j369n72k84j22o7m9n1m9l3j8j4Tj3pLND7
$$ 11216 8483 5083 2698 1329 757 473 351 284 235 184 135 102 84 70 56 43 36 39 44 47
2667.12400781D6jonklJ%jnkUlNmKljJjKJ%TlJ%J%kL%JljkJ%Jk%JjT%TjJ%A1
$$ 46 45 39 34 32 29 30 30 29 24 22 20 18 15 20 16 18 15 14 15 14 16 17 17 17 14 15 15 16 16 14 17 17 18 15 14 12 13 13 14 12 12 13 12 11 11 11 10 11 11 11
2654.3242287738A0jJ%KlJTj%TkJkJ%jTJK%kjJjJ%kKjLlLlJjKjT%J%kLjJlJ%F
$$ 10 9 10 10 12 9 10 11 10 10 10 8 9 7 8 8 7 6 7 9 9 7 6 7 6 7 7 5 7 6 9 6 9 6 7 6 8 7 6 6 7 7 5 8 7 8 5 6 6 6
2641.7753497376EL%JT%JlJjk%j%KjJ%mMjTJj%Ll%KjTJTjTK%k%UjTK%KkKkJ%E
$$ 5 8 8 9 10 10 11 8 9 8 6 6 5 5 7 6 7 7 3 7 6 5 6 5 5 8 5 5 7 6 5 6 7 6 5 7 7 5 5 5 5 4 3 5 5 7 5 7 5 6 6 5
2628.7246287738EJjKj%jJjKjKkjK%JkJlKj%TjK%jULk%J%TJUK%lJkJjTK%LKJ5D9
$$ 5 6 5 7 6 6 5 6 5 7 6 8 6 5 7 7 8 6 7 4 6 5 5 5 4 6 6 5 4 3 6 4 4 5 5 5 6 7 8 10 10 7 8 6 7 6 5 7 7 10 12 27 49
2615.4228287738G0J0j3k4j8j1lkj%TkjTJT%jJ%TJkLk%KTNJ7K2K0Nj8k2j5j2I
$$ 70 80 67 43 25 14 11 9 8 8 8 6 5 4 5 6 6 5 6 6 6 7 5 8 6 6 8 10 15 32 54 74 79 61 39 24 12 9
2605.8857497376HkjJjT%K%TL%UkKlL%JTLJ1J5K7L0K2kk3k6k5j7nJ%j%LNJ1K1A04
$$ 8 6 5 6 5 4 4 6 6 6 9 9 9 9 7 9 6 9 9 10 11 14 25 40 67 97 119 117 94 68 43 26 21 22 22 21 21 24 29 40 61 104
2595.3447707015B19K25K37J43q3k42k09j35o4l1j3pKJ3J7J0j0k0j8j2omkJkA1
$$ 219 444 681 824 741 499 290 155 91 60 47 40 42 55 72 82 72 52 34 22 16 12 10 11 9 11
2588.81930781IJ%TPNJ1QOJloprqkljJkKJ%JjTJjKLKJTLOJ2K6N1J37K22K12G79
$$ 9 10 10 10 17 22 33 41 47 48 45 39 32 23 15 13 10 9 10 8 10 11 11 12 11 10 11 10 12 15 17 18 19 22 28 40 66 117 254 476 688 779
2578.2783287738F40k33j76j09n1k3j2qlnmlk%ljT%JTkJjkKjTJTjJTkJj%kJKD
$$ 640 407 231 122 71 48 36 28 25 20 16 13 11 11 8 7 6 6 7 8 6 7 6 4 6 5 4 5 6 5 6 7 5 6 5 5 3 4 6 4
2568.23930781FkKlJU%jTKk%TJ%J%WkJ%j%kKJj%UJj%kKJjKkK%j%JjlJKkNlF
$$ 6 4 6 3 4 5 6 6 5 4 6 4 4 4 5 5 6 6 6 6 6 6 4 5 5 4 4 2 4 5 4 4 4 4 5 4 4 2 4 5 4 6 4 6 6 5 5 6 5 2 3 5 3 8 5 6
2554.1845707015Ej%kK%J%jMmL%kJk%JkKkK%Jk%J%TkK%jUK%TjKmJLj%j%J%jKE
$$ 5 4 4 2 4 4 5 5 4 8 4 7 7 5 6 4 4 5 3 5 3 5 5 6 4 4 5 5 5 3 5 5 4 3 2 4 4 4 3 5 1 2 5 4 4 3 3 4 4 3 5 5
2541.1337497376EjMl%j%Kj%TkK%k%KjKk%TJ%TKT%KjkjV%TJkjJTKj%JjKJKJjF
$$ 5 4 8 5 5 4 4 6 5 5 5 3 5 5 3 3 5 4 6 4 4 4 5 5 5 7 9 9 11 10 8 7 6 5 4 4 4 5 3 2 3 4 6 5 5 6 5 7 8 10 11 10 6
2527.8320497376GlJj%JTjJ%Tj%JlNkj%jT%KjkKJK%TjJjJj%JjKJKjV%TjT%kJE
$$ 7 4 5 4 4 5 6 5 6 6 6 5 5 6 3 8 6 5 5 4 3 3 5 4 2 4 5 7 7 7 6 7 6 7 6 6 7 6 8 9 11 10 9 8 7 7 7 6 5 5 3 4 5
2514.5303287738BLjTLJTLJTlk%jl%Uj%TKJjJ%Tk%VjKj%jJjJ%jJT%Tj%J%jJjE
$$ 2 5 4 3 6 7 8 11 12 13 10 8 8 7 4 4 4 4 3 3 3 5 6 5 6 6 6 4 4 4 4 4 3 5 4 4 3 4 3 4 4 3 4 5 5 5 4 4 5 5 4 5 4 5
2500.9775497376F%jT%JkJjJ%kK%KjKJjUJkL%TJ%KkJj%jkj%jJTj%jLTkjKljJE
$$ 6 6 5 4 4 5 3 4 3 4 4 2 4 4 6 5 7 8 7 6 5 6 4 7 7 7 8 8 10 8 9 8 8 7 5 4 4 3 4 5 4 4 3 6 9 7 6 8 5 4 5 5
2487.9267287738EjJTjKTj%Tk%jJ%LTOQ%monoJkjLj%TkJTjTMJ%j%KkJjT%JOPB7
$$ 5 4 5 6 5 7 9 8 8 8 6 6 5 6 6 9 12 18 26 26 22 16 11 5 6 4 3 6 5 5 5 3 4 5 4 3 7 8 8 7 7 9 7 8 7 6 6 7 13 20 27
2475.1269707015C2mqom%UjTKLOTLlolTk%KjTkmK%jJmKJk%UJj%j%KLORMjonlI
$$ 32 28 20 14 10 10 10 10 9 8 10 13 19 25 28 25 19 16 13 11 11 13 12 11 9 5 7 7 6 7 3 5 6 4 4 4 4 5 4 4 3 3 5 8 14 23 27 26 20 15 12 9
2462.0761287738Gjk%J%kJT%J%K%TlJUM%Jk%kUKkKj%K%jLl%jTkJTjJk%JjTLkB
$$ 7 6 4 4 5 5 3 4 5 5 6 6 8 8 8 5 6 7 8 12 12 13 11 11 9 7 5 7 5 7 6 6 8 8 7 10 7 7 6 5 3 4 5 4 5 3 3 4 3 2 5 3 2
2448.7744287738DJkJT%UJ%kJkJjJj%VKkKlKjTKj%JjKk%KlJTkMkjJ%j%Jj%JkD
$$ 4 5 3 4 5 5 5 5 6 6 4 5 3 4 3 4 3 3 3 3 3 5 3 5 2 4 3 2 4 3 3 4 3 5 3 3 5 2 3 4 2 6 4 3 4 4 3 3 4 3 3 4 2 4
2435.2216497376BjLJk%jJjTJT%JTjTJTkJTkKJkJjkKjTJ%JkKkK%j%jJjKjJ%JD
$$ 2 1 4 5 3 3 2 3 2 1 2 3 3 4 5 4 3 4 5 3 4 5 3 5 6 4 5 4 2 4 3 2 3 3 4 2 4 2 4 4 3 3 2 3 2 4 3 4 4 5 4
2422.42190781BJjJT%jJTk%jKj%JTjU%J%Jk%KkJ%UJTjTKkKjT%WJ%JjK%KTMA3
$$ 2 3 2 3 4 4 3 4 5 3 3 2 4 3 3 4 5 4 3 2 2 3 3 4 2 2 4 2 3 3 3 3 4 5 4 3 5 3 5 4 3 3 3 3 3 3 4 4 5 4 6 6 8 10 14 13
2408.3671497376A1ljkKkJj%JTjTJT%lJKl%YjKjJkJ%K%JkJjUJj%KTJKLkUlJlE
$$ 11 8 7 5 7 5 6 5 5 6 7 6 5 6 7 7 4 5 7 4 4 4 4 4 4 4 4 3 5 4 5 3 4 4 6 6 7 5 6 5 4 3 4 3 3 5 7 8 10 13 11 9 7 4 5 2 5
2394.0615497376BJTjJj%J%jTJ%jJ%LkKlJ%TJk%jK%jJ%UjKk%jK%jJ%jJjJ%TJC
$$ 2 3 4 3 4 3 3 4 4 3 2 3 3 2 3 3 6 4 6 3 4 4 4 5 3 3 2 4 4 3 4 4 4 4 3 5 3 3 2 4 4 3 4 4 3 4 3 4 4 4 5 3
2381.0107287738D%j%J%Tj%Jj%Kk%Jj%JjJ%kMnJUj%TjJ%LljKkK%UkL%TkjK%jD
$$ 4 4 3 3 4 4 4 3 3 4 3 3 5 3 3 4 3 3 4 3 4 4 2 6 1 2 3 4 3 3 3 2 3 3 6 3 2 4 2 4 4 4 4 2 5 5 5 3 2 4 4 3 4
2367.7090287738E%k%JjKj%Jk%JjTKJ%TjJ%TKjTJT%M%jTJ%j%l%jJ%jTKkJK%LA1
$$ 5 5 3 3 4 3 5 4 4 5 3 3 4 3 2 4 5 5 5 4 5 5 5 7 6 5 6 7 7 11 11 10 9 10 10 9 9 6 6 5 6 6 5 4 6 4 5 7 7 10 11
2354.9091497376A1j%jJ%lJl%JlJ%jJkJTkJ%TjMkKkj%JjKlJKkJjJ%jJj%J%j%E
$$ 11 10 10 9 10 10 7 8 5 5 6 3 4 4 3 4 2 3 4 2 3 3 3 2 6 4 6 4 3 3 4 3 5 2 3 5 3 4 3 4 4 3 4 3 3 4 4 3 3 5
2342.3603707015CJ%Vj%JjJKk%UjJKjUJjJW%JTjT%l%Jk%TKTj%j%TKkJjKl%L%A0
$$ 3 4 4 4 4 4 3 3 4 3 4 6 4 4 4 4 3 4 6 5 4 3 4 3 4 5 6 7 8 8 9 10 9 8 8 5 5 6 4 4 4 6 8 7 7 6 6 6 8 6 7 6 8 5 5 8 8 10
2327.80370781A1JjJkT%j%jJj%jUJjJ%JlKj%UJT%j%UKkJkjJT%TkJ%J%j%J%E
$$ 11 12 11 12 10 8 8 7 7 6 7 6 6 5 4 3 4 3 4 4 5 2 4 3 3 3 3 4 5 5 4 4 4 4 6 4 5 3 2 3 4 4 4 2 3 3 4 4 3 3 4 4 5
2314.50200781BJ%KjJTj%VjTJ%J%jTJLkKl%j%jJ%Jj%KkjLj%TjJ%JjJkj%KkD
$$ 2 3 3 5 4 5 6 5 5 5 5 5 4 3 4 4 5 5 4 3 4 7 5 7 4 4 3 3 2 3 3 4 3 3 5 3 2 5 4 4 4 3 4 4 5 4 5 3 2 2 4 2 4
2301.2001707015D%TjKjTKj%TJjkJ%TJ%Tj%KkLkJjT%K%Tj%jJk%JKjT%J%TjKjD
$$ 4 4 4 3 5 4 3 5 4 4 4 5 4 2 3 3 3 4 4 4 3 3 5 3 6 4 5 4 3 3 5 5 5 4 4 3 4 2 2 3 5 4 3 3 4 4 4 3 5 4 4
2288.4004287738D%jJjKkJTjJ%Kl%JTjL%K%lJjl%UjKJlJT%j%UJj%jJ%Uj%jKjE
$$ 4 4 3 4 3 5 3 4 5 4 5 5 7 4 4 5 6 5 8 8 10 10 7 8 7 4 4 4 4 3 5 6 3 4 5 5 4 4 4 4 5 4 4 3 4 4 4 4 3 3 2 4 3 5
2274.8476497376C%KjKjkJ%jJ%jJ%j%TJ%Jk%J%Tj%VJkJT%TlMjT%TJ%kK%UKk%C
$$ 3 3 5 4 6 5 3 4 4 3 4 4 3 4 4 3 3 3 4 4 5 3 3 4 4 4 3 3 3 3 3 4 2 3 4 4 4 1 5 4 3 3 3 4 4 2 4 4 4 4 6 4 4 3
2261.2949707015CKk%JTkJjJ%jJKjTJ%jJjTKjJK%JT%jk%kjJT%kJjJTj%jJT%TlD
$$ 3 5 3 3 4 5 3 4 3 4 4 3 4 6 5 4 5 5 4 5 4 3 5 4 5 7 7 8 9 9 8 6 6 4 3 4 5 5 3 4 3 4 5 4 4 3 4 5 5 5 2 4
2248.2441287738E%j%JjTJ%kK%UKkjJ%J%UjTKjTJjJT%jJjkL%kKjKjTKj%TJTkG
$$ 5 5 4 4 5 4 3 4 4 2 4 4 4 4 6 4 3 4 4 5 5 5 5 4 3 5 4 3 4 3 4 5 5 4 5 4 2 5 5 3 5 4 6 5 4 6 5 5 5 6 7 5 7
2234.9424287738Gj%j%TKkjLlKjkJT%TKk%jK%jULj%UJ%TlLJ%TjJjkK%JjJjkLF
$$ 7 6 6 5 5 5 7 5 4 7 4 6 5 3 4 5 5 5 7 5 5 4 6 6 5 4 3 6 5 5 5 5 6 6 6 3 6 7 7 7 6 7 6 4 6 6 7 6 7 6 4 7 6
2221.6406287738EjKkKk%jJjLlKjJTkJTj%kJTjJkjJ%JTkKk%J%j%Lk%ULjkjKjD
$$ 5 4 6 4 6 4 4 3 4 3 6 3 5 4 5 6 4 5 6 5 5 3 4 5 4 5 3 2 3 3 4 5 3 5 3 3 4 4 3 3 6 4 4 4 4 7 6 4 3 5 4 4
2208.58980781EjTJ%TJjJjJj%J%TjJ%Yk%Kj%J%Tk%JjK%jJjJTjT%TjKkJ%J%E
$$ 5 4 3 4 4 4 5 4 5 4 5 4 4 5 5 5 4 5 5 5 5 5 5 5 5 3 3 5 4 4 5 5 5 3 3 4 3 5 5 4 5 4 5 6 5 4 4 4 3 5 3 4 4 5 5 5
2194.5351497376D%UjTL%j%J%jL%Tk%Jk%TKlK%TjJ%jJjTLjUJ%J%TjJjTJLlJjE
$$ 4 4 4 4 3 2 5 5 4 4 5 5 4 7 7 7 5 5 6 4 4 4 6 3 5 5 5 4 5 5 4 5 4 3 6 5 4 3 4 4 5 5 5 4 5 4 3 4 7 4 5 4 5
2181.2334497376E%jJ%jK%JkKlK%lK%jJjJ%TjJjJjKjJkKjJjJj%Wj%J%UkJUj%G
$$ 5 5 4 5 5 4 6 6 7 5 7 4 6 6 3 5 5 4 5 4 5 5 5 4 5 4 5 4 6 5 6 4 6 5 6 5 6 5 5 5 5 5 5 4 4 5 5 5 5 3 4 5 6 5 5 7
2167.1787287738DMJTKkJj%TkJjU%TjJkK%JT%K%Tjk%k%TJ%UjlL%jK%KjKjUJjD
$$ 4 8 9 10 12 10 11 10 10 10 8 9 8 7 6 6 6 5 6 4 6 6 7 8 8 10 10 10 9 7 7 5 5 5 6 6 6 6 5 2 5 5 4 6 6 8 7 9 8 7 6 7 6 4
2153.6259497376DJjTK%Tj%Jj%TJjJjJ%TjKk%TJ%kK%Jk%TKj%j%kLJ%k%TjK%TjE
$$ 4 5 4 3 5 5 5 4 4 5 4 4 4 5 4 5 4 5 5 5 4 6 4 4 4 5 5 3 5 5 6 4 4 4 6 5 5 4 4 2 5 6 6 4 4 4 3 5 5 5 4 5
2140.57520781DjJjK%jJj%jJjK%jT%Lk%JTjTJTjTJjKkJ%jKkJ%jJjJ%TJj%TJE
$$ 4 3 4 3 5 5 4 5 4 4 3 4 3 5 5 4 3 3 6 4 4 5 6 5 4 5 6 5 4 5 4 6 4 5 5 4 6 4 5 5 4 5 4 5 5 5 6 5 5 5 6 5
2127.5243707015F%JTj%kJ%TlK%TJk%jK%sJjKJjT%KTlJjU%Jj%KJkJkjJ%jTJ%E
$$ 6 6 7 8 7 7 5 6 6 6 3 5 5 5 6 4 4 3 5 5 5 5 5 5 5 5 5 5 6 5 7 8 7 6 6 8 10 7 8 7 6 5 5 6 5 5 7 8 6 7 5 4 5 5 4 3 4 4 5
2112.7168287738EJk%Jj%JjJjkJT%JjJ%Jj%Tj%JjJ%TjT%K%jJ%UKOTRKnqnlkjF
$$ 5 6 4 4 5 4 4 5 4 5 4 2 3 4 4 5 4 5 5 6 5 5 5 4 4 5 4 5 5 5 4 3 3 5 5 4 5 5 5 5 7 13 19 28 30 25 17 12 9 7 6 6
2099.66600781FLJTKTjTkl%kjJjJTl%KkjJ%JkKJkJ%Kk%TJjUJ%J%kK%Tj%KjD
$$ 6 9 10 11 13 15 14 13 11 8 8 6 5 6 5 6 7 4 4 6 4 3 4 4 5 3 5 6 4 5 5 7 5 5 5 6 5 4 3 4 4 5 5 3 5 5 5 4 4 6 5 4
2086.6152497376EkK%TjTK%j%TLmJLkj%K%jJj%TJk%KkJj%TJkK%JTK%JTj%j%lF
$$ 5 3 5 5 5 4 3 5 5 4 4 4 7 3 4 7 5 4 4 6 6 5 6 5 5 5 6 4 4 6 4 5 4 4 4 5 3 5 5 6 7 9 9 10 11 10 10 9 9 6 6
2073.81540781E%kJKk%J%JkJkJT%j%jKj%TJj%TjJ%Jj%TjKkKjJkJTjJjK%jJE
$$ 5 5 3 4 6 4 4 5 5 6 4 5 3 4 5 5 4 4 3 5 4 4 4 5 4 4 4 3 4 4 5 4 4 4 3 5 3 5 4 5 3 4 5 4 5 4 6 6 5 6 5
2061.0156497376EJj%Uj%TKkJkJT%j%Jj%TJ%JjTKj%kKJlK%jJj%J%JjT%KjJkJE
$$ 5 6 5 5 5 5 4 4 4 6 4 5 3 4 5 5 4 4 5 4 4 4 5 5 6 5 4 6 5 5 3 5 6 3 5 5 4 5 4 4 5 5 6 5 4 4 6 5 6 4 5 5
2047.9648287738EJjT%JjJj%UJjJj%jK%Jj%kK%UJjJkK%k%VJj%JKkj%ZJj%UKkD
$$ 5 6 5 4 4 5 4 5 4 4 4 4 5 4 5 4 4 3 5 5 6 5 5 3 5 5 5 5 6 5 6 4 6 6 4 4 4 4 4 5 4 4 5 7 5 4 4 4 4 4 4 4 4 4 5 4 4 4 4 6 4 4
2032.4043287738D%jLjT%JjKjTKjTJjJTjT%J%JT%JTl%jJ%VjJ%j%J%kjTK%JkLE
$$ 4 4 3 6 5 4 4 5 4 6 5 4 6 5 4 5 4 5 6 5 4 4 5 5 6 7 7 8 9 6 6 5 6 6 6 6 6 5 6 6 5 5 6 6 4 3 2 4 4 5 3 6 5
2019.1025287738EJ%KjTKkJT%lJ%kJTj%TjJTjUKTmK%UJTjUKjJ%k%J%jJjJKljC
$$ 5 6 6 8 7 6 8 6 7 8 8 5 6 6 4 5 6 5 5 5 4 5 6 5 4 3 5 7 3 5 5 5 5 6 7 6 5 4 6 5 6 6 4 4 5 5 4 5 4 5 7 4 3 3
2005.5498497376DkLjJj%j%JKjlKJTjTJj%KkLl%JjJKkjKkJkjKJ%Uj%JTj%VJjD
$$ 4 2 5 4 5 4 4 3 3 4 6 5 2 4 5 6 5 4 5 4 4 6 4 7 4 4 5 4 5 7 5 4 6 4 5 3 2 4 5 5 5 5 4 4 5 6 5 5 5 5 5 6 5 4
1991.9970707015DJ%KlKjTJT%j%UkKjK%Vk%UKj%VJj%jJjTKj%TJk%KJjT%VJj%F
$$ 4 5 5 7 4 6 5 4 5 6 6 5 5 5 5 3 5 4 6 6 6 6 6 4 4 4 4 6 5 5 5 5 5 6 5 5 4 5 4 3 5 4 4 4 5 3 3 5 6 5 4 4 4 4 4 5 4 4 6
1977.18950781D%Kj%JKlJjJ%k%TJ%TjJTlK%Vj%JjTJ%jLk%J%TjJTk%TJKlKjE
$$ 4 4 6 5 5 6 8 5 6 5 6 6 4 4 4 5 5 5 4 5 6 3 5 5 5 5 5 4 4 5 4 3 4 4 3 6 4 4 5 5 5 4 5 6 4 4 4 5 7 4 6 5 5
1963.88770781DJjKlK%JjU%KkJTkJ%K%kKjTJjJjJjJk%K%jTKj%JjKjJ%jT%JD
$$ 4 5 4 6 3 5 5 6 5 4 3 3 5 3 4 5 3 4 4 6 6 4 6 5 4 5 4 5 4 5 4 5 3 3 5 5 4 3 5 4 4 5 4 6 5 6 6 5 4 4 5 4
1950.8368707015CJKj%ULlKjJjKkJj%TkJTlKjJT%Tj%J%Uj%Uj%Ll%JkK%kK%jKE
$$ 3 4 6 5 5 5 5 8 5 7 6 7 6 8 6 7 6 6 6 4 5 6 3 5 4 5 6 6 6 5 5 6 6 6 6 5 5 5 5 4 4 7 4 4 5 3 5 5 3 5 5 4 6 5
1937.2841707015D%jK%TjJj%UJ%Tj%JkJTjJjJ%jJ%J%TjJ%UJ%TJ%jJk%UjJ%TjF
$$ 4 4 3 5 5 5 4 5 4 4 4 4 5 5 5 4 4 5 3 4 5 4 5 4 5 5 4 5 5 6 6 6 5 6 6 6 6 7 7 7 8 8 7 8 6 6 6 6 5 6 6 6 5 6
1923.73140781FjKkKjkK%TJ%lJTmKJTj%JlKJjJ%lJTjKkjJT%UjJ%UK%kKkj%D
$$ 6 5 7 5 7 6 4 6 6 6 7 7 4 5 6 2 4 5 6 5 5 6 3 5 6 5 6 6 3 4 5 4 6 4 3 4 5 5 5 5 4 5 5 5 5 7 7 5 7 5 4 4 4
1910.42970781FjTKlM%k%VJj%j%TJ%WJ%j%j%J%Tj%LlKjJj%jJkJ%J%j%J%jJF
$$ 6 5 4 6 3 7 7 5 5 5 5 5 6 5 5 4 4 4 5 5 5 5 5 5 6 6 5 5 4 4 5 5 5 4 4 7 4 6 5 6 5 5 4 5 3 4 4 5 5 4 4 5 5 4 5 6
1896.3749707015BM%lJ%JTjTJkK%j%TJj%jJ%TJj%JjJ%TkLl%TJ%TjJTjJTlJK%E
$$ 2 6 6 3 4 4 5 6 5 4 5 3 5 5 4 4 4 5 4 4 3 4 4 4 5 4 4 5 4 5 5 5 3 6 3 3 3 4 4 4 3 4 5 4 5 6 3 4 6 6 5
1883.57520781FKJMKM%jlTkl%jTKlJ%jJjJT%j%jJkJ%JkK%kJTj%JTjJjT%J%D
$$ 6 8 9 13 15 19 19 18 15 12 10 7 7 6 5 7 4 5 5 4 5 4 5 6 6 5 5 4 5 3 4 4 5 3 5 5 3 4 5 4 4 5 6 5 6 5 4 4 5 5 4
1870.7753497376EkJTj%J%kJ%Jj%kKjTL%TjTJTj%Jj%KjkKj%J%TJj%UjJ%j%TJE
$$ 5 3 4 5 4 4 5 5 3 4 4 5 4 4 2 4 3 2 5 5 5 4 3 4 5 4 4 5 4 4 6 5 3 5 4 4 5 5 5 6 5 5 5 5 4 5 5 4 4 4 5 5
1857.7246287738FlJT%J%j%TJmKJjJ%kKj%VjKkKkLkJk%Jj%J%TKj%UjJTjkJT%E
$$ 6 3 4 5 5 6 6 5 5 5 6 2 4 5 4 5 5 3 5 4 4 4 4 4 3 5 3 5 3 6 4 5 3 3 4 3 3 4 4 4 6 5 5 5 5 4 5 6 5 3 4 5 5 5
1844.1718497376CK%TjJjJTj%jJk%TK%TjJ%Tj%J%jJjJ%TJ%jJjJ%TkJ%JjTJ%jE
$$ 3 5 5 5 4 5 4 5 6 5 5 4 5 3 3 3 5 5 5 4 5 5 5 4 4 5 5 4 5 4 5 5 5 6 6 5 6 5 6 6 6 4 5 5 6 5 4 5 5 4 5
1831.3720916653CKjKkJjKj%TkJT%TjKjTJkKJjT%JjJjJjJ%j%JT%j%TJj%jKlJE
$$ 3 5 4 6 4 5 4 6 5 5 5 3 4 5 5 5 4 6 5 4 5 3 5 6 5 4 4 5 4 5 4 5 4 5 5 4 4 5 6 6 5 5 5 6 5 5 4 6 3 4 5
1818.5722287738DKlK%TjTK%TJk%JKljKkJ%JTjTJjJkK%JjkJLk%JkJ%Tj%Kk%jD
$$ 4 6 3 5 5 5 4 3 5 5 5 6 4 4 5 7 4 3 5 3 4 4 5 6 5 4 5 4 5 3 5 5 6 5 3 4 7 5 5 6 4 5 5 5 4 4 6 4 4 3 4
1805.7724707015Ek%Mk%jLlJjJ%jKJjk%KkJjJ%jTJTj%TKj%UjKk%jK%kJ%Kk%jE
$$ 5 3 3 7 5 5 4 7 4 5 4 5 5 4 6 7 6 4 4 6 4 5 4 5 5 4 3 4 5 4 4 4 6 5 5 5 5 4 6 4 4 3 5 5 3 4 4 6 4 4 3 5
1792.7216497376EJ%JjkjK%TjJ%jJT%UjTK%kJjJ%j%UjK%TjTLj%jKk%TJj%UJ%E
$$ 5 6 6 7 6 4 3 5 5 5 4 5 5 4 5 6 6 6 6 5 4 6 6 4 5 4 5 5 4 4 4 4 3 5 5 5 4 3 6 5 5 4 6 4 4 4 5 4 4 4 4 5 5 5
1779.1689707015Fk%JTlJKjT%KJkJk%TJjJ%TjJTjU%K%kKjJjTJ%jK%j%JTkJ%jF
$$ 6 4 4 5 6 3 4 6 5 4 4 6 7 5 6 4 4 4 5 4 5 5 5 4 5 6 5 4 3 3 5 5 3 5 4 5 4 3 4 4 3 5 5 4 4 5 6 4 5 5 4 6
1766.1181287738E%TjJ%k%LlJKkKkKkJTkJ%kK%JjJjJkjK%TkJUjTLj%j%TJj%TjE
$$ 5 5 5 4 5 5 3 3 6 3 4 6 4 6 4 6 4 5 6 4 5 5 3 5 5 6 5 6 5 6 4 3 5 5 5 3 4 5 6 5 4 7 6 6 5 5 5 6 5 5 5 4 5
1752.8164287738DKkK%Jj%jJ%lK%jJ%TkK%UjKjJkJjKkJ%jJkKjJ%JjkJjJKk%jD
$$ 4 6 4 6 6 7 6 6 5 6 6 3 5 5 4 5 5 5 3 5 5 5 5 4 6 5 6 4 5 4 6 4 5 5 4 5 3 5 4 5 5 6 5 3 4 3 4 6 4 4 3 4
1739.76560781DjK%jJkKjJ%kKjJT%Vj%KjKklLkJj%TjKJ%KlLlKjkKjLl%jJ%C
$$ 4 3 5 5 4 5 3 5 4 5 5 3 5 4 5 6 6 6 6 6 5 5 7 6 8 6 3 6 4 5 4 4 4 3 5 6 6 8 5 8 5 7 6 4 6 5 8 5 5 4 5 5 3
1726.46390781E%j%TJ%TkJ%J%TjJ%jKjkK%jJj%kJUjKjJjkJT%J%lLk%JlJTKD
$$ 5 5 4 4 4 5 5 5 3 4 4 5 5 5 4 5 5 4 6 5 3 5 5 4 5 4 4 2 3 4 5 4 6 5 6 5 3 4 5 5 6 6 3 6 4 4 5 2 3 4 6 4
1713.4130707015EkJKk%TJj%j%J%JjKk%KjT%WJjTLk%TJkJ%j%KkMkjJjJTjTK%E
$$ 5 3 4 6 4 4 4 5 4 4 3 3 4 4 5 4 6 4 4 6 5 4 4 4 4 4 4 5 4 3 6 4 4 4 5 3 4 4 3 3 5 3 7 5 4 5 4 5 6 5 4 6 6 5
1699.8603707015EJlKj%LlJ%TJkJjLj%K%JLkTlKl%JTk%J%jJ%Jk%JkJjJ%Kj%JE
$$ 5 6 3 5 4 4 7 4 5 5 5 6 4 5 4 7 6 6 8 8 9 12 10 8 5 7 4 4 5 6 4 4 5 5 4 5 5 6 4 4 5 3 4 3 4 4 6 5 5 6 5
1687.0605287738Ej%UjJT%JkLk%Vj%Jj%J%jJj%TLjTJkJTjJ%kKl%JT%TkJ%Jj%C
$$ 5 4 4 4 4 3 4 5 5 6 4 7 5 5 5 5 5 4 4 5 4 4 5 5 4 5 4 4 4 7 6 5 6 4 5 6 5 6 6 4 6 3 3 4 5 5 5 3 4 4 5 4 4 3
1673.5078497376FjU%JjLjT%kKJ%JkJ%TJjUJ%TjM%JjJ%UKj%j%kKlkJjK%jJjJE
$$ 6 5 4 3 3 4 3 6 5 4 4 2 4 5 5 6 4 5 5 5 6 5 4 3 4 4 4 3 7 7 8 7 8 8 8 8 10 9 9 8 8 6 8 5 3 4 3 5 5 4 5 4 5 5
1659.9550707015FjJT%JjTK%UjJjU%j%TJkKTl%KkJjTJjJT%j%UJj%UjJ%UjK%JC
$$ 6 5 6 7 7 8 7 6 8 8 8 8 7 8 7 6 5 5 4 4 4 5 3 5 7 4 4 6 4 5 4 3 4 3 4 5 5 4 4 4 4 5 4 4 4 4 3 4 4 4 4 3 5 5 6 3
1645.9004287738D%Uj%K%jJjTJ%jTMkJ%kJ%Jj%VJjJjJjTKJk%K%kJ%TJ%TJK%JI
$$ 4 4 4 4 3 3 5 5 4 5 4 3 4 4 3 2 6 4 5 5 3 4 4 5 4 4 4 4 4 5 4 5 4 5 4 3 5 6 4 4 6 6 4 5 5 5 6 6 6 7 9 9 10 9
1632.3476497376IJlJkjTJ%jKlJTlMj%UkK%Wj%Jj%TJ%J%JjkLlKJj%TJjTJjTJE
$$ 9 10 7 8 6 5 4 5 5 4 6 3 4 5 2 6 5 5 5 5 3 5 5 5 5 5 5 4 4 5 4 4 4 5 5 6 6 7 6 4 7 4 6 7 6 6 6 7 6 5 6 5 4 5 5
1618.54390781DJjJTlKj%VLl%kLjTKjKk%JkLk%TJkLlKjJ%kLj%VKmKjTJjK%F
$$ 4 5 4 5 6 3 5 4 4 4 4 4 7 4 4 2 5 4 3 5 4 6 4 4 5 3 6 4 4 4 5 3 6 3 5 4 5 5 3 6 5 5 5 5 5 7 3 5 4 3 4 3 5 5 6
1604.7402287738D%JkLjUJ%KlJ%J%lLjTJTk%K%TjTK%jJj%TJlJTkJU%j%JkJTjD
$$ 4 4 5 3 6 5 4 3 4 4 6 3 4 4 5 5 2 5 4 3 4 5 3 3 5 5 5 4 3 5 5 4 5 4 4 4 5 2 3 4 2 3 4 5 5 4 4 5 3 4 5 4 4
1591.4385287738DjK%kJUlKkLlJKjT%WJkKj%UKk%TJTjkKjJjT%J%TKkJjJjJ%TjD
$$ 4 3 5 5 3 4 5 6 3 5 3 6 3 4 6 5 4 4 4 4 4 4 5 3 5 4 4 4 4 6 4 4 4 5 6 5 3 5 4 5 4 3 3 4 4 4 6 4 5 4 5 4 5 5 5 4 4
1577.1328287738D%jJTlLJkJTjTJjJlKJTkJjTK%jJkK%UjTKJkJ%j%Jj%Kl%K%UJD
$$ 4 4 3 4 5 2 5 6 4 5 6 5 4 5 4 5 2 4 5 6 4 5 4 3 5 5 4 5 3 5 5 5 5 4 3 5 6 4 5 5 4 4 5 4 4 6 3 3 5 5 5 5 6 4
1563.5800497376CJTjKlJUk%JjJkKkJT%j%KjJj%j%KkjKjJjTJT%JkKj%j%WjJ%E
$$ 3 4 5 4 6 3 4 5 6 4 4 5 4 5 3 5 3 4 5 5 4 4 6 5 6 5 5 4 4 6 4 3 5 4 5 4 3 4 5 5 6 4 6 5 5 4 4 4 4 4 4 3 4 4 5
1549.7763707015D%JjTKjJ%jJ%kKjKlKjJkK%j%Kk%JUjK%K%k%Jj%j%KJjT%Tl%D
$$ 4 4 5 4 3 5 4 5 5 4 5 5 3 5 4 6 3 5 4 5 3 5 5 4 4 6 4 4 5 6 7 6 8 8 10 10 8 8 9 8 8 7 7 9 10 9 8 8 8 5 5 4
1536.7255497376E%kK%TkKjKj%J%J%jkJjKkJ%kJT%jTKJ%jTKk%J%UK%JTLj%lKA1
$$ 5 5 3 5 5 5 3 5 4 6 5 5 6 6 7 7 6 4 5 4 6 4 5 5 3 4 5 5 4 3 5 6 6 5 4 6 4 4 5 5 5 5 7 7 8 9 12 11 11 8 10 11
1523.6748287738H%Uj%jJ%Tk%jK%Jk%Uj%JKkJTKjlJ%jTLkJkJj%UjJTkJTjTKjC
$$ 8 8 8 8 7 7 6 7 7 7 5 5 4 6 6 7 5 5 5 5 4 4 5 7 5 6 7 9 8 5 6 6 5 4 7 5 6 4 5 4 4 4 4 3 4 5 3 4 5 4 3 5 4 3
1510.1220497376D%J%J%kJ%jJ%TKjUJ%kjK%Jj%jJTjTJ%TJ%lJT%kKjJTkJ%jJTmE
$$ 4 4 5 5 6 6 4 5 5 4 5 5 5 7 6 5 4 5 5 3 2 4 4 5 4 4 3 4 5 4 3 4 4 4 5 5 2 3 4 4 2 4 3 4 5 3 4 4 3 4 5 1 5
1496.8203287738EjKl%JjJKlKJ%J%Tj%jJjkK%UkJjTJK%J%jT%j%JTj%jJ%Jj%jE
$$ 5 4 6 3 3 4 3 4 6 3 5 6 6 7 7 7 6 6 5 6 5 3 5 5 5 5 3 4 3 2 3 5 5 6 6 5 4 4 3 3 4 5 4 4 3 4 4 5 4 4 3 5
1483.76950781Ej%TKk%jJkK%j%jLjKMTkjl%mKl%KjT%J%UJ%lLj%KJMNO%lmlA3
$$ 5 4 4 4 6 4 4 3 4 2 4 4 3 3 2 5 4 6 10 14 12 11 8 8 4 6 3 3 5 4 3 3 4 4 4 4 5 5 2 5 4 4 6 7 11 16 22 22 19 15 12 13
1470.7187707015A2KMTKjJLkjTkLj%lmklkKLJ%nj%k%j%WkKj%J%jkKj%JjJjKkD
$$ 12 14 18 22 24 23 24 27 25 24 23 21 24 23 23 20 16 14 11 9 11 14 15 15 10 9 9 7 7 6 6 6 6 6 6 4 6 5 5 6 6 5 3 5 4 4 5 4 5 4 6 4 4
1457.4169707015E%TjJ%jKjT%JjJ%jJTjJjJkJjJ%JjKJjJkj%TJkLjT%TjKkJ%kD
$$ 5 5 5 4 5 5 4 6 5 4 4 5 4 5 5 4 5 6 5 6 5 6 4 5 4 5 5 6 5 7 8 7 8 6 5 5 5 6 4 7 6 5 5 5 4 6 4 5 5 3 4
1444.61720781FkJj%KkJlKkLlJT%Jk%KkKj%JjJ%lK%TJk%JjJ%jKjLj%jJkjJE
$$ 6 4 5 4 4 6 4 5 2 4 2 5 2 3 4 4 5 3 3 5 3 5 4 4 5 4 5 5 2 4 4 4 5 3 3 4 3 4 4 3 5 4 7 6 6 5 6 4 3 4 5
1431.8173497376Fk%UjLj%j%Tj%Lk%JjTK%j%TJj%jKj%L%Ljm%KjL%Tkjk%JjJjE
$$ 6 4 4 4 4 3 6 5 5 4 4 4 3 3 6 4 4 5 4 3 5 5 4 4 4 5 4 4 3 5 4 4 7 7 10 9 5 5 7 6 9 9 9 7 6 4 4 5 4 5 4 5
1418.7666287738DJkKJmKJjJj%TjJ%TJ%mL%J%TkJTjJ%jTKjTKj%jLkKkTKk%LjC
$$ 4 5 3 5 6 2 4 5 4 5 4 4 4 3 4 4 4 5 5 1 4 4 5 5 5 3 4 5 4 5 5 4 3 5 4 3 5 4 4 3 6 4 6 4 2 4 2 2 5 4 3
1405.9667707015D%UJ%j%KlJ%jJT%TjTMlLkjKk%JjTJ%WJTkJK%kjJjJj%TJ%jJC
$$ 4 4 4 4 5 5 4 4 6 3 4 4 3 4 5 5 5 4 3 7 4 7 5 4 6 4 4 5 4 3 4 4 4 4 4 4 5 6 4 5 7 7 5 4 5 4 5 4 4 4 5 5 4 5 3
1392.16310781CKkK%WJlJUjT%jJTj%TjK%jJjJj%jK%jKkJjTKjTJTj%UKj%JKA4
$$ 3 5 3 5 5 5 5 5 5 6 3 4 5 6 5 4 4 3 4 5 4 4 4 3 5 5 4 5 4 5 4 4 3 5 5 4 6 4 5 4 3 5 4 3 4 5 4 4 4 4 6 5 5 6 8 14
1378.1083707015B0L%onl%k%TjUJUj%Jk%kJ%TJk%UJK%TJlJjK%JjkjJ%jLk%J%D
$$ 20 23 23 17 12 9 9 7 7 7 6 5 4 5 6 7 6 6 7 5 5 3 4 4 4 5 3 3 3 3 4 6 6 6 7 4 5 4 6 6 7 6 4 3 4 4 3 6 4 4 5 5 4
1364.8066707015CJTkjMlLj%TkKkKkJ%kK%TjJ%XjKkKjJkKj%TJkJjTK%Jj%jKlD
$$ 3 4 5 3 2 6 3 6 5 5 5 3 5 3 5 3 4 4 2 4 4 4 3 4 4 4 4 4 4 4 3 5 3 5 4 5 3 5 4 4 4 5 3 4 3 2 4 4 5 4 4 3 5 2 4
1351.0029287738DjK%kJj%TJkLjT%TJjKjTJ%TkJjLjTKkK%K%k%J%KjLl%JjTJKH
$$ 4 3 5 5 3 4 3 3 3 4 2 5 4 3 3 3 4 3 5 4 3 4 4 4 2 3 2 5 4 3 5 3 5 5 7 7 5 5 6 6 8 7 10 7 7 8 7 6 7 9 8
1338.2031497376GjLlTMkJj%VjTJkK%jJT%TJKJT%kjk%Uj%TjJjKjJjJjTKJkJU%H
$$ 7 6 9 6 3 7 5 6 5 5 5 5 5 4 3 4 2 4 4 3 4 5 5 5 6 8 9 10 10 8 7 5 5 5 5 4 4 4 3 4 3 5 4 5 4 5 4 3 5 6 4 5 6 7 7 8
1324.1484287738EjJjTJ%jJTjKjTkK%J%kKjT%TL%k%J%WKjkJ%j%jKjJj%KlKjJD
$$ 5 4 5 4 3 4 4 3 4 5 4 6 5 4 2 4 4 5 5 3 5 4 3 3 3 6 6 4 4 5 5 5 5 5 5 7 6 4 5 5 4 4 3 5 4 5 4 4 6 3 5 4 5 4
1310.5957497376EkJkLjJlJKj%j%ULjT%Jj%Tk%TKjJTj%Jl%KjJ%jK%kJkJT%UKB
$$ 5 3 4 2 5 4 5 2 3 5 4 4 3 3 3 3 6 5 4 4 5 4 4 4 2 2 2 4 3 4 5 4 4 5 2 2 4 3 4 4 3 5 5 3 4 2 3 4 4 4 4 6 2
1297.2939497376Ej%jJ%Uj%TJjJTjk%K%TjJjKJk%j%WjJ%TKkjKJk%JjKjJjT%jE
$$ 5 4 4 3 4 4 4 4 3 3 3 4 3 4 5 4 2 2 4 4 4 3 4 3 5 6 4 4 3 3 3 3 3 3 2 3 3 3 5 3 2 4 5 3 3 4 3 5 4 5 4 3 3 2 5
1283.4902707015C%UJ%kKj%J%j%jJjJjKjJjT%J%jJjLlKj%JjTKJk%Kj%Wj%J%JE
$$ 3 3 3 3 4 4 2 4 3 3 4 4 3 3 2 3 2 3 2 4 3 4 3 2 2 3 3 2 3 2 5 2 4 3 3 4 3 2 4 5 3 3 5 4 4 4 4 4 4 3 3 4 4 5 5
1269.6865287738Dj%JjKkJjJj%TLlKkjJTkK%TjJjJ%TjJjJlL%jT%LjkJjK%Uj%E
$$ 4 3 3 4 3 5 3 4 3 4 3 3 3 6 3 5 3 2 3 4 2 4 4 4 3 4 3 4 4 4 3 4 3 4 1 4 4 3 2 2 5 4 2 3 2 4 4 4 4 3 3 5
1256.63570781CJ%jJjKj%kKJjJk%UJjJjJTlJTjTJKkTKj%TKj%j%JjJTkLjTkC
$$ 3 4 4 3 4 3 5 4 4 2 4 5 4 5 3 3 3 3 4 3 4 3 4 5 2 3 4 3 2 3 5 3 1 3 2 2 2 4 3 3 2 2 3 2 3 4 2 5 4 3 1 3
1243.5849707015C%JkJj%TJ%TjJjKkJTkJjKjTKJk%jK%jJjJTj%jJjJkJ%J%j%JC
$$ 3 3 4 2 3 2 2 2 3 3 3 2 3 2 4 2 3 4 2 3 2 4 3 2 4 5 3 3 2 4 4 3 4 3 4 5 4 4 3 4 3 4 2 3 3 4 4 3 3 4 3
1230.78520781D%jTKj%jJ%TKjTJj%J%kJ%J%TjKk%TJj%J%VkKlJU%jTKjJ%jJE
$$ 4 4 3 2 4 3 3 2 3 3 3 5 4 3 4 3 3 4 4 2 3 3 4 4 4 3 5 3 3 3 4 3 3 4 4 4 4 4 2 4 1 2 3 4 4 3 2 4 3 4 4 3 4 5
1217.2324287738C%VJjJkJjTNmJjTKJjTK%Tj%kKjK%jTKJ%Vj%jJjKjkJ%TJ%jJB
$$ 3 3 3 3 3 4 3 4 2 3 2 1 6 2 3 2 1 3 4 3 2 4 4 4 3 3 1 3 2 4 4 3 2 4 5 5 5 5 5 4 4 3 4 3 5 4 2 3 3 3 4 4 3 4 2
1203.4286707015CJj%J%kJTkJj%JjJkL%jLkJT%k%Jj%kK%KkM%jJkJl%VKk%NjMA0
$$ 3 4 3 3 4 4 2 3 4 2 3 2 2 3 2 3 1 4 4 3 6 4 5 6 6 4 4 5 4 4 2 4 4 6 4 8 8 7 8 6 7 4 4 4 4 4 6 4 4 9 8 12 10
1190.1269707015A2k%TjJTkJlj%jkKj%JKJ%Kk%jk%KkL%jkKlJ%jT%JjKkJj%J%C
$$ 12 10 10 10 9 10 11 9 10 7 6 6 5 3 5 4 4 5 7 8 8 10 8 8 7 5 5 7 5 8 8 7 5 7 4 5 5 4 3 3 4 3 5 3 4 3 3 4 4 3
1177.5780916653EjK%JT%kJj%TjTJjU%J%Tj%LkJKlKkK%JTkjKjUKk%WJj%VjJTjC
$$ 5 4 6 6 7 8 8 6 7 6 6 6 5 4 5 4 3 2 2 3 3 3 2 2 5 3 4 6 3 5 3 5 5 6 7 5 4 6 5 4 3 5 3 3 3 3 3 3 4 3 3 3 3 3 2 3 4 3 3
1162.7705287738BLlJT%kJjJjJjJTjJ%kjLkKjTKlKJ%kjL%TjJkJ%TkKkJK%Tj%C
$$ 2 5 2 3 4 4 2 3 2 3 2 3 2 3 4 3 4 4 2 1 4 2 4 3 2 4 1 3 4 4 2 1 4 4 4 3 4 2 3 3 3 1 3 1 2 4 4 4 3 3 3
1149.9706707015BJjTKJjTKjJjJ%jTJ%TkJTKnKJ%J%jJj%JjTJ%jK%K%J%kj%jTLC
$$ 2 3 2 1 3 4 3 2 4 3 4 3 4 4 3 2 3 3 3 1 2 3 5 0 2 3 3 4 4 3 4 3 3 4 3 2 3 3 2 4 4 6 6 7 7 5 4 4 3 2 5 3
1136.9199497376DjT%JTj%TJjJj%KU%j%jTkj%jKjkKj%J%UJjJ%jJT%TKjk%Tj%D
$$ 4 3 2 2 3 4 3 3 3 4 3 4 3 3 5 7 9 9 8 8 7 6 4 3 3 2 4 3 1 3 2 2 3 3 3 3 4 3 4 4 3 4 5 5 5 7 6 4 4 4 3 3 4
1123.6181287738CKkjJ%UjTLj%Kj%kK%jJj%TJ%UJjTKjJlJTjJj%J%TJ%JjUKJ%E
$$ 3 5 3 2 3 3 3 3 2 1 4 3 3 5 4 4 2 4 4 3 4 3 3 3 4 4 4 4 5 4 3 5 4 5 2 3 4 3 4 3 3 4 4 4 5 5 6 5 4 3 5 6 6 5
1110.0654497376Gk%jJj%TJkKkTKjJKkKkJTKj%Lkj%k%Kl%JT%lLk%J%VjKj%JTjF
$$ 7 5 5 4 5 4 4 4 5 3 5 3 1 3 2 3 5 3 5 3 4 5 7 6 6 9 7 6 6 4 4 6 3 3 4 5 5 2 5 3 3 4 4 4 4 4 3 5 4 4 5 6 5 6
1096.5126707015EkJTj%j%TjKj%kKj%VjJKjTJjKJkjJ%kK%jTMkj%J%J%jT%jJkA
$$ 5 3 4 5 4 4 3 3 3 2 4 3 3 1 3 2 2 2 2 2 1 2 4 3 2 3 2 4 5 3 2 3 3 1 3 3 2 1 5 3 2 2 3 3 4 4 3 2 2 1 2 0 1
1083.2109707015BJ%TK%Uk%Tj%Tj%JT%Tj%jK%UjJj%JTk%JL%jLm%j%kKjK%j%jB
$$ 2 3 3 3 5 5 5 5 3 3 3 2 2 2 1 1 2 3 3 3 2 2 1 3 3 3 3 2 3 2 2 3 4 2 2 3 6 6 5 8 4 4 3 3 1 3 2 4 4 3 3 2 2
1069.9091497376BJj%jLkKjT%TLj%Kj%jlLk%JTjJkJjJ%UjJ%jKkJkJjJKkJjJjC
$$ 2 3 2 2 1 4 2 4 3 2 2 2 5 4 4 6 5 5 4 1 4 2 2 3 4 3 4 2 3 2 3 3 3 3 2 3 3 2 4 2 3 1 2 1 2 4 2 3 2 3 2 3
1056.8584287738BjTKJkJ%J%TJj%kJkKJTkJj%UJj%TjTL%Jj%JkJkKjkL%k%Kj%A
$$ 2 1 0 2 3 1 2 2 3 3 3 4 3 3 1 2 0 2 3 4 2 3 2 2 2 2 3 2 2 2 1 0 3 3 4 3 3 4 2 3 1 3 2 0 3 3 1 1 3 2 2 1
1043.80760781CjTKj%jJjJUj%jJTkTLKl%jJjJ%TJ%jJ%JKTMjn%kjJjUL%TlKB
$$ 3 2 1 3 2 2 1 2 1 2 3 4 3 3 2 3 4 2 0 3 5 2 2 1 2 1 2 2 2 3 3 2 3 3 4 6 8 12 11 6 6 4 3 4 3 2 1 4 4 4 1 3 2
1030.50590781BJ%JjUJ%UjLkKkJjTKJj%jTJ%jJjKj%kKJjKk%jLlJKk%WjKkKD
$$ 2 3 3 4 3 2 1 2 2 2 2 1 4 2 4 2 3 2 1 3 4 3 3 2 1 2 2 1 2 1 3 2 2 0 2 3 2 4 2 2 1 4 1 2 4 2 2 2 2 2 2 1 3 1 3 4
1016.4511497376AJ%VJjkJKj%TjTKJj%JjJlLj%Vj%UJjLj%j%J%lJTKjkJjJ%JkD
$$ 1 2 2 2 2 2 3 2 0 1 3 2 2 2 1 0 2 3 2 2 3 2 3 0 3 2 2 2 2 2 1 1 1 1 2 1 4 3 3 2 2 3 3 0 1 2 4 3 1 2 1 2 2 3 1 4
1002.3965287738BJkJ%Jj%j%jJKk%J%Uj%Kj%Vj%J%jJj%J%UJj%j%JKjkKjTKkjD
$$ 2 3 1 2 2 3 2 2 1 1 0 1 3 1 1 2 2 2 2 1 1 3 2 2 2 2 2 1 1 2 2 1 2 1 1 2 2 2 2 3 2 2 1 1 2 4 3 1 3 2 1 3 1 0 4
988.5927707015A%UjLjTKj%j%KkjKj%UK%TjJTkjLjTJlJT%k%J%UJkJKlLk%YJ@
$$ 1 1 1 1 0 3 2 1 3 2 2 1 1 3 1 0 2 1 1 1 1 3 3 3 2 3 4 2 1 4 3 2 3 0 1 2 2 0 0 1 1 1 1 2 0 1 3 0 3 1 1 1 1 1 1 1 1 2 0
973.78520781CJjl%J%JjJjKjJTljK%Tj%JjJj%KkjL%j%j%J%TjKj%J%jTKj%B
$$ 3 4 3 0 0 1 1 2 1 2 1 3 2 3 4 1 0 2 2 2 1 1 2 1 2 1 1 3 1 0 3 3 2 2 1 1 2 2 2 1 3 2 2 3 3 2 1 3 2 2 2
960.9853497376Bj%TK%Wk%J%JjT%K%j%Jj%WJlKTk%J%kKJlJT%jJ%J%Jj%TjT%C
$$ 2 1 1 1 3 3 3 3 3 3 1 1 2 2 3 2 1 1 3 3 2 2 3 2 2 2 2 2 2 3 0 2 4 2 2 3 3 1 3 4 1 2 3 3 2 3 3 4 4 5 4 4 4 3 2 2 3
946.6796497376B%j%JjKJkjKjJkJT%kLkJjJj%JjJ%kK%kJ%jKj%UJjJ%kK%UJjC
$$ 2 2 1 1 2 1 3 4 2 1 3 2 3 1 2 3 3 1 4 2 3 2 3 2 2 3 2 3 3 1 3 3 1 2 2 1 3 2 2 2 2 3 2 3 3 1 3 3 3 3 4 3 3
933.3779497376B%UJTk%JjJj%jJKlK%jkK%TKjkJTk%jK%jKlL%TkJ%Tj%J%UJjC
$$ 2 2 2 2 3 4 2 2 3 2 3 2 2 1 2 4 1 3 3 2 0 2 2 2 4 3 1 2 3 1 1 0 2 2 1 3 0 3 3 3 1 2 2 2 1 1 2 2 2 2 3 2 3
920.0761287738B%j%J%jKk%J%JTk%UjJjJ%Jj%jJTkKjTJTj%TkK%j%KjTJkKJjA
$$ 2 2 1 1 2 2 1 3 1 1 2 2 3 4 2 2 2 2 1 2 1 2 2 3 2 2 1 2 3 1 3 2 1 2 3 2 2 2 0 2 2 1 1 3 2 1 2 0 2 3 2 1
907.02540781Bj%TKjkKJjLklJTj%jKjKlJ%JlJKJ%kjJ%J%lL%TkJT%Tj%jL%@
$$ 2 1 1 1 3 2 0 2 3 2 5 3 0 1 2 1 1 0 2 1 3 0 1 1 2 -1 0 2 3 3 1 0 1 1 2 2 -1 2 2 2 0 1 2 2 2 1 1 0 3 3 0
894.2255497376AJkJ%Jk%JUj%Jj%jTJ%JjKj%kKkJ%J%JjT%JjJ%J%jlMjlLjKk@
$$ 1 2 0 1 1 2 0 0 1 2 3 2 2 3 2 2 1 0 1 1 2 1 3 2 2 0 2 0 1 1 2 2 3 2 1 1 2 1 2 2 3 3 2 -1 3 2 -1 2 1 3 1 0
881.1748287738B%jJjTJ%JkJ%J%jTKlJTjJjK%TjJ%jJk%J%TKkJ%lKjJjLlJKkB
$$ 2 2 1 2 1 0 1 1 2 0 1 1 2 2 1 0 2 -1 0 1 0 1 0 2 2 2 1 2 2 1 2 0 0 1 1 1 3 1 2 2 -1 1 0 1 0 3 0 1 3 1 2
868.3749707015B%Tj%J%Jk%VkLj%JTjT%Jj%JTkMLJ%jmkjJT%k%VJ%TjKjT%TJB
$$ 2 2 2 1 1 2 2 3 1 1 1 1 1 -1 2 1 1 2 3 2 1 1 2 1 1 2 3 1 5 8 9 9 8 4 2 1 2 3 3 1 1 1 1 1 2 2 2 1 3 2 1 1 1 2 2
854.57130781CkjJ%JjTKj%Jj%jJjL%k%JkJT%lKJkJ%Jj%TjK%kJLmJjK%j%JA
$$ 3 1 0 1 1 2 1 0 2 1 1 2 1 1 0 1 0 3 3 1 1 2 0 1 2 2 -1 1 2 0 1 1 2 1 1 1 0 2 2 0 1 4 0 1 0 2 2 1 1 2 1
841.7714497376BjTLk%jLlK%j%jK%UKLOMTmnTlk%UjJjJ%TjJj%JTk%TJj%kLj@
$$ 2 1 0 3 1 1 0 3 0 2 2 1 1 0 2 2 2 2 4 7 13 17 21 17 12 7 4 2 2 2 2 1 2 1 2 2 2 1 2 1 1 2 3 1 1 1 2 1 1 -1 2 1 0
828.4697497376BkLjkKjJj%JjJTjTJTjULkjJ%Kj%jJ%Jk%KkJ%j%LklJLjTJjJA
$$ 2 0 3 2 0 2 1 2 1 1 2 1 2 3 2 1 2 3 2 1 0 3 1 0 1 1 3 2 2 1 2 2 3 1 1 3 1 2 2 1 1 4 2 -1 0 3 2 1 2 1 2 1
815.4189287738@K%JlKj%Jj%KjTKk%jLjTJ%JT%jKJjk%k%J%Jj%TjJTk%JT%jJB
$$ 0 2 2 3 0 2 1 1 2 1 1 3 2 1 3 1 1 0 3 2 1 2 2 3 4 4 3 5 6 5 3 3 1 1 2 2 3 2 2 2 1 2 3 1 1 2 3 3 2 3 2
802.6191497376C%jKj%KlJkj%LjlK%Jj%KjTKj%JjTJ%j%J%Jj%JkKj%UjJj%jKD
$$ 3 3 2 4 3 3 5 2 3 1 0 0 3 2 -1 1 1 2 1 1 3 2 1 3 2 2 3 2 1 2 2 1 1 2 2 3 2 2 3 1 3 2 2 2 2 1 2 1 1 0 2 4
789.5683287738D%jT%UjLjUJTj%jK%k%JKkKl%VJKk%jLlKJk%TJ%TJk%TJ%j%UJB
$$ 4 4 3 2 2 2 2 1 4 3 2 1 2 3 2 2 1 3 3 1 1 2 4 2 4 1 1 1 1 1 2 4 2 2 1 4 1 3 4 2 2 2 3 3 3 4 2 2 2 3 3 2 2 2 2 3 2
775.2627287738DlJTj%jJjKjT%kJKJ%Uj%JkJ%jJ%TjK%k%K%jJ%jTKjKj%j%j%B
$$ 4 1 2 3 2 2 1 2 1 3 2 1 1 -1 0 2 3 3 3 3 2 2 3 1 2 2 1 2 2 2 1 3 3 1 1 3 3 2 3 3 2 1 3 2 4 3 3 2 2 1 1 2
762.21190781BjT%J%TJ%Tj%TJKjkJ%jJ%Tj%JjTK%TjJ%Uj%jK%Tk%Lj%j%TjA
$$ 2 1 0 0 1 1 1 2 2 2 1 1 1 2 4 3 1 2 2 1 2 2 2 1 1 2 1 0 2 2 2 1 2 2 2 2 1 1 0 2 2 2 0 0 3 2 2 1 1 1 0 1
749.1611497376A%Kl%J%Jl%L%j%TJjTJ%Jj%TkKJj%jJKjkJjJ%jJjJjKkK%k%JB
$$ 1 1 3 0 0 1 1 2 -1 -1 2 2 1 1 1 2 1 0 1 1 2 1 1 1 -1 1 2 1 1 0 1 3 2 0 1 0 1 1 0 1 0 1 0 2 0 2 2 0 0 1 2
736.36130781AJj%kK%kLj%TJk%jK%kLj%j%JjJj%TJ%KkjTLj%WjTK%TjJkLkB
$$ 1 2 1 1 -1 1 1 -1 2 1 1 1 2 0 0 -1 1 1 -1 2 1 1 0 0 1 0 1 0 0 0 1 1 3 1 0 -1 2 1 1 1 1 1 1 0 -1 1 1 1 0 1 -1 2 0 2
722.8086287738A%TkLkKjJj%TjJjJTjT%K%UkKjkLkJTjJkKjJkKj%TjJjJ%k%K@
$$ 1 1 1 -1 2 0 2 1 2 1 1 1 0 1 0 1 2 1 0 0 2 2 2 2 0 2 1 -1 2 0 1 2 1 2 0 2 1 2 0 2 1 1 1 0 1 0 1 1 -1 -1 1 0
709.75780781A%JjKkJkJj%KjTJjKkK%jJlJ%J%Jj%VJj%UjkKJj%Jj%K%Jj%jC
$$ 1 1 2 1 3 1 2 0 1 0 0 2 1 0 1 0 2 0 2 2 1 2 -1 0 0 1 1 2 1 1 1 1 1 2 1 1 1 1 0 -2 0 1 0 0 1 0 0 2 2 3 2 2 1 3
696.20510781BJ%jKjk%UKkJ%j%TKkj%K%TJ%UKTkJlKk%jJ%jTJj%JjT%LjkKB
$$ 2 3 3 2 4 3 1 1 1 1 3 1 2 2 1 1 1 3 1 0 0 2 2 2 3 3 3 3 5 7 5 6 3 5 3 3 2 3 3 2 1 2 1 1 2 1 0 0 3 2 0 2 2
682.90330781C%JTjT%Tj%j%JTjULkLkJ%j%JTj%UJ%TjTJ%jJjKj%Uj%j%ULlA
$$ 3 3 4 5 4 3 3 3 2 2 1 1 2 3 2 1 0 3 1 4 2 3 3 2 2 3 4 3 3 3 3 4 4 4 3 2 3 3 2 3 2 4 3 3 3 3 2 2 1 1 1 1 4 1 1
669.0996497376AKjK%lJ%TjJjJ%jJjTKJkJ%TjKjTKkJ%WJkTLj%J%jJ%VkKkJUlA
$$ 1 3 2 4 4 1 2 2 2 1 2 1 2 2 1 2 1 0 2 3 1 2 2 2 1 3 2 1 3 1 2 2 2 2 2 2 3 1 -1 2 1 1 2 2 1 2 2 2 2 2 0 2 0 1 2 3 0 1
654.5429707015A%UK%jUKJj%Vj%KkKj%TkJ%K%j%TJjTJKlJlJKj%Jj%Kk%VJUkB
$$ 1 1 1 1 3 3 2 1 0 2 3 2 2 2 2 2 1 1 3 1 3 2 2 2 0 1 1 3 3 2 2 2 3 2 1 2 4 1 2 -1 0 2 1 1 2 1 1 3 1 1 1 1 1 2 3 4 2 2
639.9863707015AJT%j%TkK%jK%lK%KkJkJTj%j%TjK%kLkKlKj%jK%jJk%J%Kl%B
$$ 1 2 3 3 2 2 2 0 2 2 1 3 3 0 2 2 4 2 3 1 2 3 2 2 1 1 1 0 2 2 0 3 1 3 0 2 1 1 0 2 2 1 2 0 0 1 1 3 0 0 2
627.1865287738BjTKkKkKk%KmK%kKJ%j%jKJk%JjJ%J%j%TjJ%UJjTK%jTKjTJj@
$$ 2 1 0 2 0 2 0 2 0 0 2 -2 0 0 -2 0 1 1 0 0 -1 1 2 0 0 1 0 1 1 2 2 1 1 1 0 1 1 1 1 2 1 0 2 2 1 0 2 1 0 1 0 0
614.13570781@%J%k%JUjUJ%TJkKjJj%JjKj%j%KlJ%JTl%TJjKkJTkLjJT%TjA
$$ 0 0 1 1 -1 -1 0 1 2 1 0 -1 0 0 0 1 -1 1 0 1 0 0 1 0 2 1 1 0 0 2 -1 0 0 1 2 -1 -1 -1 0 -1 1 -1 0 1 -1 2 1 2 3 3 3 2 1
600.83400781AjKkJTLkJkjTKjT%TKkJ%jJT%J%Tjk%KNML%lnlkJjJk%TJ%jJ@
$$ 1 0 2 0 1 2 5 3 4 2 1 0 2 1 0 0 0 2 0 1 1 0 1 2 2 3 3 3 2 0 0 2 7 11 14 14 11 6 3 1 2 1 2 0 0 0 1 1 0 1 0
588.0342287738A%jJTkKJLMKLnmkjTJjT%JjTJjJ%j%JjJ%JkMJjJk%kjJjJj%UJB
$$ 1 1 0 1 2 0 2 3 6 10 12 15 10 6 4 3 2 3 2 1 1 2 1 0 1 0 1 1 0 0 1 0 1 1 2 0 4 5 4 5 3 3 1 0 1 0 1 0 0 0 0 1 2
574.7324287738Aj%J%jJjJTjJkJ%jJjJjJ%jJlLjKkTLjKkjK%jJkLjkJKk%J%jA
$$ 1 0 0 1 1 0 1 0 1 2 1 2 0 1 1 0 1 0 1 0 1 1 0 1 -2 1 0 2 0 -2 1 0 2 0 -1 1 1 0 1 -1 2 1 -1 0 2 0 0 1 1 0 1
561.9325707015@JjKk%UJjJTkJjJ%jJkJ%TJ%jJ%jKkJT%kJ%j%J%TJjJjT%JTkC
$$ 0 1 0 2 0 0 0 0 1 0 1 2 0 1 0 1 1 0 1 -1 0 0 0 1 1 0 1 1 0 2 0 1 2 2 0 1 1 0 0 1 1 1 2 1 2 1 0 0 1 2 0 3
548.8818497376@MlJ%JkJkJKlJ%J%j%J%kKJmLjTK%kK%j%JkJTjKkKjJmLJkJ%C
$$ 0 4 1 2 2 3 1 2 0 1 3 0 1 1 2 2 1 1 2 2 0 2 3 -1 2 1 0 2 2 0 2 2 1 1 2 0 1 2 1 3 1 3 2 3 -1 2 3 1 2 2 3
536.08200781Dk%j%KjkLjJj%JjJj%TJ%j%j%JjKkJT%kKjTL%TJ%j%TkJTjJkC
$$ 4 2 2 1 1 3 2 0 3 2 3 2 2 3 2 3 2 2 2 3 3 2 2 1 1 2 1 3 1 2 3 3 1 3 2 1 4 4 4 5 5 4 4 4 2 3 4 3 4 2 3
523.2822287738ALj%Jj%UjKTj%KlkKjkKJj%VJjTKjTLk%UJkJT%jKjJ%j%TJTkD
$$ 1 4 3 3 4 3 3 3 3 2 4 6 5 5 7 4 2 4 3 1 3 4 3 3 3 3 3 4 3 2 4 3 2 5 3 3 3 3 4 2 3 4 4 3 5 4 5 5 4 4 4 5 6 4 4
509.4784707015D%jL%jJ%KjTKj%jKTkJVK%LKLMXkjlmnmlnTJlkjUJkJjTJ%lMD
$$ 4 4 3 6 6 5 6 6 8 7 6 8 7 7 6 8 10 8 9 10 11 12 14 14 17 19 22 26 30 34 38 42 46 44 43 40 36 31 27 24 19 14 15 12 10 9 8 7 8 6 7 6 5 6 6 3 7 4
494.92190781DJj%J%kKj%jK%kJkJ%TjKjUKjTJ%TjJTj%JkjK%JkKk%TKj%jLC
$$ 4 5 4 4 5 5 3 5 4 4 3 5 5 3 4 2 3 3 3 2 4 3 2 1 3 2 1 2 2 2 1 2 3 2 2 3 1 0 2 2 3 1 3 1 1 1 3 2 2 1 4 3
481.8710707015B%VJkL%lJkJ%J%TjJ%j%VJjTJ%UKjkKJk%J%j%kLkLlJT%j%KjB
$$ 2 2 2 2 2 3 1 4 4 1 2 0 1 1 2 2 2 1 2 2 1 1 1 1 1 2 1 0 1 1 1 1 3 2 0 2 3 1 1 2 2 1 1 -1 2 0 3 0 1 2 2 1 1 3 2 2
467.8164287738Bj%KkjJT%UkKjKjT%j%UJ%j%TK%kJ%JkJ%JkJjKlLj%j%JTjJ%A
$$ 2 1 1 3 1 0 1 2 2 2 2 0 2 1 3 2 1 1 0 0 0 0 1 1 0 0 0 2 2 0 1 1 2 0 1 1 2 0 1 0 2 -1 2 1 1 0 0 1 2 1 2 2 1
454.5146287738@%TjK%TJjKJKJ%kT%k%JkLl%jKjKlJUj%JjLJKkTjUJk%JUlK%A
$$ 0 0 0 -1 1 1 1 2 1 3 4 6 7 7 5 3 3 1 1 2 0 3 0 0 -1 1 0 2 -1 0 1 2 1 1 2 1 4 5 7 5 3 2 1 0 1 -1 -1 0 1 2 -1 1 1 1
440.9619497376AkJjKjTKkJTj%jJ%j%JkJTkLjT%jJj%LkJj%Jj%jK%jTJ%WJk%@
$$ 1 -1 0 -1 1 0 -1 1 -1 0 1 0 0 -1 0 0 -1 -1 0 -2 -1 0 -2 1 0 -1 -1 -2 -1 -2 -2 1 -1 0 -1 -1 0 -1 -1 -2 0 0 -1 -2 -1 -1 -1 -1 -1 -1 0 -2 -2 0
427.4091497376bJ%j%K%TkKjT%Kj%LljTLkJjJ%Jj%kLk%Kj%jJkKJjJjTJTkjKb
$$ -2 -1 -1 -2 -2 0 0 0 -2 0 -1 -2 -2 0 -1 -1 2 -1 -2 -3 0 -2 -1 -2 -1 -1 0 -1 -1 -3 0 -2 -2 0 -1 -1 -2 -1 -3 -1 0 -1 0 -1 -2 -1 0 -2 -3 -1 -2
414.60940781akJT%jJ%jJjJj%VJj%J%jJjJ%j%jJTjJ%jJ%j%j%JTkKj%JTj%a
$$ -1 -3 -2 -1 -1 -2 -1 -1 -2 -1 -2 -1 -2 -2 -2 -2 -2 -1 -2 -2 -1 -1 -2 -1 -2 -1 -1 -2 -2 -3 -2 -1 -2 -1 -1 -2 -1 -1 -2 -2 -3 -3 -2 -1 -3 -1 -2 -2 -1 0 -1 -1 -1
401.30760781aj%TJTk%JkKk%J%TkLkJ%UjKkLmJUj%TJkJ%jKjKkjJ%UJlL%ja
$$ -1 -2 -2 -2 -1 0 -2 -2 -1 -3 -1 -3 -3 -2 -2 -2 -4 -1 -3 -2 -2 -2 -2 -3 -1 -3 0 -4 -3 -2 -1 -2 -2 -2 -1 -3 -2 -2 -3 -1 -2 0 -2 -3 -2 -2 -2 -2 -1 -4 -1 -1 -2 -1
387.7549287738dK%j%J%UkK%UjJTj%JjJj%jJj%JjKk%jLJkJkK%jTKkJ%WJTjTJa
$$ -4 -2 -2 -3 -3 -2 -2 -2 -2 -4 -2 -2 -2 -2 -3 -2 -1 -2 -2 -1 -2 -1 -2 -2 -3 -2 -3 -3 -2 -3 -1 -3 -3 -4 -1 0 -2 -1 -3 -1 -1 -2 -3 -1 -3 -2 -2 -2 -2 -2 -2 -1 0 -1 -2 -1 -1
373.44920781b%j%TjK%TKj%jK%TJLJ2J9J6J0j6j8j2rljJjlK%j%Uj%jK%jKA1
$$ -2 -2 -3 -3 -3 -4 -2 -2 -2 0 -1 -1 -2 0 0 0 1 4 16 35 51 61 45 27 15 6 3 2 3 2 -1 1 1 0 0 0 0 -1 -1 -2 0 0 -1 1 11
362.15530781B8J7J1mj9j2j1mjkjKJTJ0J2TLj3j0rml%kLjk%jJjkK%KkJT%C
$$ 28 45 56 52 33 21 10 6 5 3 2 4 5 6 16 28 40 43 30 20 11 7 4 4 2 5 4 2 2 1 2 1 -1 1 1 3 1 2 3 3 3
351.86520781DJjKklLl%UJj%JjTLjT%UkJK%jJ%JkKk%Kk%TJjT%JkJK%k%TJa
$$ 4 5 4 6 4 1 4 1 1 1 1 2 1 1 2 1 0 3 2 1 1 1 1 -1 0 2 2 1 2 2 3 1 3 1 1 3 1 1 1 2 1 0 0 1 -1 0 2 2 0 0 0 1 -1
338.56350781@j%JTk%Jj%Jj%JkJ%Tj%J%jJKlJjK%jkJUkJj%jJTj%j%JjKkjb
$$ 0 -1 -1 0 1 -1 -1 0 -1 -1 0 -1 -1 0 -2 -1 -1 -1 -2 -2 -1 -1 -2 -1 1 -2 -1 -2 0 0 -1 -3 -2 -1 0 -2 -1 -2 -2 -3 -2 -1 -2 -2 -3 -3 -2 -3 -1 -3 -4 -2
325.5126707015akKjKlK%j%UJ%k%TKjkK%Xj%WJ%jJj%VJjJjKjTJj%kJT%TJk%c
$$ -1 -3 -1 -2 0 -3 -1 -1 -2 -2 -2 -2 -1 -1 -3 -3 -3 -1 -2 -4 -2 -2 -2 -2 -2 -2 -2 -3 -3 -3 -3 -3 -3 -2 -2 -3 -2 -3 -3 -3 -3 -3 -2 -3 -2 -3 -1 -2 -3 -2 -3 -3 -5 -4 -3 -3 -3 -2 -4 -4 -3
310.2031497376b%kJ%jKkLk%UJkjK%UKkjJj%UKJk%kKkKkLk%TKkjJjK%jJjJ%c
$$ -2 -2 -4 -3 -3 -4 -2 -4 -1 -3 -3 -3 -3 -2 -4 -5 -3 -3 -3 -3 -1 -3 -4 -3 -4 -4 -4 -4 -2 -1 -3 -3 -5 -3 -5 -3 -5 -2 -4 -4 -4 -2 -4 -5 -4 -5 -3 -3 -4 -3 -4 -3 -3 -3
296.6503707015c%jJjTLkJ%jJj%XJ%TJkJkJT%UjJ%Tj%TkJKjTKlL%TkKkLk%jf
$$ -3 -3 -4 -3 -4 -5 -2 -4 -3 -3 -4 -3 -4 -4 -4 -4 -4 -4 -4 -3 -3 -3 -2 -4 -3 -5 -4 -3 -3 -3 -3 -4 -3 -3 -3 -4 -4 -4 -6 -5 -3 -4 -5 -3 -6 -3 -3 -3 -5 -3 -5 -2 -4 -4 -5 -6
282.5957497376e%LkjKj%KkjJ%TJjT%Jj%ULk%jKkJUljJU%VkJj%J%UlLjJ%lLe
$$ -5 -5 -2 -4 -5 -3 -4 -4 -2 -4 -5 -4 -4 -4 -3 -4 -5 -5 -4 -5 -5 -5 -5 -2 -4 -4 -5 -3 -5 -4 -3 -2 -5 -6 -5 -4 -3 -3 -3 -3 -3 -5 -4 -5 -5 -4 -4 -4 -4 -7 -4 -5 -4 -4 -7 -4 -5
268.2900497376eJ%TjJ%WjJjJjTJKj%jKjTJ%Uj%J%Tj%J%kJT%VJk%JkKjJkJ%c
$$ -5 -4 -4 -4 -5 -4 -4 -4 -4 -4 -4 -5 -4 -5 -4 -5 -6 -5 -3 -4 -4 -5 -3 -4 -5 -4 -4 -4 -4 -5 -5 -4 -4 -4 -5 -5 -4 -4 -6 -5 -4 -4 -4 -4 -4 -3 -5 -5 -4 -6 -4 -5 -4 -6 -5 -5 -3
253.9844287738e%J%TjJ%Tj%TJjTKJmLjTKj%UjKkKjJjTKjJkJjJLkJjTkLjJkf
$$ -5 -5 -4 -4 -4 -5 -4 -4 -4 -5 -5 -5 -4 -5 -6 -4 -3 -7 -4 -5 -6 -4 -5 -5 -5 -5 -6 -4 -6 -4 -5 -4 -5 -6 -4 -5 -4 -6 -5 -6 -5 -2 -4 -3 -4 -5 -7 -4 -5 -4 -6 -6
240.93360781eJkKkJ%K%kKk%kK%UJk%TJ%j%J%Tj%JT%TjT%J%j%jK%j%Kj%jf
$$ -5 -4 -6 -4 -6 -5 -5 -3 -3 -5 -3 -5 -5 -7 -5 -5 -5 -5 -4 -6 -6 -6 -5 -5 -6 -6 -5 -5 -5 -6 -6 -5 -4 -4 -4 -5 -6 -6 -5 -5 -6 -6 -7 -5 -5 -6 -6 -4 -5 -5 -6 -6
227.8827707015e%jKjJl%JjJUlK%UJjJjJkLl%JjKkKmL%TjKJkjJkJ%TJ%Tj%Jf
$$ -5 -5 -6 -4 -5 -4 -7 -7 -6 -7 -6 -5 -4 -7 -5 -5 -5 -5 -4 -5 -4 -5 -4 -6 -3 -6 -6 -5 -6 -4 -6 -4 -8 -5 -5 -5 -6 -4 -3 -5 -6 -5 -7 -6 -6 -6 -5 -5 -5 -6 -6 -5 -6
214.5810707015gK%VjJ%jT%JT%kKk%JkL%lJKkJjK%kJTjULkjJKlJUk%TjJT%kg
$$ -7 -5 -5 -5 -5 -5 -6 -5 -5 -6 -7 -7 -6 -5 -5 -7 -5 -7 -7 -6 -8 -5 -5 -8 -7 -5 -7 -6 -7 -5 -5 -7 -6 -5 -6 -7 -8 -5 -7 -8 -7 -5 -8 -7 -6 -5 -7 -7 -7 -8 -7 -6 -6 -8 -7
200.77730781f%j%TJjKk%J%kJjKj%VjLk%Tj%Kj%JjkMmKj%Jj%TKj%Tk%JjJf
$$ -6 -6 -7 -7 -7 -6 -7 -5 -7 -7 -6 -6 -8 -7 -8 -6 -7 -7 -7 -7 -7 -8 -5 -7 -7 -7 -8 -8 -6 -7 -7 -6 -7 -9 -5 -9 -7 -8 -8 -7 -8 -8 -8 -6 -7 -7 -7 -9 -9 -8 -9 -8 -6
187.47560781g%UkKjJT%j%jJTkJ%UkKlKjK%j%jJjTK%TlLJjKkTKjJjJj%JKh
$$ -7 -7 -7 -7 -9 -7 -8 -7 -6 -6 -7 -7 -8 -7 -6 -8 -7 -7 -7 -7 -9 -7 -10 -8 -9 -7 -7 -8 -8 -9 -8 -9 -10 -8 -8 -8 -11 -8 -7 -8 -6 -8 -10 -8 -9 -8 -9 -8 -9 -9 -8 -6 -8
174.17380781a0K%jJ%jJ%jJ%j%WjKjTJ%TKkJ%jJkJTlK%jTKJkJjTKkK%jJkh
$$ -10 -8 -8 -9 -8 -8 -9 -8 -8 -9 -8 -8 -9 -9 -9 -9 -9 -9 -10 -8 -9 -10 -9 -9 -9 -7 -9 -8 -8 -9 -8 -10 -9 -8 -11 -9 -9 -10 -11 -9 -8 -10 -9 -10 -11 -9 -11 -9 -9 -10 -9 -11 -8
160.8720916653i%TJj%UkJU%kJj%J%TkJUj%TjJj%TJ%lK%Kl%J%TJj%TJjJ%jJa1
$$ -9 -9 -9 -8 -9 -9 -9 -9 -11 -10 -9 -8 -8 -10 -9 -10 -10 -9 -9 -9 -11 -10 -9 -8 -9 -9 -9 -10 -9 -10 -10 -10 -9 -9 -12 -10 -10 -8 -11 -11 -10 -10 -10 -9 -10 -10 -10 -9 -10 -9 -9 -10 -9 -11
147.31930781a0%kJ%J%Jj%jKj%j%VJ%kJjJjKkKJkJjT%JT%jKkJjJkjKj%JTja2
$$ -10 -10 -12 -11 -11 -10 -10 -9 -10 -10 -11 -9 -10 -10 -11 -11 -11 -11 -11 -10 -10 -12 -11 -12 -11 -12 -10 -12 -10 -9 -11 -10 -11 -12 -12 -11 -10 -10 -11 -9 -11 -10 -11 -10 -12 -13 -11 -12 -12 -11 -10 -11 -12
134.01760781a2J%jKjT%jKkKj%VJ%Tj%jLlJ%TJTjJj%j%VjJKk%lJLkJjJjJa1
$$ -12 -11 -11 -12 -10 -11 -12 -12 -13 -11 -13 -11 -12 -12 -12 -12 -12 -11 -11 -11 -12 -12 -13 -10 -13 -12 -12 -12 -11 -10 -11 -10 -11 -11 -12 -12 -12 -12 -12 -13 -12 -10 -12 -12 -15 -14 -11 -13 -12 -13 -12 -13 -12 -11
120.4648287738a2%kKj%Kj%jT%K%Tj%jK%TkjLjJkJ%jJkJKj%jJkLkKkJ%TjJ%a2
$$ -12 -12 -14 -12 -13 -13 -11 -12 -12 -13 -14 -14 -12 -12 -12 -13 -13 -14 -12 -12 -12 -14 -15 -12 -13 -12 -14 -13 -13 -14 -13 -15 -14 -12 -13 -13 -14 -13 -15 -12 -14 -12 -14 -13 -13 -13 -14 -13 -13 -12
107.9160497376a4%JjT%jLk%TJjTJ%JjTKj%TJkJjJ%jJ%jKkKjJj%TJ%l%K%Tka6
$$ -14 -14 -13 -14 -15 -15 -16 -13 -15 -15 -15 -14 -15 -16 -15 -15 -14 -15 -16 -14 -15 -15 -15 -14 -16 -15 -16 -15 -15 -16 -15 -15 -16 -14 -16 -14 -15 -14 -15 -15 -15 -14 -14 -17 -17 -15 -15 -15 -17 -16
95.3671497376a6j%TKlK%JkJjTK%jTJjJj%JTj%TJkjJ%J%jKjkJTkjKJk%Tj%b0
$$ -16 -17 -17 -17 -15 -18 -16 -16 -15 -17 -16 -17 -18 -16 -16 -17 -18 -17 -18 -17 -18 -18 -17 -16 -17 -17 -17 -16 -18 -19 -18 -18 -17 -17 -18 -16 -17 -19 -18 -17 -19 -20 -18 -17 -19 -19 -19 -20 -20 -20
82.8183707015b2LJjlKJjJ%TjJk%TJ%TJl%JUjTJjJk%Jj%UjTJjLlJ%j%UkLjb2
$$ -22 -19 -18 -19 -22 -20 -19 -20 -19 -19 -19 -20 -19 -21 -21 -21 -20 -20 -20 -19 -22 -22 -21 -20 -19 -20 -21 -20 -21 -20 -22 -22 -21 -22 -22 -22 -22 -23 -24 -23 -24 -21 -24 -23 -23 -24 -24 -24 -24 -26 -23 -24 -22
69.5165707015b3jTJ%jJjJkJjkKj%TjJj%TkMlLlK%JKJkl%jJ%KQJ8L2M0L3QI4
$$ -23 -24 -25 -24 -24 -25 -24 -25 -24 -26 -25 -26 -28 -26 -27 -27 -27 -28 -27 -28 -28 -28 -30 -26 -29 -26 -29 -27 -27 -26 -24 -23 -25 -28 -28 -29 -28 -28 -26 -18 0 32 72 105 113 94
57.97160781E9l3k3j2pmkT%Vj%ljk%WkJ%JjUJ%kLk%jJ%kJjJj%Tj%JTjVLc9
$$ 59 26 3 -9 -16 -20 -22 -24 -24 -24 -24 -24 -25 -25 -28 -29 -31 -31 -31 -31 -31 -31 -33 -32 -32 -31 -32 -33 -34 -33 -33 -35 -32 -34 -34 -35 -34 -34 -36 -35 -36 -35 -36 -36 -36 -37 -37 -36 -35 -36 -37 -38 -39 -36 -39
44.1676497376d1Lj%JlKkLjU%JkNOKMkmnoJ%l%j%VJkj%Jk%Tj%JjTJjkjkKje5
$$ -41 -38 -39 -39 -38 -41 -39 -41 -38 -39 -40 -41 -41 -40 -42 -37 -31 -29 -25 -27 -31 -36 -42 -41 -41 -44 -44 -45 -45 -45 -45 -45 -44 -46 -47 -47 -46 -48 -48 -48 -49 -49 -48 -49 -50 -49 -50 -52 -53 -55 -53 -54 -55
30.8657497376e7Jj%Tk%Jj%jlJTlJ%k%l%lJkL%k%jL%ljUljkJjm%ljkj%kK%i2
$$ -57 -56 -57 -57 -57 -59 -59 -58 -59 -59 -60 -63 -62 -61 -64 -63 -63 -65 -65 -68 -68 -71 -70 -72 -69 -69 -71 -71 -72 -69 -69 -72 -73 -74 -75 -78 -79 -81 -80 -81 -85 -85 -88 -89 -91 -92 -92 -94 -92 -92 -92
18.06580781i2j%jlo%jUlkTj%k%lklTKJlklqnoJKJmknTJmnmqTj1Upjmj2b63
$$ -92 -93 -93 -94 -97 -103 -103 -104 -105 -106 -109 -111 -113 -114 -114 -116 -116 -119 -121 -124 -127 -125 -124 -127 -129 -132 -140 -145 -151 -150 -148 -147 -151 -153 -158 -163 -162 -166 -171 -175 -183 -191 -202 -213 -224 -231 -232 -236 -248 -263
5.5168287738b80nRK6L5L9J48K24K05Q1k06k38j78r1K7J88M33O31J777O921A9306
$$ -280 -285 -276 -250 -215 -176 -28 196 401 482 276 38 -140 -231 -204 -16 417 1048 2825 9746 19306
0.2463287738B7500L925p404r239o210l741j561r57n17l52k57q9Q7J49R3A219
$$ 27500 31425 24021 14782 8572 4831 3270 2313 1796 1444 1187 1098 1185 1334 1427 1219
-3.7693712262I23k19j45o1k7j7k2l0l2k5k1rTj4j6j5j1j3j0rplnTpTkjJqA68
$$ 923 704 559 498 471 454 432 402 370 345 324 315 306 292 276 261 250 237 227 218 211 208 203 198 191 184 182 181 182 174 168
-11.5497292985A62nmjlkmjnlTjkLkTmkmjkljmlKk%TkJkKklm%kTJkmKmJkT%G7
$$ 162 157 153 152 149 147 143 142 137 134 131 130 128 131 129 127 123 121 117 116 114 111 110 106 103 105 103 103 103 101 102 100 102 100 97 93 93 91 89 90 88 84 86 82 83 81 79 79 77
-23.8477292985G9mJ%J%TJmk%UkjJj%k%j%jT%k%Uj%Tk%j%jk%k%j%JjTMmJj%E0
$$ 79 75 76 76 77 77 77 78 74 72 72 72 72 70 69 70 69 69 67 67 66 66 65 64 64 62 62 62 62 61 61 61 59 59 58 58 57 55 55 53 53 52 52 53 52 51 55 51 52 51 51 50
-36.8985502624E1jJjk%UJU%m%jTJT%k%UJmMkjKk%Jj%k%KjUJjTJkJ%TkJ%JjC9
$$ 51 50 51 50 48 48 48 48 49 50 51 51 47 47 46 45 46 47 47 45 45 45 45 46 42 46 44 43 45 43 43 44 43 43 41 41 43 42 41 40 41 40 39 40 38 39 39 39 37 38 38 39 38 39
-50.4515292985C8Jj%Tk%J%UkJTjKmKjTK%TKj%TkTJ%JQJ7L0M0L5J3j6l6l1k4E7
$$ 38 39 38 38 38 36 36 37 37 37 37 35 36 37 36 38 34 36 35 34 36 36 36 38 37 37 37 35 33 34 34 35 43 60 90 130 165 178 162 126 95 71 57
-61.2436712262D9ojkj%jJj%kTJ%Vj%jJjTJ%k%Jj%JjTKkJ%kK%UkJTl%K%TjTJB9
$$ 49 43 42 40 39 39 38 39 38 38 36 34 35 35 35 35 35 34 34 33 34 33 32 33 33 31 31 32 31 31 32 31 30 32 30 31 31 29 31 31 31 31 29 30 31 28 28 30 30 30 29 28 29 29
-74.7964502624B8J%j%UjJ%j%UKjT%J%l%JTjTJTj%WjJj%JkJ%JkLlJj%JjJjT%B3
$$ 28 29 29 28 28 28 28 27 28 28 27 27 27 27 29 28 27 27 28 28 25 25 26 27 26 25 26 27 26 26 26 26 26 26 25 26 25 25 26 24 25 25 26 24 27 24 25 24 24 25 24 25 24 23 23 23
-88.8511712262B5kjKJTklK%KkJjT%Jj%JjJkJ%Uj%UJjJjkKTjT%TJj%J%jJkJB1
$$ 25 23 22 24 25 26 24 21 23 23 25 23 24 23 22 22 23 22 22 23 22 23 21 22 22 22 22 21 21 21 21 22 21 22 21 19 21 23 22 21 21 21 22 21 21 22 22 21 22 20 21 21
-101.9019083347B0J%JkJj%jKjJjJjJkjLj%jJ%Jj%k%J%kKj%YJj%TKlKjJ%jJjA8
$$ 20 21 21 22 20 21 20 20 19 21 20 21 20 21 20 21 19 18 21 20 20 19 20 20 21 20 20 18 18 19 19 17 19 18 18 18 18 18 18 18 18 19 18 18 18 20 17 19 18 19 19 18 19 18 18
-115.7056712262A7KJlJkjLlLkJjTK%TJ%kLkJj%TjKJlKjkK%jT%KJmMjVK%KmJA4
$$ 17 19 20 17 18 16 15 18 15 18 16 17 16 15 17 17 17 18 18 16 19 17 18 17 17 17 16 18 19 16 18 17 15 17 17 16 15 15 17 18 14 18 17 16 15 14 16 16 18 14 15 14
-128.75639219A7jTJT%jJkJjKjTJjJj%JlKJjJjKjKjU%Uj%K%k%KJlLl%TLkJA6
$$ 17 16 15 16 17 17 16 17 15 16 15 17 16 15 16 15 16 15 15 16 13 15 16 15 16 15 17 16 18 17 16 15 15 15 15 14 14 16 16 14 14 16 17 14 17 14 14 14 17 15 16 16
-141.8072292985A5%Jk%TJ%Tj%JlK%TjJTjTJT%Tj%j%TJjJjK%TjTKkKlLkJjK%A5
$$ 15 15 16 14 14 14 15 15 15 14 14 15 12 14 14 14 13 14 15 14 13 14 15 15 15 14 14 13 13 13 14 13 14 13 15 15 15 14 13 15 13 15 12 15 13 14 13 15 15 15
-154.35599219A5j%UJlJjLj%lLkJT%jKjJlJT%j%JjJ%lLjTLlJKj%Tj%UJTk%A3
$$ 15 14 14 14 14 15 12 13 12 15 14 14 11 14 12 13 14 14 13 15 14 15 12 13 14 14 13 13 14 13 14 14 11 14 13 12 15 12 13 15 14 14 14 13 13 13 13 14 15 13 13 13
-167.4068502624A4jTJ%TJjJjTKJl%Kk%LkJj%jTJT%Kk%Jj%jJTkJ%JlJ%kKT%kA2
$$ 14 13 12 13 13 13 14 13 14 13 12 14 15 12 12 14 12 12 15 13 14 13 13 12 11 12 13 13 15 13 13 14 13 13 12 13 14 12 13 13 14 11 12 12 10 12 14 14 12 12
-179.9556292985A2jJ%TKjJ%TjTJ%TJjJjkKjTLkJj%VJTjU%UJ%j%J%j%TKjkLjI
$$ 12 11 12 12 12 14 13 14 14 14 13 12 13 13 13 14 13 14 13 11 13 12 11 14 12 13 12 12 12 12 12 13 14 13 12 11 11 11 11 12 12 11 11 12 12 11 11 11 13 12 10 13 12 9
-193.50839219A2%j%KJk%WkJLlJ%j%J%jJkA2
$$ 12 12 11 11 13 14 12 12 12 12 12 12 10 11 14 11 12 12 11 11 12 12 11 12 10 12
-200.0337712262A1  $$checkpoint
##END= $$ end of H NMR Data Block
##TITLE= Cinnamaldehyde-400 MHz  CDCl3
##JCAMP-DX= 5.01
##DATA TYPE= NMR SPECTRUM
##DATA CLASS= XYDATA
##BLOCK ID=2
##ORIGIN= UWSP.EDU
##OWNER= public domain
##LONGDATE= 2012/03/16 15:27:16.0925 -0500 $$ export date from JSpecView
##.ACQUISITION TIME= 1.363
##.ZERO FILL= 0
##$$.SHIFT REFERENCE= INTERNAL, Chloroform-d, 13256, 77
##.ACQUISITION MODE= SIMULTANEOUS
##SPECTROMETER/DATA SYSTEM= 400 MHz
##SOLVENT NAME= CHLOROFORM-D
##$MODELS=
<Models>
 <ModelData id="cinnam" type="MOL">
cinnamaldehyde
RLDSViewer          3D                             0

 18 18  0  0  0  0  0  0  0  0999 V2000
   23.4177  -17.7826   -0.0005 O   0  0  0  0  0  0  0  0  0  1
   24.5177  -18.3464   -0.0007 C   0  0  0  0  0  0  0  0  0  2
   24.5916  -19.8054   -0.0004 C   0  0  0  0  0  0  0  0  0  3
   23.4649  -20.5217    0.0000 C   0  0  0  0  0  0  0  0  0  4
   23.4636  -22.0047    0.0003 C   0  0  0  0  0  0  0  0  0  5
   24.6413  -22.7501    0.0002 C   0  0  0  0  0  0  0  0  0  6
   22.2380  -22.6610    0.0007 C   0  0  0  0  0  0  0  0  0  7
   24.5875  -24.1392    0.0005 C   0  0  0  0  0  0  0  0  0  8
   22.1843  -24.0497    0.0010 C   0  0  0  0  0  0  0  0  0  9
   23.3599  -24.7898    0.0009 C   0  0  0  0  0  0  0  0  0 10
   25.4089  -17.7706   -0.0010 H   0  0  0  0  0  0  0  0  0 11
   25.5368  -20.2795   -0.0005 H   0  0  0  0  0  0  0  0  0 12
   22.5349  -20.0124    0.0001 H   0  0  0  0  0  0  0  0  0 13
   25.5827  -22.2683   -0.0001 H   0  0  0  0  0  0  0  0  0 14
   21.3395  -22.0978    0.0008 H   0  0  0  0  0  0  0  0  0 15
   25.4854  -24.7034    0.0004 H   0  0  0  0  0  0  0  0  0 16
   21.2462  -24.5441    0.0014 H   0  0  0  0  0  0  0  0  0 17
   23.3203  -25.8496    0.0011 H   0  0  0  0  0  0  0  0  0 18
  1  2  2  0  0  0
  2  3  1  0  0  0
  2 11  1  0  0  0
  3  4  2  0  0  0
  3 12  1  0  0  0
  4  5  1  0  0  0
  4 13  1  0  0  0
  5  6  4  0  0  0
  5  7  4  0  0  0
  6  8  4  0  0  0
  6 14  1  0  0  0
  7  9  4  0  0  0
  7 15  1  0  0  0
  8 10  4  0  0  0
  8 16  1  0  0  0
  9 10  4  0  0  0
  9 17  1  0  0  0
 10 18  1  0  0  0
M  END
</ModelData>
</Models>
##$PEAKS=
<Peaks type="13CNMR" xUnitsExpected="ppm"  >
<PeakData id="1" title="C3,C8,C9 aromatic ~128.4" peakShape="multiplet" model="cinnam"  atoms="3,8,9" xMax="128.65" xMin="128.1"    />
<PeakData id="2" title="C6,C7 aromatic ~128.9" peakShape="multiplet" model="cinnam" atoms="6,7" xMax="129.4" xMin="128.7"    />
<PeakData id="3" title="C10 aromatic ~131.1" peakShape="multiplet" model="cinnam" atoms="10" xMax="131.6" xMin="130.6"    />
<PeakData id="4" title="C5 aromatic ~133.8" peakShape="multiplet" model="cinnam" atoms="5" xMax="134.3" xMin="133.3"    />
<PeakData id="5" title="C4 ~152.7" peakShape="multiplet" model="cinnam" atoms="4" xMax="153.7" xMin="151.7"    />
<PeakData id="6" title="C2 carbonyl ~193.6" peakShape="multiplet" model="cinnam" atoms="2" xMax="195" xMin="192"    />
</Peaks>
##.OBSERVE FREQUENCY= 100.623
##.OBSERVE NUCLEUS= ^13C
##XUNITS= HZ
##YUNITS= ARBITRARY UNITS
##XFACTOR=1.0000000000
##YFACTOR=0.52315332031250
##FIRSTX=22062.31250000
##LASTX=-1976.14843750
##FIRSTY=-14.195529687500
##DELTAX=-0.73361802
##NPOINTS=32768
##XYDATA=(X++(Y..Y))
22062.3b7K7M3nm2j7M5ok0j0k6J7Q5p7j6Q5Rr7KrO0k3M1o5N0J1k0K9m3q4Q9M4l7q2
$$ -27 0 43 38 -4 -21 24 18 -2 -12 -38 -21 64 -13 -29 56 65 -32 -30 -39 21 -2 39 -26 24 35 15 44 1 -83 6 50 13 -69
22038.1f9P2o9O8l9pQ9o7j9O9m2L2k0J4O3j26N7N4j27M1q2J00M0j02R0k0n5Q7n2l8
$$ -69 3 -66 2 -37 -44 45 -22 -41 28 -14 18 -2 12 75 -51 6 60 -67 -26 -108 -8 32 -70 20 0 -55 32 -20 -58
22016.8e8J28j6p5l0RK0N8n3l4M8R1o1q1L0O8J1n5m4qJ43n8j6o5J9m7J26l6Tj2L2j8
$$ -58 70 54 -21 -51 -42 -22 36 -17 -51 -3 88 27 -54 -24 44 55 0 -44 -52 91 33 17 -48 -29 -76 50 14 -22 -34 -2 -20
21994b0R5j9p3Q5r4kL7r4P5m0k4J27n4K3j4k5P8j10j8K9J09m1j0m9j0P6J4M4q4o3N4
$$ -20 75 56 -17 68 -26 -28 9 -85 -10 -50 -74 53 -1 22 8 -17 61 -49 -67 -38 71 30 20 -29 -39 37 51 95 11 -52 2
21971.3Bo0N9M0o2P4j0n0O0J2j1m7J8p0n6J07o2J68r5J6j60K60p2j61P0J00Kp0o5P5
$$ 2 -58 1 41 -21 53 43 -7 53 65 54 7 25 -45 -101 6 -56 112 17 33 -127 133 61 -100 -30 70 72 2 -63 12
21950A2p2N9j2Q4p7K3j6rn7J28o4PM8K0o3p4N2N1K6K9j01J5O7o7nl1N0%o6L5O2m1p9
$$ 12 -60 -1 -13 71 -6 17 1 -8 -65 63 -1 6 54 74 11 -63 -11 40 66 95 -6 9 76 9 4 -27 23 23 -43 -8 54 13 -66
21925.7f6Q1K4Mp7r6O9M5L0j6j2j8k3N8L9l8jK3J04j64O8m5J13j00pP1k5Qj8q3M3J16
$$ -66 15 39 43 -34 -130 -61 -16 14 -2 -14 -32 -55 3 42 4 3 26 130 -34 34 -11 102 2 -5 66 41 49 31 -52 -9 107
21903A07j51N8r1M9OJ16j73O8O5j21JJ64j13k9j0N1rJ02j54Q6J4lR5q5K7p6k0mk4O
$$ 107 -44 14 -77 -28 -22 94 -79 -11 54 -67 -66 98 -15 -44 -54 -3 -12 90 -64 22 36 33 128 43 70 -6 -26 -30 -54 -48
21880.9d8J47j05O7p0o1Q3O2j07N9j67J47Q9m9j13N1K9J4J5l2P7j1j13Q4n2P3m2m0
$$ -48 99 -6 61 -9 -70 13 75 -32 27 -140 7 96 47 -66 -15 14 28 43 11 88 77 -36 48 -4 69 27 -13
21861.1a3M8kOp5j2R1j9m3l5Q8O8k9q1m2L0l5kM0O9p9N4j6pkK1j7J2M5j27J21o8n1
$$ -13 35 33 39 -36 -48 43 24 -19 -54 34 102 73 -8 -50 -20 -55 -57 -17 52 -27 27 11 4 2 23 6 18 63 -64 57 -11 -62
21837.6f2P7k6n4J32o2P3r4O8q6O5r7J13j08J12l7n6l2J24l0Qlq9L6J09j23n0P3N9
$$ -62 15 -11 -65 67 5 78 -16 52 -34 31 -66 47 -61 51 14 -42 -74 50 20 28 25 -64 -28 81 -42 -92 -19 40
21817D0o5L8qL9j43L1P6O4r5K7K5N8m4r7N1Q1j73o1P3oR6Jp2Q5L7r1L6j00M7N9l3j05
$$ 40 -25 13 5 44 -99 -68 8 72 -23 4 29 87 43 -54 -3 78 -95 -156 -83 -89 7 8 -64 21 58 -33 3 -97 -50 9 -24 -129
21793.5a29J56n0l0K0N6L4m6O1j15J5L1k1q2J17J28j65M6n6Q0op6N8r7O3N8MOm4o1
$$ -129 27 -23 -53 -33 23 57 11 72 -43 -28 3 -18 -100 17 145 -20 26 -30 50 44 -32 26 -71 -8 50 54 60 16 -45
21772.2d5l3K9J4mL3m1L1MM2p0RL2k5P0N7r4J14k27J92j72K9rL7m5J03M5p7K8k9K1
$$ -45 -78 -49 -35 -39 -6 -47 -16 -12 30 -40 -31 1 -24 46 103 9 123 -104 88 -84 -55 -64 -27 -72 31 76 -1 27 -2 19
21750.2A9k2o7m0J12p2R9J09k07J63j38N8o2N1o8L4R0Q1j72J0k2RO5J34j77j8K1P0
$$ 19 -3 -70 -110 2 -70 29 138 -69 94 -44 14 -48 3 -65 -31 59 140 -32 -22 -44 -35 30 164 -13 -31 -10 60
21730.4F0P1k31J8N7n4J19j89J96j22J0O1n6Q8j0O9n1Pp3n3L9R5j3j16R6j29J39lj00
$$ 60 131 -100 -82 -25 -79 40 -149 47 -75 -65 -4 -60 28 18 87 36 43 -30 -83 -44 51 38 -78 18 -111 28 25 -75
21709.8g5NM6M5q7j16K29j6j24J99j49j06J12R6q2M0k01K82q3j22J22ll1%m2m4j7J49
$$ -75 -70 -24 21 -66 -182 47 31 -93 106 -43 -149 -37 59 -23 17 -184 98 15 -107 15 12 -19 -19 -61 -105 -122 27
21690B7j03k3J11m8L7P9j12P1p7R4j20J8L4J00j72J49k5K9mj43J14p1P8jp1n5J70j1
$$ 27 -76 -99 12 -36 1 80 -32 39 -38 56 -64 -46 -12 88 -84 65 40 69 65 -78 36 -35 43 42 -29 -84 86 75
21669.4G5j60M8pJ28r9qQ5K6l7r6P9q2P0lr9KO8N1K9r0R9K5j40N5p8q2L3J40n6j54
$$ 75 -85 -37 -44 84 -15 -23 62 88 51 -45 34 -48 22 19 -80 -78 -10 41 70 -20 79 104 -36 19 -59 -141 -108 32 -24 -178
21647.4a78K96kL7r3q4K2Tj94J17N1k2Q8p4m0N0N4j0j27J35M2q8j07J16r6J03n2J35
$$ -178 118 116 153 60 -24 -2 20 -174 -57 -6 -28 60 -14 -54 -4 50 40 -87 48 90 2 -105 11 -85 18 -34 101
21627.6A01j93P1m0J02n8p0O3%JJ0Tk5P1q9J9J05o7M9n8J50k42N1MJ17o7Q6j27mR1
$$ 101 -92 -21 -61 41 -17 -87 -24 -24 -23 -13 -3 -28 43 -46 -27 78 11 60 2 152 -90 -39 -35 82 15 101 -26 -30 61
21606.3F1n4l8M7L7n2l3L8R7L1j66o6L2M4N5Q8m1j06N2Q9o8k12M6J32J16r5j07N2L8
$$ 61 7 -31 16 53 1 -32 6 103 134 -32 -98 -66 -22 33 121 80 -26 26 115 47 -165 -119 13 129 34 -73 -21 17
21585.7A7j39P3N9j35J70r8j1M8Q2J6j75Q1J2q1l7P7J4Lk4J1L5m3L7kP1K3r0L4M8r2
$$ 17 -122 -49 10 -125 45 -53 -64 -16 66 82 -93 -12 0 -81 -118 -41 -27 -24 -48 -37 -2 -45 -8 -10 61 84 -6 28 76 -16
21563.7a6k2J2O9l3m9M4L5N2o8j1Q1o4o8m4Q9K0M0j00K1J69n2j23P3m1J5m6m7J82p9
$$ -16 -38 -26 43 10 -39 5 40 92 24 13 94 30 -38 -82 7 27 67 -33 -12 157 105 -18 55 14 29 -17 -64 118 39
21542.4C9K0K2k1N5k01J03K4j79J61l6J02j18Q8m4r7J70j40L6k1j9L4l3J6O6M0n2m8
$$ 39 59 81 60 115 -86 17 41 -138 23 -13 89 -29 59 15 -82 88 -52 -16 -37 -56 -22 -55 -39 27 67 15 -33
21522.5c3MP9n2j1J2k1k5L4%K6P3J5j63q8L23j09k26K36j33N8Q5q3TJ13k3j12J07J36
$$ -33 -29 50 -2 -13 -1 -22 -47 -13 -13 13 86 101 -62 -150 173 64 -162 74 -59 -1 84 1 -82 31 8 -104 3 139
21502A39j75k06K47o4l7Q4k8P1p9J11n6N0p9j16J56K1k4n8K3k3Mo0J63q6J23q2J29
$$ 139 -36 -242 5 -59 -96 -12 -40 31 -48 63 7 57 -22 -138 18 39 15 -43 -20 -43 -39 -99 64 -22 101 19 148
21482.2A48r5L6p0M2J0j07k3R3j63J96p9N1o2P7j56P6L6j8m5K7Q7l1m4J9L0%p3J61
$$ 148 53 89 19 61 71 -36 -59 34 -129 67 -12 39 -23 54 -102 -26 10 -8 -53 -26 61 30 -14 5 35 35 -38 123
21461.6A23j80M6jq8K07j74M6nR3n0o4O2q0J51j25Q2N2pk70K46j72J16N8j67J51j69
$$ 123 -57 -11 -12 -100 107 -67 -21 -26 67 17 -47 15 -65 86 -39 43 95 88 -182 64 -108 8 66 -101 50 -119
21442.5a19K8J25n0N6Lj1j0j3N2l5k8Q4k0j34J4L1P5j80J39n4k9J08o9P1j41K31j66
$$ -119 -91 34 -16 40 43 32 22 9 61 26 -2 82 62 -72 -58 -27 48 -132 7 -47 -76 32 -37 34 -107 124 -42
21422.7d2J30k01J96j12M8r1R2J1J8n1P7k5p1%J28j35J39j46M5o8p4J20j7j9O6k5m9
$$ -42 88 -113 83 -29 19 -72 20 31 49 -2 75 50 -21 -21 107 -28 111 -35 10 -58 -132 -12 -29 -48 18 -7 -56
21402.8e6J49o5k4Kr9J11j45J05N7p2J08m9l8q4J26j78J51%m4R7n0R0r4M2J1Q5j27
$$ -56 93 28 4 6 -93 18 -127 -22 35 -37 71 22 -16 -100 26 -152 -1 -1 -45 52 2 92 -2 40 51 136 9
21383IJ5K0J4j39J29j26N4J05r0l6N7N8j57L0J3K4M2P7p2k2o9J54j12J0on2J14o6r
$$ 9 24 44 58 -81 48 -78 -24 81 -9 -45 12 70 -87 -57 -44 -20 22 99 27 5 -64 90 -22 -12 -18 -70 44 -22 -31
21361.7c1L8K9k8L5RQ1k4k0p9L3j01N6Rj3qj26K97k35Q6Nn6J01N2j38J12N1j36j07
$$ -31 7 36 8 43 52 133 109 89 10 43 -58 -2 7 -6 -14 -140 157 -78 8 13 -43 58 110 -28 84 135 -1 -108
21341.2a08J48j28J41p4J08k27J99ll1okp6P1q2J05n7O3k4j06J21Q7j24J24j56k5K3
$$ -108 40 -88 53 -21 87 -140 59 56 25 19 17 -59 12 -70 35 -22 41 17 -89 32 119 -5 119 -37 -62 -39
21322.1c9l5k3R8n0o4J38n4J26k41N1K1J24p7K6l8J0k5P1R9q4N0j53J4%O7n3N7p6N3
$$ -39 -74 -97 1 -49 -113 25 -29 97 -144 -93 -72 52 -25 1 -37 -27 -52 19 118 34 84 -69 -55 -55 12 -41 16 -60 -7
21300.8gP7k8Q1j40p1K40j44j73K23p8l5J53n2r6P7o9L3N6p7o8P5L5Jo4P2l2L6M0J
$$ -7 70 42 123 -17 -88 152 8 -165 58 -20 -55 98 46 -50 27 -42 -9 47 -30 -98 -23 12 13 -51 21 -11 25 65 66
21279.5F6j63J67j09J2O2K4j9k9o6R3j00J75j30L8L0J9l3n7RJ07j44l9P2J00r2K0j07
$$ 66 -97 70 -39 -27 35 59 40 11 -55 38 -62 113 -17 21 51 70 37 -20 -11 96 -48 -87 -15 85 -7 13 -94
21259.6i4J59j31N3j65J30J11j72J19n4N7o8nR3O0j2j16MJ02Nr4r0J46o7O1m7Qk1O2
$$ -94 65 -66 -13 -178 -48 63 -109 10 -44 13 -55 -60 33 93 81 -35 -31 71 76 -18 -108 38 -29 32 -15 -7 -28 34
21239.1C4j5j45J11k0R5r8R2j42J36M1j80JM7L4k8N1m0P0Om0J3l3P9l5j67K02j12Q5
$$ 34 19 -126 -15 -35 60 -38 54 -88 48 89 -91 -90 -43 -9 -37 14 -26 44 50 10 23 -10 69 34 -133 69 -43 42
21218.5D2n5j3L2l8MO1j25O9j08Q5J38r8M3j12P9j5Q9K3j76O2j20K22q8Q9j23PO1l5
$$ 42 -13 -26 6 -32 -28 33 -92 -23 -131 -46 92 -6 37 -75 4 -11 78 101 -75 -13 -133 89 1 90 -33 -26 35 0
21198@J3p8L1P5k1j15Q7L1JJ9k5Lj07J92Rlr1j40N3mk9N0m0J12J53j03n6L0p1L0N0
$$ 0 13 -65 -34 41 20 -95 -8 23 24 43 18 21 -86 106 115 112 21 -119 -66 -70 -99 -49 -89 23 176 73 17 47 -24 6 56
21175.2E6J56j83j9j56L8Q0K8L9N8q7r2N4M4j28J79j99J63J0j20J01j2K5m5J12j41
$$ 56 212 29 10 -146 -108 -28 0 39 97 10 -82 -28 16 -112 67 -132 31 41 -79 22 10 35 -10 102 -39
21156.8c9J15r0m6J6M1q3R0rPj3J4J7j4l0P3j06oR4j10N0L4q9J39M9j37Rr2J24k6P6
$$ -39 76 -14 -60 -44 -3 -86 4 -5 2 -11 3 20 6 -24 49 -57 -63 31 -79 -29 5 -84 55 104 -33 -24 -116 8 -18 58
21134.8E8Rj26P6j3j6j20J38K6j21n7J77L6j03n7J87j56L3QJ52j00k8k5R1j04k9R0
$$ 58 67 -59 17 4 -12 -132 6 32 -89 -146 31 67 -36 -93 94 -62 -29 -21 131 31 3 -22 69 -35 -64 26
21115.7B6n7N4m3l9j3J43j11m0N1r3J17k3O3j12O1J06j74J20Omj8p6n8l9L9J22P9M4
$$ 26 -31 23 -20 -59 -72 71 -40 -80 -29 -122 -5 -28 35 -77 -16 90 -84 36 42 38 20 -56 -114 -153 -114 8 87 131
21095.1A31j00p8P9J0j61J65q4m5J86o9j21J00L3J03k02J16L3j41R4j25R7%n3O3m5
$$ 131 31 -47 32 42 -119 46 -38 -83 103 34 -87 13 46 149 -53 63 96 -45 49 -76 21 21 -32 31 -14
21076.8a4MJ72j80n4QQ3j57J35k8P2m5J21j77mJ21p2J1n6L5P7k3j08M1O3L4o1L9k2
$$ -14 -10 162 -18 -72 -64 19 -138 -3 -31 41 -4 117 -60 -64 57 -15 -4 -60 -25 52 29 -79 -38 25 59 -2 37 15
21056.2A5j36J69j11l3J48o7J0MP1p3O3m2j32O9M3Or6Q5O5N0m3n2j15J57O9j33Mn3
$$ 15 -121 48 -63 -96 52 -15 -5 -1 70 -3 60 18 -114 -45 -2 4 -92 -7 58 108 65 13 -102 55 124 -9 -5 -58
21035.7e8o2J56o9P7j49P3rm1Q8%Mo8Q1n2J35j65%J35p4j8Oj15J55j04J4L2P5j3K6
$$ -58 -120 36 -33 44 -105 -32 -41 -82 6 6 10 -58 23 -29 106 -59 -59 76 2 -16 -10 -125 30 -74 -60 -28 47 34 60
21014.4F0m6J3o0M6M2p4L5l0n6J27j10L4j6qj34K18p4j02K46j58Q4j86J09J95j36p3
$$ 60 14 27 -33 13 55 -19 16 -14 -70 57 -53 -19 -35 -43 -177 41 -33 -135 111 -47 37 -149 -40 155 19 -54
20995.3e4N5k6j9Q2l5M3n2M7J45j27L0j04p7J54r0M7qM1K2M8j61k7N6M2m5k4R6n0r
$$ -54 1 -25 -44 38 3 46 -6 41 186 59 89 -15 -92 62 -28 19 11 52 74 122 -39 -66 -10 32 -13 -37 59 9 0
20974@J25q3l0l5%N6n7N3K3j56Q7J01M6n0k49K46op8r4Q6J36m7j30M7j02P2m1J07M2
$$ 0 125 42 12 -23 -23 33 -24 29 52 -104 -17 84 130 80 -169 77 71 -7 -101 -15 121 74 -56 -9 -111 -39 -80 27 69
20952.7F9j21NKJ46j26O0n4N8r4O9n7P6q1M7K9j08Q3kN9q9j1J9m2K4P6o6k8M4l4J12
$$ 69 -52 -47 -45 101 -25 35 -19 39 -55 14 -43 33 -48 -1 28 -80 3 1 60 -29 -40 -21 -63 -39 37 -29 -57 -13 -47 65
20930.6F5n7j06qR4l4J01j39K31j65J2q4O9R1M6p7j12J08p9L3k2m8J30J16l3j92J43
$$ 65 8 -98 -106 -12 -46 55 -84 147 -18 -6 -90 -21 70 116 39 -73 35 -44 -11 -33 -81 49 165 132 -60 83
20911.5H3j05n3J02n7K9k5J06j53J73q6o2k7N4j8j4J00l6k7J7N7o4p8M5N8r3J77m4
$$ 83 -22 -75 27 -30 -1 -26 80 -73 100 14 -48 -75 -21 -39 -53 47 11 -16 1 58 -6 -84 -39 19 -74 103 59
20891.7E9J2J7p4r3O9M6j13j1J13q5RN7P4j38J26k4q3QN2L8j15P6j05O6J43k06P1q
$$ 59 71 88 14 -79 -10 36 -77 -88 25 -60 -51 6 80 -58 68 44 -39 -31 21 59 -56 20 -85 -19 124 -82 -11 -19
20871.2a9L2j70R7N8lP0j25O9m6N0j25R5N8J06n9l7q2M2r9K07k10J09j54K29j50J09
$$ -19 13 -157 -60 -2 -5 65 -60 9 -37 13 -112 -17 41 147 88 51 -31 11 -88 119 -91 18 -136 93 -57 52
20852.1E2L3p3m5K9lO1n5QJ07j62n9L4N1n8O5j0J1p7J98n1j84M2O3N6k4j46N7N1M6
$$ 52 85 12 -33 -4 -7 54 -1 7 114 -48 -107 -73 -22 -80 -15 -25 -14 -91 107 56 -128 -86 -23 33 9 -137 -80 -29 17
20830.8A7J8p7l7J11q8j28J76k2r4J45p3j7N6R3n4l0J13l8n5J23j77QTK1o8N8j00O9
$$ 17 35 -42 -79 32 -56 -184 -8 -30 -124 21 -52 -69 -13 80 26 -4 109 71 16 139 -38 -30 -22 -1 -69 -11 -111 -42
20810.2d2m0P9q3J28Krl0o9R2n1n5J32J8o1M3j30J46n8M0q0%J50k02R9J2m4n1n2O1
$$ -42 -82 -3 -86 42 44 35 5 -64 28 -23 -78 54 72 11 54 -76 70 12 52 -28 -28 122 -80 19 31 -13 -64 -116 -55
20788.9e5K3J2N5K6j46J45p3P9O0j52q7J22J02p4o7k8l8P1K7L0j26N4J21M0p1n5RJ6
$$ -55 -32 -20 35 61 -85 60 -13 66 126 -26 -113 9 111 37 -30 -58 -96 -25 2 32 -94 -40 81 121 50 -5 4 20
20768.3B0j10J6j5p7J18R1j17J45j27J25l7l0Qq5K2J57j12J5p6R0n5j34J59o8J32L6
$$ 20 -90 -74 -89 -166 -48 43 -74 71 -56 69 32 2 10 -75 -53 104 -8 7 -69 21 -34 -168 -9 -77 55 91
20749.3I1o1k6O6l1m6J10j01j45J93j2j53J35p%j08J60o6q0J25l7K6q6J12kj00J0J31
$$ 91 30 4 70 39 -7 103 2 -143 50 38 -115 20 13 13 -95 65 -1 -81 44 7 33 -53 59 57 -43 -33 98
20729.4I8m8k19L00k17M8mk5k3M7j2JR0j41O1M2j5O1n3p7K25j18M4j04K9J9o2J39j47
$$ 98 50 -169 131 -86 -38 -42 -67 -90 -43 -55 -54 36 -105 -44 -2 -17 44 -9 -86 139 21 65 -39 -10 9 -53 86 -61
20708.9f1K8K7M0J8j12J60q0J75j56j0p9Q7n5M7k8M3j34rO1J9l5J07j47L6P5%q3oK59
$$ -61 -33 -6 34 52 -60 100 20 195 39 29 -50 37 -18 29 1 44 -90 -99 -38 -19 -54 53 -94 -58 17 17 -66 -72 187
20687.6A87k42j17J69m8J02m3M8m1k03Q3J96r3q8J30M5j81O6N4l3J16J5r9j04N3L6
$$ 187 -55 -172 -3 -51 51 8 56 15 -188 -105 91 -2 -90 40 85 -96 -30 24 -9 107 122 23 -81 -28 8
20669.2Ho9lJ02j41O9J39j25J3qO8O1j03j08J74O0l00K21j41J30qn7N5Qj8nMp9j76
$$ 8 -61 -64 38 -103 -34 105 -20 -7 -15 53 114 11 -97 77 137 -163 58 -83 47 39 -18 37 45 27 22 26 -53 -229
20648.6b29K12M6o4K4L7p2P5p6PO6r9O0Tj35j02K78p4j32K09p8J9J8l8O7k1j17J18
$$ -229 -17 29 -35 -11 26 -46 29 -47 -40 26 -73 -13 47 -88 -190 88 14 -118 91 13 32 50 12 79 58 -59 59
20628.8E9j35J40k12J51N9j14K0TO7n9K8L7l5K5N3j88N4j7M7r0J28n3N2l0N4j05J42
$$ 59 -76 64 -148 3 62 -52 -32 -12 55 -4 24 61 26 51 104 -84 -30 -47 0 -90 38 -15 37 7 61 -44 98
20609I8J6k49N6L3q6J88rLj9r4n5P4n0Q7L7j6k9R0l4j38K35j41j9p9J20n1P4n5k0k3
$$ 98 114 -135 -79 -46 -132 56 47 50 31 -63 -118 -44 -94 -7 30 14 -15 75 41 -97 138 -3 -22 -101 19 -32 42 -13 -33 -56
20587e6q0J47m7m6K5N4J12j57L1k9K4m6O5N1K2j18J4M9j6oJ9p8N0q1N3j09J97k3P3
$$ -56 -136 11 -36 -82 -57 -3 109 -48 -17 -46 -22 -68 -3 48 70 -48 -34 15 -1 -7 12 -66 -16 -97 -44 -153 44 21 94
20565.7I4%j20J2O6j11J2K1L2j4K6M7j08R8m8L1j27N2j01J23K0J02j5j58P8j22M6J67
$$ 94 94 -26 -14 52 -59 -47 -26 6 -8 18 65 -43 55 7 38 -89 -37 -138 -15 5 107 92 -66 12 -110 -64 103
20545.8A03j79Q1m9q6O9J32r7j84J32P2M1j13J28N6p6m8k4J08qj28R3MJqk2J5n4N0
$$ 103 -76 5 -44 -130 -61 71 -26 -210 -78 -6 35 -78 50 106 30 -18 -42 66 58 -70 23 27 28 20 -2 13 -41 9
20525.3IR0k76J46J34j32J1Rnl4J45j47J4K5K3q3M0M5p0R5p9L0J2j27R1p7J06m3J87
$$ 9 99 -177 -31 103 -29 -18 -9 -14 -48 97 -50 -36 -11 12 -71 -31 14 -56 39 -40 -10 2 -125 -34 -111 -5 -48 139
20504.7A39j31l6qJN7Lk6j5J0j03O2K55j76J2q7N4R8j88P9l7R2l9J1p5J78j70R4k3
$$ 139 8 -28 -36 -35 22 25 -1 -16 -6 -109 -47 208 32 44 -43 11 109 -79 0 -37 55 16 27 -48 130 -40 54 31
20484.1C1m6%m7l8J92m8j26J29P5k34J35qL3n5M9M2k2j26m2J77j56m9J65q3OM6j59
$$ 31 -15 -15 -62 -100 92 44 -82 47 122 -112 23 15 48 -7 42 84 62 -64 -106 71 -85 -134 31 -52 -46 0 -159
20464.3a59R7R4l8jK5o8J68j96J42o5l1Q2j20k1J05K6j20J47J9n4j50J48q2K0Q6l0
$$ -159 -62 32 -6 -7 18 -50 118 -78 64 -1 -32 50 -70 -91 14 40 -80 67 86 32 -118 30 -52 -32 54 24
20445.2B4L7o7j54J36J00j19O2k6l5m3P8P2p3K5K3j22K7N4q4M5l1J08j07O9j28P0k
$$ 24 61 -6 -160 -24 76 -43 19 -7 -42 -85 -7 65 -8 17 40 -82 -55 -1 -85 -40 -71 37 -70 -1 -129 -59 -61
20425.4f1Q4j5J2L6j2O4j12n5Qk0nN0J20j51QQ9j2K8j80O0MP7m2P2j31J09j22k3J13
$$ -61 23 8 20 56 44 108 -4 -59 -51 -71 -76 -26 94 -57 -49 40 28 56 -124 -64 -60 17 -25 47 -84 25 -97 -120 -7
20404.1goJ50j53J93j24k07K08k3j37J10j52J42J69k44J7J26ln7o8NJ59k0L6j09l2
$$ -7 -13 137 -16 177 53 -154 54 31 -106 4 -148 -6 163 -81 -64 62 59 2 -66 -61 98 78 114 5 -27
20385.7b7J35j56Pm8Q7j79K68p3M4j16J22j59M4lN6j06J65m2%j49J18o3R7o7N2m7o3
$$ -27 108 -48 -41 -89 -2 -181 87 14 58 -58 64 -95 -51 -54 2 -104 61 19 19 -130 -12 -75 22 -45 7 -40 -103
20365.9a03R6k1o8J59Qk3J14k04K9P6j57P4q0Q4j26P1J09J1p9o4K09j54NJ33k6o2J4
$$ -103 -7 -28 -96 63 71 48 162 -42 -13 63 -94 -20 -100 -16 -142 -71 38 49 -30 -94 115 -39 -34 99 73 11 25
20346.1B5m8m9J42j86J48Oj13K1J97j34k2%k7jJ17j89J35O8j27m8J03o9M3j4j5J21
$$ 25 -23 -72 70 -116 32 38 -75 -54 143 9 -13 -13 -40 -41 76 -113 22 90 -37 -85 18 -51 -8 -22 -37 84
20327H4j24R0oq3K7j3J47j23K3P4r3L0TO8k36O3L1J02p4q2Q5n8O5J5k4j14M0O5p4M9
$$ 84 -40 50 44 -39 -12 -25 122 -1 22 96 3 33 63 131 -105 -42 -11 91 17 -65 20 -38 27 42 18 -96 -56 9 -65 -16
20305a6Q0j73K07j06L4j23M4J52j5n6%k8P5j64J38mlM1o1j6J15j50K5j09RK18j42O1
$$ -16 64 -109 98 -8 26 -97 -53 99 84 28 28 0 75 -89 49 45 42 83 22 6 121 -29 -4 -113 -104 114 -28 33
20284.4C3n3n5J44PK2J0j46M2k2N1M1j24M3j7K0rj5K7M6k6j18N2%M0p4J13o3L3j5J9
$$ 33 -20 -75 69 76 98 108 -38 4 -18 33 74 -50 -7 -24 -4 -13 -28 -1 45 19 -99 -47 -47 -7 -81 32 -31 2 -13 6
20262.4Fr1J46q6k6l0O2NO8q2R1K7j18p0J03M7j27P2l8J17j26k9r1J56M0J5j09J15
$$ 6 -85 61 -25 -51 -81 -19 -14 54 -28 63 90 -28 -98 5 52 -75 -3 -41 76 -50 -79 -170 -14 26 41 -68 47
20242.5D7n6q7OM3J73j44jon0O8q9K1J51k41J17R5k2P4K6o6O1p8p9%j7J63j72J9J06
$$ 47 -9 -96 -90 -47 126 -18 -19 -25 -75 -7 -96 -75 76 -165 -48 47 25 99 125 59 120 42 -37 -37 -54 109 -63 -44 62
20221.2F2j00m8K7r9K71j40J2L2TkOq8j3o1Q8M8K6q5N1M8k76J09P7q1R0J2J11n1Pp6
$$ 62 -38 -86 -59 -158 113 -27 -15 17 49 47 53 -35 -48 -109 -21 27 53 -32 19 67 -209 -100 -23 -104 -14 -2 109 58 65 -11
20199.2a1m8l6J81k00M9Q9j0J01j27J06k72J12%J63k33J88j01R3j02o0R4J03j15o4
$$ -11 -59 -95 86 -114 -65 24 14 115 -12 94 -178 -66 -66 97 -136 52 -49 44 -58 -118 -24 79 -36 -100
20181.6a00J19J3r4J14j44R2k5K5L2j69J03QK5k7n3J54j02N2p0l5l4J24m1K0L8j23
$$ -100 19 32 -62 52 -92 0 -25 0 32 -137 -34 -26 -1 -28 -81 73 -29 23 -47 -82 -116 8 -33 -13 25 -98
20162.5i8K22q8k9r5J67n3N0o0j9j0O7m5j01j5P3n1M1l6R1J5K2o8K9Tk2k1n5P4N2m2
$$ -98 124 36 7 -88 79 26 76 16 -3 -13 54 9 -92 -107 -34 -85 -44 -80 11 26 48 -20 9 38 16 -5 -60 14 66 24
20140.5B4k5jm0J1M2M0J1L0m7p6K4N4p7L1jl1l0N8L2m9j8K8N6P9j46L5l7j1J23q1O9
$$ 24 -1 -2 -42 -31 11 51 62 92 45 -31 -7 47 -30 1 0 -31 -61 -3 29 -20 -38 -10 46 125 -21 14 -23 -34 89 8 77
20117.7G7j07j2l4rJ85o6j5p9J13J8j55P6K3j6P3j24o5J25q7R1j8J0M3J7k00Q4P3j8
$$ 77 -30 -42 -76 -85 100 34 19 -60 53 71 -84 -8 15 -1 72 -52 -117 8 -79 12 -6 4 47 64 -136 -52 21 3
20097.1Cm3o1J14NJ39j91J3J66j35j48J70l2K8oo6L7M2j12q1J16m5J32l4M7l3k5M1
$$ 3 -40 -101 13 18 157 -34 -21 145 10 -138 32 0 28 22 -44 -7 35 -77 -158 -42 -87 45 11 58 25 0 41
20077.3D1k7lQ8Jj32l3J00k2K7j00m3N6J5O2%J5j03L0N4l7o1Q5k4O8n5M9n9k02J19
$$ 41 14 11 99 100 -32 -65 35 13 40 -60 -103 -47 -32 30 30 45 -58 -28 26 -11 -72 13 -11 57 2 51 -8 -210 -91
20056i1J25J01j06o9Q0P3j43k2J48j39p5K13q2N5m6N3j77Q9o2Q9l0M5p0K2p4J06Rk6
$$ -91 34 135 29 -40 40 113 -30 -52 96 -43 -118 95 13 68 22 75 -102 -13 -75 14 -16 29 -41 -19 -93 13 22 -4
20035.4dK4q1J33p5j8o8J06P7j43LJ47j07p4J33j02M5O4q7j1M0J6J7j66K33k05N6l
$$ -4 20 -61 72 -3 -21 -89 17 94 -49 -46 101 -6 -80 53 -49 -4 60 -27 -38 2 18 35 -131 102 -103 -47 -50
20015.6e0J39j38R0j60J91k11K34j71K06j06M2L2r1j47QJ72k4j32K11p6n1R6j46N3
$$ -50 89 -49 41 -119 72 -139 95 -76 130 24 66 98 7 -140 -132 40 16 -116 95 19 -32 64 -82 -29
19998b9P1j62K5O2M3L5k9j22K07l5n5k1o4Q8Jm6Tl2J15j2Q9j90J32m6K9j2L0L5q3n
$$ -29 42 -120 -95 -33 10 45 16 -106 101 66 11 -10 -74 14 15 -31 -77 -109 6 -6 83 -107 25 -21 8 -4 26 61 -22 -27
19976b7%P4j95J12j38J90m7n5NO4j09M6Q7k9q0J33r4m7J02l7q1J18J1M7o0q0P1k4J59
$$ -27 -27 47 -148 -36 -174 16 -31 -86 -81 -17 -126 -80 7 -22 -102 31 -63 -110 -8 -45 -126 -8 3 50 -10 -90 -19 -43 116
19954.7A16%j33Q9p8p9J42j37J4j7J31n7k9l1k5R3J12j73LQ3Mp3q6R3J71l1j63M8j8
$$ 116 116 -17 72 -6 -85 57 -80 -66 -83 48 -9 -38 -69 -94 -1 111 -62 -59 24 28 -45 -131 -38 133 102 -61 -13 -31
19934.1c1o6%K4R5J4k9J8k6P2j04j46K01l5l3oM2L2J7p7j0L4l4r6J92j2Qo5J13j02
$$ -31 -97 -97 -73 22 36 7 25 -1 71 -33 -179 22 -13 -46 -52 -10 22 39 -38 -48 -14 -48 -144 48 36 44 -21 92 -10
19912.8a0k5p5J16k5O2o1R5o1J02j45N4l2P8nn9M4k01R8J5J94j02n8q1l9O4K29j33
$$ -10 -35 -110 6 -19 43 -18 77 16 118 -27 27 -5 73 68 9 53 -148 -50 -35 159 57 -1 -82 -121 -57 172 39
19893C9p0m6J53j90N4P4p6Q0m6l1J8N1j30R7N3j23J88j90k4J56p4L8o9M%L6l5MJ52
$$ 39 -31 -77 76 -114 -60 14 -62 18 -28 -59 -41 10 -120 -23 30 -93 95 -95 -119 37 -37 1 -68 -64 -64 -28 -63 -59 93
19871.7I3r0q0J36l2q0J31j53P7J4M7k2k7l0M4j09pQ9m7J21j59Q4pQ7p3j08K35q0n0
$$ 93 3 -77 59 27 -53 78 -75 2 16 63 41 14 -16 28 -81 -88 1 -46 75 -84 0 -7 80 7 -101 134 54 4
19851.1Dn3n2M9R8k7m0n6Q8K0j18J68j36j9l8J66oN4j09m8%P0pp5jk5J64p4L5Mj11
$$ 4 -49 -101 -52 46 19 -21 -77 11 31 -87 81 -55 -74 -112 54 48 102 -7 -55 -55 15 8 -67 -68 -93 71 -3 32 36 -75
19829.1g5qp5J30L2P7J1k09J17l8pK3J21j86J49p9J7kk5Q3L4p3r3J03K3K4k29k0J10
$$ -75 -83 -158 -28 4 81 92 -117 0 -38 -45 -22 99 -87 62 -17 0 -2 -27 56 90 17 -76 27 50 74 -155 -175 -65
19808.5f5J4K9L3Q6k14NO5k7q0K05j11J32j20m8J0J37o3J36j66J0n8Q1J2j13J0O6m7
$$ -65 -51 -22 11 97 -117 -112 -47 -74 -154 51 -60 72 -48 -96 -86 51 -12 124 -42 -32 -90 -9 3 -110 -100 -34 -81
19788.7h1N2l8K8R1p6M0O0j89R9K2%j3K4m5mj3m1k9J72l4j02N5K30j81K5o5J28j33
$$ -81 -29 -67 -39 52 -24 16 76 -113 -14 8 8 -5 19 -26 -30 -43 -84 -113 59 25 -77 -22 208 27 52 -13 115 -18
19768.1a8k2nJ67j45K9k3l6J24j23N5J35j17j27J65q2J24j24k7J12j10j4R6r4J2K08
$$ -18 -40 -45 122 -23 6 -17 -53 71 -52 3 138 21 -106 59 -23 101 -23 -50 62 -48 -62 34 -60 -48 160
19749.8A60j73p2J43o7Q8p2L1k6n9R8k1j19J30p3N4J1n2M4j42j7J37M2j31O8l6j24
$$ 160 -13 -85 58 -9 79 7 38 12 -47 51 30 -89 41 -32 22 33 -19 25 -117 -134 3 45 -86 -18 -54 -178
19730.7a78J26M8pR0j39M6L6k06R8J65k7j4j36J62l1j56J31O0r1r3J28Ro1m9J09M4
$$ -178 -52 -4 -11 79 -60 -14 22 -184 -86 79 52 38 -98 64 33 -123 8 68 -23 -116 12 21 -40 -89 20 64
19711.6F4j29R8J07j71L6n3O7o7J26j30j17J65n5rJ7J07Jo2k5J50j65L3m6l3J60o0
$$ 64 -65 33 140 -31 5 -48 19 -48 78 -52 -169 -4 -59 -68 -51 56 57 -5 -30 120 -45 -12 -58 -91 69 9
19692.5IK6n3N6l8k4J17j16l7N0QM9Mp8M6k4J54n1j20L6j4k2rk0l3O7P0l5j43oP2R4
$$ 9 35 -18 38 0 -24 93 -23 -60 -10 -2 47 51 -27 19 -5 149 98 -22 14 0 -22 -31 -51 -84 -17 53 18 -125 -131 -59 35
19669.7C5l7j6p8K17k36J96j55J40q8j31Q3Q2j30J18j09J33p2L1Q5p5j9j3n1M3J4P0
$$ 35 -2 -18 -96 121 -115 81 -74 66 -22 -153 -70 12 -118 0 -109 24 -48 -17 68 -7 -26 -39 -90 -47 -33 37
19650.6C7j72K18n9j52J62j35K3N2j06R2n7N2J37j19nJ48q2n7j4q7J24Kj25O5N0o7
$$ 37 -135 83 24 -128 34 -101 -78 -26 -132 -40 -97 -45 92 -27 -32 116 34 -23 -37 -124 0 2 -123 -58 -8 -75
19631.5g5J6j2L9K0p3J33n9Jq2J51nK9jr3M3k5j25P1Po7R1j06Q1J4J9L1j02K06k11
$$ -75 -59 -71 -32 -12 -85 48 -11 -10 -92 59 54 83 82 -11 32 7 -118 -47 -40 -107 -16 -122 -41 -27 -8 23 -79 127 -84
19610.2h4J05j2N1r8P8l4mj35J22R7k03J01j04J07K4k3n8l6O4%L1oOp5M0J71j61M5
$$ -84 21 9 60 -38 40 6 2 -133 -11 86 -117 -16 -120 -13 11 -12 -70 -106 -42 -42 -11 -17 -11 -86 -46 125 -36 9
19589.7IpJ57r7l0j16M4M8K3m6M5l9l0o0R1K08k07n5N9j23J03lN7k7L3J1j84Q8J10
$$ 9 2 159 62 32 -84 -40 8 31 -15 30 -9 -39 -99 -8 200 -7 -62 -3 -126 -23 -26 31 4 37 48 -136 -48 62
19569.1F2j7q6O2l2M6Oj34J35j17k6R4K7p3M0q5J00Oj04J9j0J9J81q9j4rj5KJ43j31
$$ 62 45 -41 21 -11 35 41 -93 42 -75 -101 -7 20 -53 -13 -98 2 8 -96 -77 -87 -68 113 24 10 1 -14 -12 131 0
19547.8@M6n5N6lj43J12N2o9m1R5m0N1j41N4M0j13R7J6O2o8q6M8J04r2n7o3J1J03j24
$$ 0 46 -9 47 44 -99 13 65 -4 -45 50 10 61 -80 -26 14 -99 -2 14 76 8 -78 -30 74 -18 -75 -138 -127 -24 -148
19526.5a48Q2J08o7TJ25qm3l1k9J89j90m1O4m4q3K35k8j10K3K1o1J58m8j2j28J27o4
$$ -148 -66 42 -25 -92 33 25 -18 -49 -78 111 -79 -120 -56 -100 -183 52 24 -86 -63 -42 -103 55 7 -5 -133 -6 -70
19506.7g0J64j96J25k3l5J6o0m3J09O4k42J67p7P4q4J36q6o6J51o5%mj4q2N5j01Q8
$$ -70 94 -102 23 0 -35 -19 -79 -122 -13 51 -191 -24 -101 -27 -111 25 -61 -127 24 -41 -41 -45 -59 -141 -86 -187 -99
19486.9i9m4j0J0p2j6n7J24k21M75K549K139L250o907l76k48j34k6j88p0K6J11j56
$$ -99 -143 -153 -143 -215 -231 -288 -164 -385 90 2639 4778 8028 1121 745 497 363 337 149 79 105 216 60
19470.7F0L1R1n3Kk7K2k9N8j69kK08k27J3Q2P1M8k32J18p1j21J94P1k03J99n9Rk4j3
$$ 60 91 182 129 131 104 126 97 155 -14 -16 192 -35 -22 60 131 179 -53 65 -6 -127 67 138 -65 134 75 84 60 47
19450.1D7J49j75o3P0N2j18k6j2J47Qp3Mk3J8K16k56P8J03j21J14k14mK25j66KM6O
$$ 47 196 21 -42 28 80 -38 -64 -76 71 79 6 10 -13 5 221 -35 43 146 25 139 -75 -79 146 -20 -18 28 34
19430.3C4J9k7q7J47j20K5M4J4o5OJ05k5j06o5J58Rj73J92o5R0j11m6M6O1N8k42K23
$$ 34 53 26 -61 86 -34 -9 35 49 -16 -10 95 70 -36 -101 57 66 -107 85 20 110 -1 -47 -1 60 118 -124 99
19410.5I9j66n9J66J25k29N1M0M4k5K0j73J7J35n3J6j09J01K6L9l9jL9m2r2N5p8J08
$$ 99 -67 -126 40 165 -64 -13 27 71 46 66 -107 -90 45 -8 8 -101 0 26 65 26 25 64 22 -70 -15 -93 15
19390.7A5L5j10J25q0O7j66J18j9N1p6j22J92L0j53J24l8K9M6l1j0j03P0Q8j04R1m8
$$ 15 50 -60 65 -15 52 -114 4 -15 36 -40 -162 30 60 -93 31 -7 22 68 37 27 -76 -6 82 -22 69 21
19371.6B1L4k5M4N9m1j10J32k3K8k11J72k23J45M7Q0j65K4N4l9K3J01l09J86r1J00
$$ 21 55 30 74 133 92 -18 114 91 119 -92 80 -143 2 49 129 -36 -12 42 3 26 127 -182 4 -87 13
19353.2A3n9J00r4mJ7J5m8J69k8p5k1j13J22Jk4lJ12m9j0M1R5j34LM5k4J2Jj1N6k6
$$ 13 -46 54 -40 -44 -27 -12 -60 109 81 6 -15 -128 -6 -5 -29 -32 80 31 21 62 157 23 26 71 47 59 60 49 105 79
19331.2G9j36M9J1L7j26P0R2m0pN6j55J61q1N7l5l3o0K1j5J12j09n2R5K3j6n6J3n7
$$ 79 -57 -8 3 40 -86 -16 76 36 29 85 -70 91 10 67 32 -1 -61 -40 -55 57 -52 -104 -9 14 -2 -58 -45 -102
19310.6a02J17qL0m8j3K7Kr2R2q4NM3oK6k3K1J79k32J12l1k6q0N9k8J4RO0K4M3l8j05
$$ -102 15 7 37 -11 -24 3 5 -87 5 -79 -74 -31 -37 -11 -34 -13 166 -66 46 15 -11 -91 -32 -60 -46 -37 23 47 90 52 -53
19287.8e3O1k3n9J02P3j06Q7j59J12o7k2R9q0P8l3n9O2O3j41R0K0n2J2m5LQ5j19KJ29
$$ -53 8 -15 -74 28 101 -5 82 -77 35 -32 -54 45 -35 43 10 -49 13 76 -65 25 45 -7 5 -40 -37 48 -71 -69 60
19266.5F0l4n0L8j14J84p5o5J6j2j4N0P2l5m4mJ12j50M3L0n1o3Q6P5Pn2k3L5j9Oq7
$$ 60 26 -24 14 -100 84 9 -56 -40 -52 -66 -16 56 21 -23 -27 85 -65 -22 8 -43 -106 -20 55 62 10 -13 22 3 9 -78
19244.5g8M8R7l8j60O5N8o0m4K19j01KM0p2M1l3n7R1%q0J04q4n3P7m7k5P5J59j69L8
$$ -78 -30 67 29 -131 -66 -8 -68 -112 107 6 8 48 -24 17 -16 -73 18 18 -62 42 -42 -95 -18 -65 -90 -15 144 -25 13
19223.2A3R4j84p9K62k30K36rj40K7OJ0j09N7L3p4M6L4L9o6M9n8J01j17J09j28K2Q4
$$ 13 107 -77 -156 106 -124 112 103 -37 -10 -4 6 -103 -46 -13 -87 -41 -7 32 -34 15 -43 58 -59 50 -78 -56 28
19203.4B8r0O3J2o4J17r9K1l3L5Oq9L2L4M5k4J23q0q9K1J23r2Q2o1P1j68J13m6m1J6
$$ 28 -62 1 13 -51 66 -33 -12 -45 -10 -4 -93 -61 -27 18 -6 117 37 -52 -31 92 0 82 21 92 -76 37 -9 -50 -34
19182.1c4J32j9M8k36J58n9Q0n1k1mn9jJ06l6m5M2J6mq8J04j58M1R8j6m7l5P6rn5N5
$$ -34 98 79 127 -109 49 -10 70 19 -2 -6 -65 -66 40 4 -41 1 17 13 -75 29 -129 -88 10 -6 -53 -88 -12 -21 -76 -21
19160.1b1p8J63q9M0j08J09L0l3k7J58j14j06N7m1M6J1Rnj16J59p7J3q5L3J27p9n1
$$ -21 -99 64 -25 15 -93 16 46 13 -14 144 30 -76 -19 -60 -14 -3 6 1 -115 44 -33 -20 -105 -72 55 -24 -75
19140.2g5M5j4P1r8J37j37O5j4N9j07o1J35j16J59j73J69M4j30J04j2MLm8J8oj03J2
$$ -75 -30 -44 27 -71 66 -71 -6 -20 39 -68 -129 6 -110 49 -124 45 89 -41 63 51 55 58 10 28 22 -81 -69
19120.4f9LJ29m3j05Q2k2kN5j21Q8jRqJ1R7j1j14O4qm9J2j16J03rPlO5j42J31j3P2
$$ -69 -66 63 20 -85 -3 -25 -27 28 -93 -5 -6 3 -5 6 103 92 -22 42 34 -15 -3 -119 -16 -25 -18 -21 44 -98 33 20 92
19097.6I2j92RJ18Nj12J3O3N0q2L9q3N6m0R5n3m5M8O1q9QJ08K3r2r3Q2J12M0j46j18
$$ 92 -100 -91 27 32 -80 -67 -4 46 -36 3 -80 -24 -64 31 -22 -67 -19 42 -47 -39 69 92 0 -93 -11 101 141 -5 -123
19076.3a23O1J6KkRQ6rJ2j47Q0K7j47J11K5o1O3%j5j6J0m7M8O7j02N0j8M0l8n3Q6K0
$$ -123 -62 -46 -44 -46 -37 49 40 52 -95 -15 12 -135 -24 1 -60 3 3 -12 -28 -18 -65 -17 50 -52 -2 -20 20 -18 -71 15 35
19053.6C5J4q0J05o5n5JL3n5O2o9J43Rl0n3j15P7N2j0q4O1L2n4L4Q4r3OO0j41J14l2
$$ 35 49 -31 74 9 -46 -45 -12 -67 -5 -74 69 78 48 -5 -120 -43 9 -1 -85 -24 8 -46 -12 72 -21 -15 45 -96 18 -14
19031.5a4J0K0P2r4J58m3r6J08j16L4r8M3n2J20j68K30n7L8o6j02R3NOM9j17L3j5o6
$$ -14 -4 16 88 -6 152 109 13 121 5 39 -59 -16 -68 52 -116 114 57 95 29 -73 20 25 31 80 -37 -4 -19 -85
19011h5P0J75j82j04J08l2O7RK2p0J31j55M3L6j20O2o0N0Q1M2l3K2p9Mp6J76o4j30
$$ -85 -15 160 -22 -126 -18 -50 17 26 48 -22 109 -46 -3 33 -87 -25 -85 -35 46 88 55 77 -2 2 -74 102 38 -92
18990.4i2R1j6lO7M3r1lm2J77j90k2nR9j1M0j39K9J35l2o2j11J61J9j00L9O9O7j01
$$ -92 -1 -17 -20 47 90 -1 -4 -46 131 -59 -81 -86 13 2 42 -97 -68 67 35 -27 -138 23 42 -58 -19 50 117 16
18969.9A6j39O6N6%Q8n2o3j4P3Q8j9k8p9o2qN3l5m7k1J34L1k03J60o4%J36o7N1k1j02
$$ 16 -123 -57 -1 -1 87 35 -28 -42 31 119 100 72 -7 -69 -77 -24 -59 -106 -127 7 38 -165 -5 -69 -69 67 0 51 30 -72
18947.8g2L2p4N6kM6q4P2%Nk4n5J08m4Q9r8%J72j99rl9J37M1nr5K1J10r3j12J28nM1
$$ -72 -40 -114 -58 -60 -14 -98 -26 -26 -21 -45 -100 8 -36 53 -45 -45 127 -72 -81 -120 17 58 53 -42 -21 89 -4 -116 12 7 48
18925.1D8m2p5M2O7q5L4J16k22O2q8J45R2j67L5n5N1M9p0m6P1J23j39O0N2m7k6p1J61
$$ 48 6 -69 -27 40 -45 -11 105 -117 -55 -143 2 94 -73 -38 -93 -42 7 -63 -109 -38 85 -54 6 58 11 -15 -86 75
18904.5G5j35J28j50P8N5n7rOp6J19j8l9J24j92P5J10r1q0N2l3N3L9j28M1M5m9R5o3
$$ 75 -60 68 -82 -4 51 -6 -15 -9 -85 34 16 -23 101 -91 -16 94 3 -77 -25 -58 -5 34 -94 -53 -8 -57 38 -25
18883.9b5L5o8M7nm2M3O0j39J70R9o5m0j36J52j43K9n4Q6j6j01J31r5j1J77j39l7P4
$$ -25 10 -58 -11 -16 -58 -15 45 -94 76 175 110 70 -66 86 -57 -28 -82 4 -12 -113 18 -77 -88 89 -50 -87 -13
18864.1a3OJ12k60J16kL1N8k5n1O2o7N0JM3l0n7j15J39L0J14J3k15k3J65j15Q5P8k33
$$ -13 -7 105 -155 -39 -41 -10 48 23 -28 34 -33 17 18 61 31 -26 -141 -2 28 142 155 -60 -83 82 -33 52 130 -103
18843.5a03J05l6o9N7j0PM5O8p6o8o4J31Jk4N2K0j01J05mr6L1j29J45o0pJ22j5rln0
$$ -103 2 -34 -103 -46 -56 -49 -4 64 -12 -80 -144 -13 -12 -36 16 36 -65 40 36 -60 -29 -158 -13 -73 -80 42 27 18 15 -35
18821.5c5O6k6N0p9M9L4j04L5Q0p4L1m9M1rj03K06j40L0K0j16J67j41m5rP0p2P7J60
$$ -35 31 5 55 -24 25 59 -45 -10 70 -4 27 -22 19 10 -93 113 -27 3 23 -93 74 -67 -112 -121 -51 -123 -46 114
18801A14j88K4%k5L1L4q4l2J09L7k7j4Q2l2k9o9P1r5J57m5p9P7M8k3N7q3j67J07r1
$$ 114 -74 -50 -50 -75 -44 -10 -94 -126 -17 20 -7 -21 61 29 0 -69 2 -93 64 19 -60 17 65 42 99 16 -151 -44 -135
18779.7a35K15k62J92K2m2j13J05n9NR4o3P8o6k4J05J4j3k4qQm4r5Q6k0J0j27K3P5
$$ -135 80 -182 10 32 -10 -123 -18 -77 -72 22 -41 37 -29 -53 52 66 53 29 21 29 -15 -110 -24 -44 -34 -161 -138 -63
18759.1f3m2N1R6j6mK8n4K4n2K9j4L8r6J86p6K9j08M9o1J13j28O6kN2j18k0J41j73
$$ -63 -105 -54 42 26 22 50 -4 20 -32 -3 -17 21 -75 111 35 64 -44 5 -56 57 -71 -5 -7 45 -73 -93 48 -125
18738.5a25J15qR2j60J09L5q1O2lq9%p2R4K1p9N4j4O1j6J38Op6j42P3L5r0Q4j15j1
$$ -125 -10 -18 74 -86 23 58 -23 39 36 -53 -53 -125 -31 -10 -89 -35 -49 12 -4 134 140 64 -78 -5 30 -60 24 -91 -102
18717.2a02N7P1j54N2L6lJ7j32K91o1M7k1O6j85n1K5m0oJ23n6J40j02l1K8pr2J75k11
$$ -102 -45 26 -128 -76 -40 -43 -26 -158 133 72 119 98 164 -21 -72 -47 -87 -93 30 -26 114 12 -19 9 2 -90 85 -126
18696.7a26J2R9J14l1m4p5K02k41J43n8KNp1J28r5J0J40j62N0P8j13P3kj32J54l4J01
$$ -126 -114 -15 99 68 24 -51 151 -90 53 -5 -3 2 -69 59 -36 -26 114 -48 2 80 -33 40 38 -94 60 26 127
18676.8A27j11J6J0J8j59J42l7L0K4j1j30K3K6M6q0K28k6j67jj7K5J9O9j37J06M3j19
$$ 127 16 32 42 60 -99 43 6 36 60 49 -81 -58 -32 14 -66 162 136 -31 -32 -49 -24 -5 64 -73 33 76 -43
18657d3n9J26j7pP5p1nK9p0TR5K4q7O1l6j2J16J7j4j76QR2j1j11J22M8j31J88p1o0
$$ -43 -102 24 7 0 75 4 -1 28 -42 -112 -17 7 -80 -19 -55 -67 49 66 52 -124 -116 -24 -35 -146 -24 24 -107 81 10 -50
18635e0J45k47J7J96m6m5Tl7J50j3N3r3p4P5R0K0n4o2n4M7mr3K01j19Qj1l5OP8mm7
$$ -50 95 -152 -135 61 15 -30 -75 -112 38 25 78 -15 -89 -14 76 96 42 -20 -74 -27 -31 -124 77 -42 -34 -45 -80 -74 4 0 -47
18612.2d7P8N1j10J54q8p5p7Q0J08m8mrRO9j18M5RJ5k3m7n6P0Q1j37QJO3K2n3K2k3
$$ -47 31 82 -28 126 38 -37 -114 -34 74 26 22 13 22 91 -27 18 27 42 19 -28 -84 -14 67 -70 -62 -61 2 24 -29 -7 -30
18589.5c0q1K39j51l6J17k56J46L5K4n5n7L9J96m3j57m4O0R8J1n4p1K7k7K09j90N5
$$ -30 -111 128 -23 -59 58 -198 -52 -17 7 -48 -105 -66 130 87 -70 -114 -54 44 55 1 -70 -43 -70 139 -51 4
18570.4Do9N0J8P1j16q0Q6M7p4J07l2n1NN1L7l4p5jJ08j24m3K35j42lQ9j04M7p8O9
$$ 4 -65 -15 3 74 -42 -122 -36 11 -63 44 12 -39 -34 17 54 20 -55 -56 52 -72 -115 120 -22 -25 64 -40 7 -71 -2
18549.1bn7O8l0J30j38O5o6M5J6n5M7Q6j52OJ34r1r6J16OJ7N0o5n6Q1j98R3j19K47
$$ -2 -59 9 -21 109 -29 36 -30 15 31 -24 23 109 -43 -37 97 6 -90 26 32 49 99 34 -22 59 -139 -46 -165 82
18528.5H2j12l0Q8R5j10rk8L6r0O6Om4K26j59j2nl6Q8l1O1l6j3k0k6P9j4l9Q9j18K8
$$ 82 -30 -60 28 123 13 4 -24 12 -78 -12 -6 -50 176 17 5 0 -36 52 21 82 46 33 13 -13 66 52 13 102 -16 12
18506.5A2J8n0N7J10j53R4j65n7J6Q6m2kj7L6R2m4K2j49K19q7Q7lr5j17J41J3q7R3
$$ 12 30 -20 37 147 -6 88 -77 -134 -118 -32 -74 -76 -93 -57 35 -9 13 -136 83 -4 83 80 -15 -132 9 22 -65 28
18485.9B8M1j4K4j70O5n9j14K66n6m4%J03j2l0k4M1o8Q9j08l1L3j23Q1%J02mO1n2j7
$$ 28 69 55 79 -91 -26 -85 -199 67 11 -33 -33 70 58 28 4 45 -23 66 -42 -73 -40 -163 -82 -82 20 16 77 25 8
18464.6HN3j00l0P8l3J2r3jL6m9N4K6N4j54P6nJ07j12N0M4J6j54P6N6k9L1j1j01L1
$$ 8 61 -39 -69 9 -24 -12 -105 -106 -70 -119 -65 -39 15 -139 -63 -68 39 -73 -23 21 37 -117 -41 15 -14 17 6 -95 -64
18443.3f4J76j71k5J09j15J34j51n5J66n0Jj45K19k08J74p5M1M5P8q4k5M5l0m1M2J3
$$ -64 112 -59 -84 25 -90 44 -107 -162 4 -46 -45 -190 29 -179 -5 -80 -39 6 84 0 -25 20 -10 -51 -9 4
18424.2Dj7M4m4k6r6J55l6K4qm4J39j18O6l5r8J07l2k9j4J34k1j21J20j74O8N4Ro0
$$ 4 -13 31 -13 -39 -135 20 -16 8 0 -44 95 -23 43 8 -90 17 -15 -44 -58 76 55 -66 54 -120 -52 2 11 -49
18403.7d9M8o2O2J04j97L2O7n4J0J62j18J0Q3q7j41Q9J66j64qq6J93j70M2j2J30j06
$$ -49 -1 -63 -1 103 -94 -62 5 -49 -39 123 5 15 98 11 -130 -41 125 -39 -47 -133 60 -110 -68 -80 50 -56
18384.6e6K68l80K24K9j46R1j33J66o5J15j3k4Oj45P2J4n1L4j8L0j06%J50r2N5RM4
$$ -56 212 -168 56 85 -61 30 -103 63 -2 113 100 76 82 -63 9 23 -28 6 -12 18 -88 -88 62 -30 25 34 78
18364.7G8j28lJ2oJ37p8P7p3q4J88j09J42k06J77j45J3O2j07j3L7K9N5r5K4O6j89J65
$$ 78 -50 -53 -41 -47 90 12 89 16 -68 120 11 153 -53 124 -21 -8 54 -53 -66 -29 0 55 -40 -16 50 -139 26
18344.9B6J10j8r0pj32J73L4l1n9m2L4P5mj07P5p1J03j29P7j0j28J90q3L3j29J9M7
$$ 26 136 118 28 21 -111 62 96 65 6 -36 -2 73 69 -38 37 -34 69 -60 17 7 -121 69 -14 19 -110 -91 -44
18325.1d4q9J35K8j8QLL3j59mJ49j02P2Rq2q0J92j07L3Q2q8J73k25O3J8q1J52j59J9
$$ -44 -133 2 30 12 20 23 56 -103 -107 42 -60 12 21 -61 -141 51 -56 -23 59 -29 144 -81 -18 0 -81 71 -88 -69
18304.5f9P0Tp0r5J3K7N0Qm8j00J37K3o7J8p4P8K3R1j06k5J22o9j03K8j8N3k9J84p0
$$ -69 1 71 1 -94 -81 -54 -4 4 -44 -144 -7 16 -51 -33 -107 -29 -6 85 -21 -46 76 7 -96 -68 -86 -33 -62 122 52
18283.2E2r7m3O6J27j22%q7J30K4PlM6p2j21P5q7J26n3J19k10K26j74R3p7N9l8RM3
$$ 52 -45 -88 -22 105 -17 -17 -104 26 50 57 54 100 28 -93 -18 -105 21 -32 87 -123 103 -71 22 -55 4 -34 -25 18
18262.7A8l4k7m4O2r8M4N6k0p8J95j09n6J2Q0o5L1r6J70m1q4R8L7j74J21o5%K01j29
$$ 18 -16 -43 -87 -25 -123 -79 -23 -43 -121 74 -35 -91 -79 1 -64 -33 -129 41 0 -84 14 51 -123 -2 -67 -67 134 5
18242.1EQ4n2j40J52n4L8R4j50rK3o6K4L6K3n5J12q3R0q6L6p5P6kL8p2m0%J50QTl3
$$ 5 89 37 -103 49 -5 33 127 -23 -32 -9 -75 -51 -15 8 -47 65 -18 72 -14 22 -53 23 21 59 -13 -53 -53 97 105 113 80
18219.3H0j02Rj48J35J08j12qL2M3j50J9O6L4r7J35k4m3N1o7Q2m9M3j84J56k6K2k4
$$ 80 -22 -13 -161 -26 82 -30 -38 -6 37 -113 -94 -28 6 -91 44 20 -23 28 -39 43 -6 37 -147 9 -17 5 -19
18199.5a9J7L3L0o3q1OJ1Q2j51J0P0Q0l4p7%M8R3p3J9k0r1Q6r3J7%O9j10P1m2O1JJ60
$$ -19 -2 31 61 -2 -83 -77 -66 16 -135 -125 -55 25 -9 -86 -86 -38 55 -18 1 -19 -110 -24 -117 -100 -100 -31 -141 -70 -112 -51 -50 110
18176A10j60J25j83M2P4P6j17OM0l8M1K3o5K3j7L5q6nk4R8n7n1J38j03M1j23K05J2
$$ 110 -50 75 -108 -66 8 84 -33 -27 13 -25 16 39 -26 -3 -20 15 -71 -76 -100 -2 -59 -110 28 -75 -34 -157 48 60
18155.4F0r5K4m0j9R8k1p7k2Q0J2k5q7L6j17J96j20K05j38NJ15q4p7J11N0r0l8j20
$$ 60 -35 -11 -51 -70 28 7 -70 -92 -12 0 -25 -112 -76 -193 3 -117 88 -50 -45 70 -14 -91 20 70 -20 -58 -178
18135.6a78K21O7j20J01j15l6Q2jM9r4RM9RR2j22N3J4q7p6M1L3TN2j6Q3j26j11J24
$$ -178 43 110 -10 91 -24 -60 22 21 70 -24 -15 34 43 135 13 66 80 -7 -83 -42 -9 24 76 60 143 17 -94 30
18115C0MM8q7Q1r1lP1l2l3K3RL9j29J5J6M5J52j44p3mJ48q3M2l3j8J12j96nO2J07n6
$$ 30 34 82 -5 76 -15 -18 53 21 -12 11 20 59 -70 -55 -39 6 158 14 -59 -63 85 2 44 11 -7 105 -91 -96 -34 73 17
18092.3A7K0n3J6Nj45N8J87p9J1r2Q9O3j12RK1q8N5j1J09j44Q0m9P4n0J0p0R9l6j12
$$ 17 37 -16 0 5 -140 -82 105 26 37 -55 34 97 -15 -6 15 -73 -18 -29 80 -64 16 -33 41 -9 1 -69 30 -6 -118
18071a18J26p8K7J29r3r0J02q3J74Oj34Q7Nj10J05N9r3j1j04j21J78LqR0q2m1l1Q2
$$ -118 8 -70 -43 86 -7 -97 5 -78 96 102 -32 55 60 -50 55 114 21 10 -94 -215 -37 -34 -42 48 -34 -75 -106 -24
18050.4b4k5J07q8j7J62j04R3n9J8p6j04J41j8N7l6OK5l5j49J9J14Q2o4K9j20LK5N7
$$ -24 -49 58 -30 -47 115 11 104 45 63 -13 -117 24 6 63 27 33 58 23 -126 -107 7 89 25 54 -66 -63 -38 19
18029.9A9n9k9P9m9J69j48J18j76N8j7Q5o0m0L5m1K3L8oj79J13J21j3m7jL4P6n8l4
$$ 19 -40 -69 10 -39 130 -18 100 -76 -18 -35 50 -10 -50 -15 -56 -33 5 -1 -180 -67 54 41 -6 -7 27 103 45 11
18009.3A1o4Q2j61R1%j9N8J0p4O5j14J30k6n9P8j9j1l5K67o7j80mJ44q1n8k2J29P3
$$ 11 -53 29 -132 -41 -41 -60 -2 8 -66 -1 -115 15 -11 -70 8 -11 -22 -57 210 143 -37 -41 103 22 -36 -58 71 144
17988.7A44n6q4j7nJ51n0m6k09R2J42r2KP8l3ol6n6L9J1M8j0O0j16M7j0N4J5m9m1L3
$$ 144 88 4 -13 -18 133 83 37 -172 -80 62 -30 -28 50 17 11 -25 -81 -42 -31 17 7 67 -49 -2 -12 42 57 8 -33 0
17966.7@n7K1K0L0l6K5L2L9q3mrj2R6jr4n4J50l4M9m0p4n1QM4o1J32k8J40j62m7L8
$$ 0 -57 -36 -16 14 -22 3 35 74 -9 -13 -22 -34 62 61 -33 -87 63 29 78 38 -36 -87 -79 -35 -96 36 8 148 -14 -61 -23
17943.9b3q1J62j14J70q1p9K2oLr8L6J09J6q6R2j48M9J1l0P9n8o1jM5K0Mm0j04J28
$$ -23 -104 58 -56 114 33 -46 -24 -30 -27 -125 -89 20 36 -50 42 -106 -57 -46 -76 3 -55 -116 -117 -72 -52 -48 -88 -192 -64
17922.6f4J38o4J07q5j44J06P3j29R6pj84O0J44m6k5R8j01N0p3P9rK9j35R7j68J33
$$ -64 74 10 117 32 -112 -6 67 -62 34 27 -157 -97 47 1 -24 74 -27 23 -50 29 20 49 -86 11 -157 -24
17903.5b4O6K8j00M0k1j7j46M03k67J59j37J3j04M2O5QJ31k03mR2k6J5o5K5J21j02
$$ -24 42 70 -30 10 -11 -28 -174 229 -38 121 -16 -3 -107 -65 0 8 139 -64 -68 24 -2 13 -52 -27 94 -8
17884.5hN8o3K2n4ko1J4J0J09m0j4Tn1P8k1M3J9m7m2J40j51N3k1J26km5j24O5J74j85
$$ -8 50 -13 9 -45 -47 -108 -94 -84 25 -15 -29 -43 -94 -16 -37 6 25 -22 -64 76 -75 -22 -43 83 81 36 -88 -23 151 -34
17862.4c4L6L2j31O8p0j2PN8M1M2q5J18r2J5j28R1j7L5J27r7J7j3Mk4RMj40J54o0n
$$ -34 2 34 -97 -29 -99 -111 -104 -46 -5 37 -48 70 -22 -7 -135 -44 -61 -26 101 4 21 8 12 -12 -3 1 -139 15 -45 -50
17840.4e0P4p4m6J5J7o3J73m8k3n6Q1K4K8L3q9L6n9p1J44p2m8P9m5J36j40J01QPj88
$$ -50 24 -50 -96 -81 -64 -127 46 -2 -25 -81 0 24 52 85 -4 32 -27 -98 46 -26 -74 5 -40 96 -44 57 65 72 -116
17819.1a16J96j58k2j8K26q4K4r7Q%n7J52L6j81n6J60o2J20j27R5j95L3J52j51K1O2
$$ -116 80 -78 -100 -118 108 24 48 -49 -41 -41 -98 54 90 -91 -147 13 -49 71 -56 39 -156 -123 29 -122 -101 -39
17800c9R5N5j01q5N0r1P3J21n0p7P2j41Q9J20n0m7n7J0qJ3j24K53k29J13l9O6Rj00
$$ -39 56 111 10 -75 -25 -116 -43 78 28 -49 23 -118 -29 91 41 -6 -63 -53 -61 -48 -172 81 -148 -35 -74 -8 1 -99
17779.4i9J02L4J02j48K4k9p2J17Q0j08m0j0N2O8j66Q4n5N8J55j71l4J04j43J7J19
$$ -99 3 37 139 -9 15 -14 -86 31 111 3 -37 -47 5 73 -93 -9 -64 -6 149 -22 -56 48 -95 -78 41
17761.1D1r5k4Q4J38k27O3J05q8k0k7o8K07p7M2m9m1M1p8J27j96Q8Q4j13N2L1m8k4
$$ 41 -54 -78 6 144 -83 -20 85 -3 -23 -50 -118 89 12 54 5 -36 5 -73 54 -142 -54 30 -83 -31 0 -48 -72
17741.3g2J28j48Q2J3m3P2Mj7J9p9R5m8J3P5j95N2L4Pon0LJ5p0J78j03M5P3L4j59J1
$$ -72 56 -92 -10 3 -40 32 36 19 38 -41 54 6 19 94 -101 -49 -15 -8 -14 -64 -61 -46 -116 62 -41 4 77 111 -48 -37
17719.2c7n0M8j7r7J01L1K9n8O4j4l6r6J98J6j15O7j08J12M0o1j15R9L9p0Ln5N4J5
$$ -37 -87 -39 -56 -153 -52 -21 8 -50 14 0 -36 -132 66 82 -33 34 -74 38 78 17 -98 1 40 -30 -27 -82 -28 -13
17698.7a3p3J41oJ6l9Kl5O2p6l0m2R1l4oO2J0l0J14k25J29j02Q8m2m1o3K70j27j33
$$ -13 -86 55 49 65 26 28 -7 55 -21 -51 -93 -2 -36 -42 20 30 0 114 -111 18 -84 4 -38 -79 -142 128 1 -132
17678.1a32R0K0O9p3o1J79j76J74J00j64rr6O2m0J35o2J8Kk6j2M3n2M2l0M9lj3J7J4
$$ -132 -42 -22 47 -26 -87 92 -84 90 190 26 17 -79 -17 -57 78 16 34 36 10 -2 41 -11 31 1 50 47 34 51 65
17656.8F5j51L0K4p1L2rJ6J58q2j51J01pJ51j18oj9M7TM1J3o0K8J9j25L9M4K7j31j81
$$ 65 -86 -56 -32 -103 -71 -80 -64 94 12 -139 -38 -45 106 -12 -18 -37 10 57 98 111 51 79 98 -27 12 56 83 -48 -229
17635.5b29J95p8o8P2J08J22j71L0o2J1O0LQ2N8j20K0j32R4j6O9j05N7J7RL9j14m7
$$ -229 -34 -112 -180 -108 0 122 -49 -19 -81 -70 -10 -7 75 133 13 33 -99 -5 -21 48 -57 0 17 26 65 -49 -96
17615.7i6J23j54J58R8j29J1o8l7K8K6RN6r3O8J51k09P0j42J22q2P2l2L8N9j5j29J67
$$ -96 27 -127 31 129 0 11 -57 -94 -66 -40 -31 25 -68 0 151 -58 12 -130 -8 -90 -18 -50 -12 47 32 -97 70
17595.8G0j90K25j08m0k8m1j00K69j62J07o8OJ15j3J6j9R8r8K0j29OR2J5j78N8M1n0
$$ 70 -120 105 -3 -43 -71 -112 -212 57 -105 2 -66 -60 55 42 58 39 137 39 59 -70 -64 28 43 -135 -77 -36 -86
17576h6L8M4q7j5J33%k2O1l2p9P4j26l8K11k30J18J1K9j15J69P5j50MM3r7rk6Q9o2
$$ -86 -48 -4 -91 -106 27 27 5 66 34 -45 29 -97 -135 76 -154 -36 -25 4 -111 58 133 -17 -13 30 -67 -76 -102 -13 -75
17554.7g5J44j01L0o9O5j20J33J9M0l8l4j22J12%P3j03j7K8Ll8m6J68j04PP7j47N5
$$ -75 69 -32 -2 -71 -6 -126 7 26 66 28 -6 -128 -16 -16 57 -46 -63 -35 -32 -70 -116 52 -52 -45 32 -115 -60
17534.9f0j4Q1j39J17p2J72j73J01M8j08L9j1j3J04p2N4j90J97r8jP0N7j06J7O8j50
$$ -60 -74 7 -132 -15 -87 85 -88 13 61 -47 -8 -19 -32 72 0 54 -136 61 -37 -38 32 89 -17 0 68 -82
17515.8h2oJ55q3k2p4P2M8j04P9p4J19o9k2J5O3J52j06j36J56j08k1K2R3l1j02J1K6
$$ -82 -88 67 -16 -38 -112 -40 8 -96 -17 -91 28 -41 -63 -48 15 167 61 -75 81 -27 -48 -26 67 36 -66 -55 -29
17496b9j00P7k4k3J35m7o8Q0or7J98q1j01J34l0qn1O9p3R9N8j73k2K1R3p3m9J27J4
$$ -29 -129 -52 -76 -99 36 -11 -79 1 -5 -102 96 15 -86 48 18 10 -41 28 -45 54 112 -61 -83 -62 31 -42 -91 36 50
17474.7E0l0M1n2R9j95N3m2P5j05NJ6J19j9l4p2j2kJ01J22n1r6M8j94K44kr7R6j11
$$ 50 20 61 9 108 -87 -34 -76 -1 -106 -101 -85 34 15 -19 -91 -103 -105 -4 118 67 -29 19 -175 69 67 -30 66 -45
17454.1d5J24j84J31n8l3N1j27L6J13J3l2J64k24M9K9o5Q8L1M3r8Q4j58M1J8k4L2l3
$$ -45 79 -105 26 -32 -65 -14 -141 -105 8 21 -11 153 -71 -22 7 -58 30 61 104 6 90 -68 -27 -9 -33 -1 -34
17434.3c4K5L%p5J04n5kP0Tk3J4j80J21n7J25K5j36K29j87m1j13Q4l4J81p7l8j86J52
$$ -34 -9 -6 -6 -81 23 -32 -34 36 106 83 97 -83 38 -19 106 131 -5 224 37 -4 -117 -33 -67 114 37 -1 -187 -35
17413.7c5rL2l3O8k2p4L2m7J22j7j4J5J50j81p7J07k15K23K7j66J75k6r8J20j7J1j55
$$ -35 -44 -12 -45 23 1 -73 -41 -88 34 17 3 18 168 -13 -90 17 -198 25 52 -114 61 35 -63 57 40 51 -104
17393.9a04O9qJ46j56o2k3J0P7p4MK53j03TJ49n0P8j55J18j9p7p0R4kjk6J28k3j30
$$ -104 -35 -43 103 -53 -115 -138 -128 -51 -125 -121 132 29 -74 75 25 103 -52 66 47 -30 -100 -6 -8 -9 -35 93 70 -60
17373.3f0R4k5K1N2j52J3j9K3J07kj13J4p9N2J80o0p5O4l8J0o9J67j24p9J17j0M1p4
$$ -60 34 9 30 82 -70 -57 -76 -53 54 52 -61 -47 -126 -74 106 46 -29 35 -3 7 -62 105 -19 -98 19 9 50 -24
17352.8b4j34J17M2o0q1K84k20j35K04k0P5N7j04J07j40n0l6J09N6j11J45n9m5o4J17
$$ -24 -158 -41 1 -59 -140 144 -76 -211 -7 -27 48 105 1 108 -32 -82 -118 -9 47 -64 81 22 -23 -87 30
17334.4C0j49P4K9k2Q5j44K1j08J40l2N8J1N1j74K35o0j97K23o6rJ1j0q4N3J31n6p8
$$ 30 -119 -45 -16 -38 47 -97 -76 -184 -44 -76 -18 -7 44 -130 105 45 -152 71 5 -4 7 -3 -87 -34 97 41 -37
17314.6c7N2l5L3J4M8p2j04M5l8J32J01k49J61j23Q5jO4j6oj41J57j45N8J36j39L7
$$ -37 15 -20 13 27 75 3 -101 -56 -94 38 139 -110 51 -72 13 12 76 60 54 -87 70 -75 -17 119 -20 17
17295.5A7m0j01J90m6K7q1J09p5n1M6r3L0K15j39K8j14J0J81j16O7j21m9O6R7j11J33
$$ 17 -23 -124 66 20 47 -34 75 0 -51 -5 -98 -68 147 8 36 -78 -68 113 -3 64 -57 -106 -40 57 -54 79
17276.4G9r6p5o9J82k9O3j27Q5Pn4J37j98J02Nj7J23rq5j16j5J24q5Q6lM8m2j12J03
$$ 79 -17 -92 -161 21 -8 55 -72 13 20 -34 103 -95 7 12 -5 118 109 24 -92 -107 17 -68 18 15 63 21 -91 12
17255.8A2p2N9L5Oll5m8K8p6J19l3Kn0J11l6k4m1O5q8O4K2j48J14J26j09l5NJ5p0J09
$$ 12 -60 -1 34 40 37 2 -46 -18 -94 25 -8 -6 -56 55 19 -5 -46 19 -69 -5 17 -131 -17 109 0 -35 -30 -15 -85 24
17233.8B4o7P9J7l2L2j21R3p7P6j18J31n3J44k03k1J60r1J92l10J62o7R4m4l3m0Q4
$$ 24 -43 36 53 21 53 -68 25 -52 24 -94 37 -16 128 -75 -96 64 -27 165 -145 17 -50 44 0 -33 -73 11
17214.7A1o4Q8o0nl7P2K9m8k0k1N6q7M6N4P5j50N2J25j26Q0q8J89k82M5Kk2K20j41
$$ 11 -53 35 -25 -30 -67 5 34 -14 -34 -55 1 -86 -40 14 89 -61 -9 116 -10 70 -18 171 -111 -66 -64 -86 134 -7
17194.1gQlo5N5m1q0J52q2j9J63j64N0M9j44J06k7Q0l4J6M6j33P9p5M1O3k4O4q0J38
$$ -7 1 -2 -67 -12 -53 -133 19 -63 -82 81 -83 -33 16 -128 -22 -49 31 -3 13 59 -74 5 -70 -29 34 10 74 -6 132
17172.8A32j80R1j03Q3j22lJ40n9M1L2j09P2n9K5Ok2R4j05J03K6k47J43J7R1q5N5k38
$$ 132 -48 43 -60 23 -99 -102 38 -21 20 52 -57 15 -44 -19 -13 -35 59 -46 57 83 -164 -21 -4 87 2 57 -181
17153a81K09J3o9l0J01J2j47J2N0r4J68k9mL2q4J30m0pp1m3K2T%j8Oo2J50o2rn7M9
$$ -181 28 41 -28 -58 43 55 -92 -80 -30 -124 44 15 11 43 -41 89 49 42 -29 -72 -50 -28 -28 -46 -40 -102 48 -14 -23 -80 -31
17130.3c1j04J63j9j10Q5M0r2N4o2Lm4O0J11k5o5O9K8j01k5O0J9k0J0oQ1K3k40O4P9
$$ -31 -135 28 9 -101 -16 24 -68 -14 -76 -73 -117 -57 54 29 -36 33 61 -40 -65 -5 14 -6 4 -2 79 102 -138 -74 5
17109El3P1P7j79r7K05k28J70o4M8r8M8m9M8R7J5l6L0k0J26j47L6j28K3m3J75m6JJ02
$$ 5 -28 43 120 -59 -156 49 -179 -9 -73 -25 -123 -75 -124 -76 21 36 0 30 10 136 -11 25 -103 -80 -123 52 6 7 109
17087.7A09l3o5J22r1oO0N9j87J09j27m7M5K7j30K27k24J70m8N1j04K27k22R6r3K08
$$ 109 76 11 133 42 36 96 155 -32 77 -50 -97 -52 -25 -155 72 -152 18 -30 21 -83 144 -78 18 -75 133
17069.3A33j07j48N6J76j64jM3N8k7On6k5J21n6o4P1j66J82j21K8q3J36K8k0q8L9p1
$$ 133 26 -122 -66 110 -54 -55 -12 46 19 25 -31 -56 65 9 -55 16 -150 32 -89 -61 -144 -8 20 0 -88 -49 -120
17049.5a20P3n6L1P2P9j19L3o3J32m1l7j31K4J10J4j0m3k7N2J6j2j53K17p7R0k3j36
$$ -120 -47 -103 -72 0 79 -40 -7 -70 62 21 -16 -147 -123 -13 1 -9 -52 -79 -27 -11 -23 -176 41 -36 54 31 -105
17029.6a05N4R7m1P5n9J9qq2O1r1rJ23J08j67J6O0n6l7n0R8j9Q5r1J0p4P2p1L0R3r3
$$ -105 -51 46 5 80 21 40 32 -50 11 -80 -89 34 142 -25 -9 51 -5 -42 -92 6 -13 72 -19 -9 -83 -11 -82 -52 41 -52
17007.6e2R6r3K9k9jK1P7j02K29j72K5K7M9K7j35L2P6k46j8K25p0m2q1J49M8j72J34
$$ -52 44 -49 -20 -49 -50 -29 48 -54 175 3 28 55 104 131 -4 28 104 -142 -160 65 -5 -47 -128 21 69 -103 31
16987.8C1q2mqj1P9ml3mJ44k3n5op0Q9q8K0j59J55Q0q5n0j7J03LO9j69J40j72J28K5
$$ 31 -51 -55 -63 -74 5 1 -32 -36 108 85 30 24 -46 43 -45 -25 -184 -29 51 -34 -84 -101 2 5 74 -95 45 -127 1 26
16965.8B6q7pP0o2N4rL9j60K26k7q5Ok1k3Kpk3m3K21r8l8M3j6l0J18nk7j3k2j13J56
$$ 26 -61 -68 2 -60 -6 -15 24 -136 90 63 -22 -16 -37 -60 -58 -65 -88 -131 90 -8 -46 -3 -19 -49 69 64 37 24 2 -111 45
16943D5L6j05O6%j30l4J32qm5LQ4Op4j85K73o1o2R6n4n1J46N9j11r4k5J2Q7j2l7k1
$$ 45 81 -24 42 42 -88 -122 10 2 -43 -40 44 50 -24 -209 64 3 -59 37 -17 -68 78 137 26 -68 -93 -81 6 -6 -43 -64
16921f4J47j65L4k1L5P6q6P7j6r0J11j74O5J36r8N9k08J78J4L7k46N8NJ34L9m3j17
$$ -64 83 -82 -48 -69 -34 42 -44 33 17 -73 38 -136 -71 65 -33 26 -182 -4 10 47 -199 -141 -136 -2 37 -6 -123
16901.1a23O1P3o3Q2p8j45J21jM4N6L8j00O1j36J9J2N9o8O3k9J32j29J14r3Q2p9j6
$$ -123 -62 11 -52 30 -48 -193 -72 -73 -29 27 65 -35 26 -110 -91 -79 -20 -88 -25 -54 78 -51 63 -30 52 -27 -43
16881.3d3K1P2q4j07J53q2J5P3p4M5p3O9j11O6o3J5M8PJ09q9P2q5O5j03J89j24j03
$$ -43 -22 50 -34 -141 12 -70 -55 18 -56 -11 -84 -15 -126 -60 -123 -108 -60 -53 56 -33 39 -46 19 -84 105 -19 -122
16861.5a22J12j52J30J11l9O8r5m6K8K7O3j89J26o5J40r1o4rJ09j12O1P4p2TQ1p8K5
$$ -122 -10 -162 -32 79 40 108 13 -33 -5 22 85 -104 22 -43 97 6 -58 -67 42 -70 -9 65 -7 -79 2 -76 -51
16841.6e1N9j11J11p1%q5J90jj31J4K8J53k4j21P4m6N3k9m5lO9p9P2l9L1O6o3l5n7
$$ -51 8 -103 8 -63 -63 -148 42 41 -90 -76 -48 105 81 -40 34 -12 41 12 -33 -36 33 -46 26 -13 18 84 21 -14 -71
16820.3g1J37J3l0j16Q5j08o8J97j51K95k85J86j00L6k3J15p7Or6J88j87J5Tqp1Q4
$$ -71 66 79 49 -67 18 -90 -158 39 -112 183 -102 84 -16 20 -3 112 35 41 -55 133 -54 -39 -24 -32 -103 -19
16801.3a9k2m2l8J36l2J1j4n7K7J16j06n2L6J49p6L1J7j36R3j1m6J1J5J26j42O3k8
$$ -19 -41 -83 -121 15 -17 -6 -20 -77 -50 66 -40 -92 -56 93 17 48 65 -71 22 11 -35 -24 -9 117 -25 38 10
16781.4A0Kl5P9m4l3L8J4l6p6J07J9j00J08m7l3j14J71q2%J65j81K2N7k3j55J31Q1
$$ 10 12 -23 56 12 -21 17 31 -5 -81 26 45 -55 53 6 -27 -141 30 -52 -52 113 -68 -46 11 -12 -167 -36 45
16761.6D5o1q7O5J52j06kN9j62J14K0p4RMp1j10K17j15J23L6l8r2M2o1J84j81J46P
$$ 45 -16 -103 -38 114 8 6 65 -97 17 37 -37 -28 -24 -95 -205 12 -103 20 56 18 -74 -32 -93 91 -90 56 63
16741.8F3j31O2M8j15R6l9K6p4O9N8k17J61PM5j70O1j01K28j31k0M4L8Q8j71J22o2
$$ 63 -68 -6 42 -73 23 -16 10 -64 5 63 -154 7 14 59 -111 -50 -151 77 -54 -74 -30 8 96 -75 47 -15
16722.7a5Lm1Q3q5L9P1k3L2k8j02O8L8j42R4L7j27k5K05q2P6k2j55l3R5J7rO3r3O0
$$ -15 -12 -53 30 -55 -16 55 32 64 36 -66 2 40 -102 -8 29 -98 -123 82 0 76 54 -101 -134 -39 -22 -31 32 -61 -1
16701.4aq1L0l9Q1q6mP0lJ01j80n7K62j61J11j56N4M5m7K7j5N5P1K3j43J4O3j26P0
$$ -1 -82 -52 -91 -10 -96 -100 -30 -33 68 -112 -169 93 -68 43 -113 -59 -14 -61 -34 -49 6 77 100 -43 -29 34 -92 -22
16680.8b2Q1kr1J9rk0Ko9Q4J61j28P5k1j25q3J20O1k6Kk0N0k1m5M3J03j09O4m1K2j54
$$ -22 59 57 -34 -15 -24 -44 -42 -111 -27 134 6 81 60 -65 -148 -28 33 7 9 -11 39 18 -27 16 119 10 74 33 55 -99
16658.8i9J85j85PJ27o0J7MKO7j00R5n7r1K17k06J71m7k9p7M9l0j21Q2P6M0j22M9L6
$$ -99 86 -99 -92 35 -25 -8 -4 -2 65 -35 60 3 -88 129 -77 94 47 18 -59 -10 -40 -161 -79 -3 37 -85 -36 0
16638.2@nj3q6J42r7J6qO1n8Q6j49R6J2k4J47k10Q4O0q8o5J4M8J3M3j22R7p6P3j4p4
$$ 0 -5 -18 -104 38 -59 -43 -51 10 -48 38 -111 -15 -3 -27 120 -90 -6 54 -34 -99 -85 -37 -24 19 -103 -6 -82 -9 -23 -97
16616.2i7J61L6n9M4l6j14J67j80J33l4Nq0P6l5O2j1j04M7k4R5n0j7L7Pn1L8o3J8J32
$$ -97 64 100 41 85 49 -65 102 -78 55 21 26 -54 22 -13 49 38 -66 -19 -43 52 2 -15 22 29 -22 16 -47 -29 103
16594.9A03j87O7j08J68j58K20j49pM3r7J58O7j82P8m5K5o7L4P0j2j19J55l6qL3p0
$$ 103 -84 -17 -125 43 -115 105 -44 -51 -8 -105 53 120 -62 16 -29 -4 -71 -37 33 21 -98 57 21 13 46 -24
16575.8b4k5O3k6jo4rJ75kj09j02J09j17J03K3r4O7O9r9m4L7J48j75J29q8J30r5j9
$$ -24 -49 14 -12 -13 -77 -86 89 87 -22 -124 -15 -132 -29 -6 -100 -33 36 -63 -107 -70 78 -97 32 -56 74 -21 -40
16556d0R9k34Q2j1Q9rP2j74N3K0O6m3jNMO9j12J05o8L3m4k8j5Q1n6K15j76j00J20o9
$$ -40 59 -175 -93 -104 -15 -24 48 -126 -73 -53 13 -30 -31 -26 -22 47 -65 40 -28 5 -39 -67 -82 -1 -57 158 -18 -118 2 -67
16533.9f7P6m1Q2k04R2P4K7j1j3jm6M0N4o8J03j35K6q0L2m1R9k9r6J67p0j5J4O5m7
$$ -67 9 -32 50 -154 -62 12 39 28 15 14 -32 8 62 -6 97 -38 -12 -92 -60 -101 -2 -31 -127 40 -30 -45 -31 34 -13
16512.6a3J11k0k7o7q8J37q0P1j0K1p1J5R8j10K9q0K0L0K4L7J3q3O3j09m0N1J17j75
$$ -13 98 78 51 -16 -104 33 -47 24 14 35 -36 -21 77 -33 -4 -84 -64 -34 -10 27 40 -43 20 -89 -129 -78 39 -136
16492.1a36Q1Q4l3o3N0o1j2R1L6o8l1P1l1rL2Ok5O2m3l7L7R0j45N0J7j65J34J24r8
$$ -136 -55 29 -4 -67 -17 -78 -90 1 37 -31 -62 9 -22 -31 1 7 -18 44 1 -36 1 91 -54 -4 13 -152 -18 106 8
16470.8Hq1J8pJ05n3J9K4K6r0K9P9m2m5Q1p0m2Oj9N2j3l7K2n0Q7J22k19L3J12j2nj40
$$ 8 -73 -55 -62 43 -10 9 33 59 -31 -2 77 35 -10 71 1 -41 -35 -54 -2 -15 -52 -30 -80 7 129 -90 -57 55 43 38 -102
16448a02P0R4j10J8Q2j38O5J04j10lq6K33j17m1j0m0J7oJ04jj36K31p4k5m3M4j01M5
$$ -102 -32 62 -48 -30 52 -86 -21 83 -27 -30 -116 117 0 -41 -51 -91 -74 -80 24 23 -113 118 44 19 -24 20 -81 -36
16427.5c6J04r6l6o3N8QQ6p5q5M9P2L2J4m6Rn8OO8K1lj19r1K08p4l0o2R3O5r4M3N5
$$ -36 68 -28 -64 -127 -69 -61 25 -50 -135 -86 -14 18 32 -14 -5 -63 -57 11 32 29 -90 -181 27 -47 -77 -139 -46 19 -75 -32 23
16404.7B3j45O2N2LNrO4K6j08Q9p6J0l5N9o9O8J11j54J1R4j27J01n2J01j46Q7o1J05
$$ 23 -122 -60 -8 -5 0 -9 55 81 -27 62 -14 -4 -39 20 -49 19 130 -24 -13 81 -46 55 3 104 -42 45 -16 89
16384.1H9j90P4J17j03Jj43J32R7p8K3J64j65m2K8l6P2k6or1J17l1N0k4m5j17J57J0
$$ 89 -101 -27 90 -13 -12 -155 -23 74 -4 19 183 18 -24 4 -32 40 14 8 -83 34 3 53 29 -16 -133 24 34
16364.3C4ll3Qj2O3k0j17J02J8p2j1J32j29J9L6l0k3k8J5k5R5r1KL2L0Lmj04J61j60
$$ 34 31 -2 6 -6 57 37 -80 22 40 -32 -43 89 -40 -21 15 -15 -38 -66 -51 -76 19 -72 -70 -38 -8 -5 -9 -113 48 -112
16342.3a12K02q8j32J56j81J02oJ09q9J41m3r0m4M3O7K6l4j12l1P9J9j07O2M6l3p2
$$ -112 90 2 -130 26 -155 -53 -59 50 -39 102 59 -31 -75 -32 35 61 27 -85 -116 -37 -18 -125 -63 -17 -50 -122
16323.3a22p6J28J70j96j4qO9j21K15m4m0P9r2Nm6R9j12Q4OQ8j8q4N4r5J05Oj00N3
$$ -122 -198 -70 100 -96 -110 -118 -49 -170 45 1 -39 40 -52 -47 -93 6 -106 -22 -16 72 54 -30 24 -71 34 40 -60 -7
16302.7gL0m0mj33J72J3n8N0J8J12r7j09Q8o1M2N2L3k33R7j1J1l2J44j36m4J54j47
$$ -7 23 -17 -21 -154 18 31 -27 23 41 153 56 -53 35 -26 16 68 101 -132 -35 -46 -35 -67 77 -59 -103 51 -96
16282.9i6K05k48R8R0l1p4K4N3Kl2r0K23l03J59l8K0l9N3j2m0R4J6m6J26n9j55k1O7
$$ -96 109 -139 -41 49 18 -56 -32 21 23 -9 -99 124 -179 -20 -58 -38 -77 -24 -36 -76 18 34 -12 114 55 -100 -121 -54
16262.4e4P1o8J66k47J4J57j68K25j82J04Q3r8M9j17R6l4j31J93l1n9q2J52k24J71
$$ -54 17 -51 115 -132 -118 39 -129 96 -86 18 101 3 52 -65 31 -3 -134 59 28 -31 -113 39 -185 -14
16244.8a4j05L5J03j25J38n8J5m7O3L7q4pM5J0k02J97M3r0J6R2K1j23J63O4n3j11m3
$$ -14 -119 -84 19 -106 32 -26 -11 -58 5 42 -42 -49 -4 6 -196 1 44 -46 -30 62 83 -40 123 187 134 23 -20
16225b0R2jq8L6j61J66J8m3N6k9K6k6j66J21JJ52k54p9J71j23N8J2J15J7m3o4n2K32
$$ -20 72 71 -17 19 -142 24 42 -1 55 26 52 26 -140 -19 -18 134 -120 -199 -28 -151 -93 -81 34 51 8 -56 -108 124
16204.4A24l6j05Rl8J00l7l0l6J19j19O3N7j36J27q9J4K2q3O2o2p2O4r1K05m6l9J00
$$ 124 88 -17 -8 -46 54 17 -13 -49 70 -49 14 71 -65 62 -27 -13 9 -74 -12 -74 -146 -82 -173 32 -14 -53 47
16184.6D7M5j49n5L3N1Q2r8O4j0q2J20o8j1n5J54j47L7J3k1j0O8l6j8M2O1p8P3l2k1
$$ 47 92 -57 -112 -79 -28 54 -44 20 10 -72 48 -20 -31 -86 68 -79 -42 -29 -50 -60 8 -28 -46 -4 57 -21 52 20 -1
16163.4al5J5kp1K3TJ6Q9j10R2k6l2rM5M1ml0J1j43R8j17K44n8j40R9mK1l8J34j97
$$ -1 -36 -21 -23 -94 -71 -48 -32 57 -53 39 13 -19 -28 17 58 54 24 35 -108 -10 -127 117 59 -81 18 14 35 -3 131 -66
16141.4f6O8j17Q6R2n0r3J59k3lq8M5kJ5J28k88O7J88m0L0j90l7Q0J01j7j51Q5o9M6
$$ -66 2 -115 -29 63 13 -80 79 56 53 -35 10 8 23 151 -137 -70 118 78 108 -82 -119 -39 62 45 -106 -21 -90 -44
16120.8d4l8K8O9P0j10J12j56J24j32QJ45j20O3J2k4N9o3rL0L9R1j77Q8j25N0j6JJ4
$$ -44 -82 -54 15 85 -25 87 -69 55 -77 -69 76 -44 19 31 7 66 3 -6 24 63 154 -23 65 -60 -10 -26 -25 -11
16100.3a1P2j00N4q9m4R6n7P7l8l0k2J17k11K57q7J16j42m8R6p5L9j3JR4j06K8Pk%
$$ -11 61 -39 15 -74 -118 -22 -79 -2 -40 -70 -92 25 -186 71 -16 100 -42 -90 6 -69 -30 -43 -42 52 -54 -26 -19 -21 -21
16079b1KOk8L5k4o4J21Oo7K08j49r1l8j8N2k4K6p1lJ61RN0q2J3p5P8m5L6M7O2j38k3
$$ -21 -19 -13 -41 -6 -30 -94 27 33 -34 174 25 -66 -104 -122 -70 -94 -68 -139 -142 19 28 78 -4 9 -66 12 -33 3 50 112 -26 -49
16055.6d9k9J12j13M6j3P0K2r9K2M6K5n4K0L8P5p8K8k4p9J11j15O6K7K1Nk01O8O1j8
$$ -49 -78 34 -79 -33 -46 24 46 -53 -31 15 40 -14 6 44 119 41 69 45 -34 77 -38 28 55 76 81 -120 -52 9 -9
16034.3i%o4P4jO4m3K0k6j39J92p9l3j5N4o5m3L8N7Mj60J79L9Rj11N9o1n9O2J9k1j9
$$ -9 -9 -73 1 0 64 21 41 15 -124 68 -11 -44 -59 -5 -70 -113 -75 -18 -14 -174 5 44 53 -58 1 -60 -119 -57 -38 -59 -78
16011.6g8k4N3TN9o0j2r5J5k6j22J48J50n4J3n1K2q0M1m6K6K0Ql3J05j05J4jr7N9M4
$$ -78 -102 -49 4 63 3 -9 -104 -89 -115 -237 -89 61 7 20 -31 -9 -89 -48 -94 -68 -48 -40 -73 32 -73 -59 -60 -157 -98 -54
15989.6e4Rn5J55o4J28k22r8J08k9J40m9J0O8j7l0j3O4p6M1o2J56j01nn4RL9j31J14
$$ -54 -45 -100 55 -9 119 -103 -201 -93 -122 18 -31 -21 47 30 0 -13 51 -25 16 -46 110 9 4 -50 -41 -2 -133 -19
15969a9M5q8q0L2O0ll6K7j0P3n8j1j8l1J80J7m8q7J21q2O2Rq6K7n8k8j0R8k0M8N7q1
$$ -19 26 -62 -142 -110 -50 -53 -89 -62 -72 1 -57 -68 -86 -117 63 80 32 -55 66 -16 46 55 -31 -4 -62 -90 -100 -2 -22 26 83 2
15945.6Bm5p0J03O5lK8j31N0k4l7J51j03N4J20j93j43J60o6Q9M1o5o1oJ21r2l8J60
$$ 2 -43 -113 -10 55 52 80 -51 -1 -25 -62 89 -14 40 160 -33 -176 -16 -82 7 48 -17 -78 -84 37 -55 -93 67
15925.8F7j61M8L5M0o1R8j31KN3m6O9j10J27O9k8j43J57j53J64k13J99j96J32m6r9
$$ 67 -94 -46 -11 29 -32 66 -65 -63 -10 -56 13 -97 30 99 71 -72 85 -68 96 -117 82 -114 18 -28 -127
15907.4a27K82q6p8Q3j43J36p8mo8M9l5O6j7R5n4p3m1M1M3j2J10j60L8J5M4l3l7Q1
$$ -127 155 69 -9 74 -69 67 -11 -15 -83 -34 -69 -3 -20 75 21 -52 -93 -52 -9 -21 89 -71 -33 -18 26 -7 -44 37
15886.9C7j05J30r3lN6J12j48j1rN0q6j0R8K8j06M2N9n9M2%J3k00J88j03K23l01J91
$$ 37 -68 62 -31 -34 22 134 -14 -25 -34 16 -70 -80 18 46 -60 -18 41 -18 24 24 37 -163 25 -78 145 -156 35
15867.1C5N6k5p3J6j14K44j8j27J7p1j9J19Q7p5m3j8Tp4N8TLJ4j9L1p9j46J09K0N8
$$ 35 91 66 -7 9 -105 139 121 -6 11 -60 -79 40 127 52 9 -9 -27 -101 -43 15 18 32 13 44 -35 -181 -72 -52 6
15845.8FL2l2j5P9Mr7n9M6J05j82P3J4o6J91q8oj43J55n9K7r5J07q2P1m1R6l4P2j19
$$ 6 38 6 -9 70 74 -23 -82 -36 69 -113 -40 -26 -92 99 11 5 -138 17 -42 -15 -110 -3 -85 -14 -55 41 7 79 -40
15824.5d0l5K3J20l23K43RM7j16O4k5j30J44n8l8m2Q6O1j26J50m2%pj09J67j49J26
$$ -40 -75 -52 68 -255 -12 -3 44 -72 -8 -33 -163 -19 -77 -115 -157 -71 -10 -136 14 -28 -28 -35 -144 23 -126 0
15805.5@p9P6q0P0M6l7l9j17J10M0N5p6MK8p7L2K5j2LJj47J43L9r5R7p0j0P0O1n3j24
$$ 0 -79 -3 -83 -13 33 -4 -43 -160 -50 -10 45 -31 -27 1 -76 -44 -19 -31 -28 -27 -174 -31 8 -87 10 -60 -70 0 61 8 -116
15782.7a16j1O9k7Lr6K34q3k6J5M6Lj1n4O4l9m6j7J70j34J5J7ML3k7j01J28O6q4j15
$$ -116 -127 -58 -85 -82 -178 56 -27 -53 -38 8 11 0 -54 10 -29 -75 -92 78 -56 -41 -24 -20 13 -14 -115 13 79 -5 -120
15761.5a20K06r8K5p6N5Q5Mj89J00r7l7J34o8J49n5mn9l8J00M1k24J17J5m7L5j8Qj6
$$ -120 86 -12 13 -63 -8 77 81 -108 -8 -105 -142 -8 -76 73 18 14 -45 -83 17 58 -166 -49 -34 -81 -46 -64 -56 -72
15740.9g2O4q3J64q4L9q8K8M6L4m4K4n5%M0j03J30k7K5o1PK9MM0j39L0K5R1k43K28
$$ -72 -8 -91 73 -11 28 -60 -32 14 48 4 28 -27 -27 13 -90 40 13 38 -23 -16 13 17 57 -82 -52 -27 64 -179 49
15719.7D9l4M5l1j6k9J5r9lP1kL3N6j23Q9n0k6J46o3j38O2RL0M7j9o4OM2j7p4J10n7
$$ 49 15 60 29 13 -16 -1 -100 -103 -32 -34 -1 55 -68 21 -29 -55 91 28 -110 -48 -39 -9 38 19 -45 -39 3 -14 -88 22 -35
15696.9c5K8j0Rj01J63m6j6J71j68N4jp3l6Nl5J46j1j31MJ0K07j95K5M9o0N9j64K05
$$ -35 -7 -17 -8 -109 54 8 -8 163 -5 49 48 -25 -61 -56 -91 55 44 -87 -83 -73 134 -61 -36 13 -47 12 -152 53
15676.4E3J2n0j36N5m1J04P0r4r8J91j45K00j59K2q8N1p1J51j01lJ0o2J44m3J04r9
$$ 53 65 15 -121 -66 -107 -3 67 -27 -125 66 -79 121 -38 -16 -104 -53 -124 27 -74 -77 -67 -129 15 -28 76 -23
15657.3b3J03j38M7M9l0r8n2J16k8O6Om6j6j4M9LM0o5K5lmNj06K06j81J20k3M5r3L8
$$ -23 80 -58 -11 38 8 -90 -142 -26 -54 12 18 -28 -44 -58 -9 -6 34 -31 -6 -9 -13 -8 -114 92 -89 31 8 53 -40 -2
15635.3bj16N4j2Q9M7Jo5jN8k6o1N6q1O9j11K5N7O2j04N2j23J49j21R1m3J17m5j42
$$ -2 -118 -64 -76 13 60 61 -4 -5 53 27 -34 22 -59 10 -101 -76 -19 43 -61 -9 -132 17 -104 -13 -56 61 16 -126
15614.8a26J70j79Q6L9k8j05J69N3r4p3J07l8l4R9j87K38j43J9%M2q4J56j51O9p9N8
$$ -126 44 -135 -49 -10 -38 -143 26 79 -15 -88 19 -19 -53 46 -141 97 -46 -27 -27 15 -69 87 -64 5 -74 -16
15595.7a6J47l1j42qOL7jr0P5MK4n3rN8Jo2N0Lk7qK3oj5J0J3k8p7R9q0J54j97J28q3
$$ -16 131 100 -42 -50 -44 -7 -8 -98 -23 -19 5 -48 -57 1 2 -60 -10 -7 -34 -42 -19 -25 -40 -30 -17 -45 -122 -23 -103 51 -146 -18 -101
15571.5a01J07Jj8R9j51J05j76R9q2P1J36j13r3Q9r6J17j0R8o8P9j14K1j00O4k2j5
$$ -101 6 7 -11 88 -63 42 -134 -35 -117 -46 90 -23 -116 -27 -123 -6 -16 82 14 93 -21 0 -100 -36 -58 -73
15552.5g3OJ26r3NK5j02J31k22K32k1r5j5k3M7o3N6J30j24M4j6O7r5K1l9j10K38j86
$$ -73 -67 59 -34 -29 -4 -106 25 -197 35 14 -81 -96 -119 -72 -135 -79 51 -73 -29 -45 22 -73 -52 -91 -201 37 -149
15532.6a49J11j0p2R6l4M2p8R8j6K2k7K6j5L4j2l3K8R9j31n9J1q7p4P9j0K47k00Q9
$$ -149 -38 -48 -120 -24 -58 -16 -94 4 -12 10 -17 9 -6 28 16 -17 11 110 -21 -80 -69 -156 -230 -151 -161 86 -114 -25
15512.1b5o6J52k0n1M9j22n4O8M3Mj01J78j07k6O7l0N8mO1j44Q4m1QN3m7O4L6n3r4
$$ -25 -91 61 41 -10 39 -83 -137 -69 -26 -22 -123 55 -52 -78 -11 -41 17 13 74 -70 14 -27 -19 34 -13 51 87 34 -60
15490.8f0Jl1k6J06l4L0N6j64M6O0P8j17k9J01j11J48j32J9l2K8q2P6P1J6q5%k8J7
$$ -60 -59 -90 -116 -10 -44 -14 42 -122 -76 -16 62 -55 -84 17 -94 54 -78 -59 -91 -63 -145 -69 2 18 -67 -67 -95 -78
15470.3g8J22Rj36j2J62m4TJ00J1j62J05Ro8N6N9o7o2n0J9J24Oj13J01q1P3j69J23
$$ -78 44 53 -83 -95 67 23 -21 79 90 -72 33 42 -26 30 89 22 -40 -90 -71 53 59 -54 47 -34 39 -130 -7
15450.5go5J16Jk7J8r6K9kk8k3pj7J0L2J05m9o2rO0JnJ7pm0J9oP3K2j25N1q5J80j07
$$ -7 -72 44 45 18 36 -60 -31 -33 -61 -84 -91 -108 -98 -66 39 -10 -72 -81 -21 -20 -25 -8 -15 -55 -36 -42 31 53 -72 -21 -106 74 -33
15426.3c3%P1j49N8p2O0J40j2m2p2KR8r1J6J76j19o2k9R5j09J36l6j73J76j31o7J52
$$ -33 -33 38 -111 -53 -125 -65 75 63 21 -51 -49 49 -42 -26 150 31 -31 -60 35 -74 62 26 -147 29 -102 -169 -17
15406.5a7q1J88j08k0k6R0k4j85PK21R5k58Q0m3J17j02J06o1qP3j10qJ07q8o2J17j1
$$ -17 -98 90 -18 -38 -64 26 2 -183 -176 45 140 -118 -38 -81 36 -66 40 -21 -29 44 -66 -74 33 -55 -117 0 -11
15386.7a1n8l9J09N8j03Q4l9o5O0p8O2O6j66O0J21k26O8O7r9J62q6Rq9oJ63j39o0K2
$$ -11 -69 -108 1 59 -44 40 1 -64 -4 -82 -20 46 -120 -60 61 -165 -97 -30 -129 33 -53 -44 -133 -139 24 -115 -175 -153
15366.2a53L9l8J0n7qK19Q34K169K393J598o173l44j19l94J74m1K0m3qJ6Olj43KN7
$$ -153 -114 -152 -142 -199 -207 12 846 3015 5408 7006 833 489 370 -24 150 109 129 86 78 94 100 97 -46 -44 13
15347.8A3J2K3K2m3J3n3J02L8j41M4N9L7j89Q7J5o6O5O6j37R3m7n3oP6N4o1J0n0P4
$$ 13 25 48 70 27 40 -13 89 127 -14 30 89 126 -63 24 39 -27 38 104 -33 60 13 -40 -46 30 84 23 33 -17 57
15326.6E7n2Mj38k2J90Pj4Nm2L4p2j6qR7N2l8l1MP8r8q2N6M1%L8Q3j60M6J3m9Q2q9
$$ 57 5 9 -129 -151 39 46 32 37 -5 29 -43 -59 -67 30 82 44 13 17 95 -3 -85 -29 12 12 50 133 -27 19 32 -17 65 -24
15303.1b4J25j05J2k7L3J32j36L6l9o7M8M3O8q9m6K0p3j7J39o0m5P0P4j62k3J86p2
$$ -24 101 -4 8 -19 14 146 10 46 7 -60 -12 31 99 10 -36 -16 -89 -106 33 -27 -72 -2 72 -90 -113 73 1
15283.3AL9o9L5R5j00j1N6K6j19J05p9M5K0m3n9L2M1N9j60J17j78K04j39NL7Qj36K56
$$ 1 40 -29 6 101 1 -10 46 72 -47 58 -21 24 44 1 -58 -26 15 74 -86 31 -147 57 -82 -77 -40 -32 -168 88
15262.8H8j00o8P1l7R3j86J07m6R5m3lJ28k03j2J23q4O2qJ0L1l8Q6j15o9J87o3j37
$$ 88 -12 -80 -9 -46 47 -139 -32 -78 17 -26 -29 99 -104 -116 7 -77 -15 -23 -13 18 -20 66 -49 -118 69 6 -131
15243a31Q8K0j1J26j62k2O6j2R5n6M5m5L0Q0j32R1m9pl1J7K9m5J5m7K5rP3l0Lm6N1
$$ -131 -43 -23 -34 92 -70 -92 -26 -38 57 1 46 1 31 111 -21 70 21 14 -17 0 29 -16 -1 -48 -23 -32 41 11 14 -32 19
15220.2A9p2Q6K6n8J08j48r6P3j24J85P8j4p7R1l4k8J4j0q5k6J3m2qJ57j19N3K5n4
$$ 19 -53 33 59 1 109 -39 -135 -62 -186 -1 77 63 -14 77 43 15 29 19 -66 -92 -79 -121 -129 28 -91 -38 -13 -67
15199.7f7l1J2J70n4q5n7J80k13J82L3o0o4o5J06k6Q2k7N5q4j9Tl2J9N8K4kJ5j4q6
$$ -67 -98 -86 84 30 -55 -112 68 -145 37 70 10 -54 -119 -13 -39 43 16 71 -13 -32 -51 -83 -64 -6 18 16 31 17 -69
15178.4f9N5J01k7j11pN6l2Q7o8l3J98j43M7j80L1MO5L5RK4O8p5j09N5j3L6N5k5n4
$$ -69 -14 87 60 -51 -58 -2 -34 53 -15 -48 150 7 54 -126 -95 -91 -26 9 18 42 110 35 -74 -19 -32 4 59 34 -20
15157.1b0J8o0O6m6O2j36K02j28mp6L7m6Q4qR8p8qm4M1J9N1Qn0k1R6l0o5m0q0K59j07
$$ -20 -2 -62 4 -42 20 -116 86 -42 -46 -122 -85 -131 -47 -55 43 -35 -43 -87 -46 -27 24 32 -18 -39 57 27 -38 -78 -158 101 -6
15134.4fj36K09j02N0o5J6M8o9Q6o1J18o0l1L7J16q0k17J06l9l6J56Qj00K09j22n4
$$ -6 -142 67 -35 15 -50 -34 14 -55 31 -30 88 28 -3 34 150 70 -147 -41 -80 -116 40 48 -52 157 35 -19
15115.3a9O5j26J79q9%o8J97j93N7o8Q4Q3j38J57j1j21J07k6p6nk7K0l7J5J08o3j36
$$ -19 46 -80 99 10 10 -58 139 -54 3 -65 19 102 -36 121 110 -11 96 70 -6 -11 -38 -18 -55 -40 68 5 -131
15095.5a31J04L0N6q3M4N6l1j17k9L6K1pJ11M5k7Lk6O8o0L1q7j40J15O0J8j44m6J47
$$ -131 -27 3 59 -24 20 76 45 -72 -101 -65 -44 -51 60 105 78 81 55 123 63 94 7 -133 -18 42 60 -84 -130 17
15075A7N8j79J59j47J0P7Q0j27j2J31l2k2q1nP5o1P0o5O2ljj7k8p6J19J7j25R0m3r7
$$ 17 75 -104 55 -92 -82 -5 75 -52 -64 67 35 13 -68 -73 2 -59 11 -54 8 5 4 -13 -41 -117 2 19 -106 -16 -59 -156
15053a56J65Q4k12J09q7R4n6RR7m8M2m9o2L1L3k8J0O5N3j92O2j6n0M5lL3N6m5k7mo1
$$ -156 9 93 -119 -10 -97 -3 -59 -50 47 -1 41 -8 -70 -39 -6 -34 -24 41 94 -98 -36 -52 -102 -57 -60 -27 29 -16 -43 -47 -108
15030.3a08J9J44r3j8J14mj60Q7n5J10o1Kk5K9NRO0j08N4%lM5nk1K8j20O6L1j46R7
$$ -108 -89 55 -38 -56 58 54 -106 -19 -74 36 -25 -23 -48 -19 -14 -5 55 -53 1 1 -2 43 38 17 45 -75 -9 22 -124 -27
15008.3b7mJ3k9j8J11j5j18n5K62l10P4K16j88L2P1M7j3o1j11O3J9J5n2M1k3j9k1l5
$$ -27 -31 -18 -47 -65 46 31 -87 -142 120 -190 -116 100 -88 -56 15 62 49 -12 -123 -60 -41 -26 -78 -37 -60 -79 -100 -135
14987.7a35K8R1M9nj17L6l2R6j04KR3o5l7J85M2k48J66m4Tj9K1k0J38j22nR8r5J67
$$ -135 -107 -16 33 28 -89 -53 -85 11 -93 -91 2 -63 -100 85 127 -121 45 1 -43 -62 -41 -61 77 -45 -50 48 -47 120
14967.2A20j69Q9jj37O4J11k15J72j14J01jj28J47j65J10L8j7j04L7J8Q0j54K25M7
$$ 120 -49 40 39 -98 -34 77 -138 34 -80 21 20 -108 39 -126 -16 22 5 -99 -62 -44 36 -118 107 154
14949.6A54j81j6R2Jj74J6l3M3J36j12k0lM5j47J97j38J53N4j47jJ5J06r1n9N8J42
$$ 154 -27 -43 49 50 -124 -108 -141 -98 38 -74 -94 -97 -52 -199 -2 -140 13 67 -80 -81 -66 40 -51 -110 -52 90
14930.5I0rj43L3N3o0J5j6N6m0j57J42O3m4J61j44m0J85k25N8Pj14J70j10N9j38J80
$$ 90 81 -62 -29 24 -36 -21 -37 19 -21 -178 -36 27 -17 144 0 -40 145 -80 -22 -15 -129 41 -69 -10 -148 32
14911.5C2K0rj20J73n0lj29J16j36K14p5TJ11J2j03n0N0j9J05j25N3J16j60l5k2J71
$$ 32 52 43 -77 96 46 43 -86 30 -106 108 33 -42 69 81 -22 -72 -22 -41 64 -61 -8 108 -52 -87 -109 62
14892.4F2l3l1jK5j6o2Q8jr2N5P2j42M2P7j16N5m2K2p2K3j5R9q8k6J68j4j03oJ65j37
$$ 62 29 -2 -3 22 6 -56 32 31 -61 -6 66 -76 -34 43 -73 -18 -60 -38 -110 -87 -102 -3 -91 -117 51 37 -66 -72 93 -44
14870.4d4J4j2oJ05j39o1J41r9J31Mo5J3j0nmK0LJ23j01N6M0j76J21j01J35j26j0k2
$$ -44 -30 -42 -48 57 -82 -143 -2 -101 30 34 -31 -18 -28 -33 -37 -17 -14 109 8 64 104 -72 49 -52 83 -43 -53 -75
14849.9g5J28O9j55M3l6O7r5N6m7O2j45J77J04j47RM8j29O1j9J8Jk1J02O6j39m7O0
$$ -75 53 122 -33 10 -26 41 -54 2 -45 17 -128 49 153 6 15 63 -66 -5 -24 -6 -5 -26 76 142 3 -44 16
14830.1A6j7O9m7j9k5m5K7l3J04qL6n3mj7j6L9j06P6n9N5Q3m7r3R3j00Q8O6j94M4M2
$$ 16 -1 68 21 2 -23 -68 -41 -74 30 22 58 5 1 -16 -32 7 -99 -23 -82 -27 56 9 -84 9 -91 -3 63 -131 -87 -45
14808.1d5K4j8k3K2M8j7j59R4N4p2OR5J12l6m0j29pM2R0j19O0rLJ5p5k5R8r8M0QJ07
$$ -45 -21 -39 -62 -40 8 -9 -168 -74 -20 -92 -86 9 121 85 45 -84 -91 -49 41 -78 -18 -27 -24 -9 -84 -109 -11 -109 -69 -61 46
14785.3D6M2j42l5J3J32p8O1j27K4j0k5J54j51j3L7Q0J7o3l1j3J41Pj38j6N6j02R1
$$ 46 88 -54 -89 -76 56 -22 39 -88 -64 -74 -99 55 -96 -109 -72 8 25 -38 -69 -82 59 66 -72 -88 -32 -134 -43
14765.5d3L6k8q0O8L2P2p5n3P1M3j69L1J7r5J30J2J4J24j41J63k18J1J4L2k8J61J5
$$ -43 -7 -35 -115 -47 -15 57 -18 -71 0 43 -126 -95 -78 -173 -43 -31 -17 107 -34 129 -89 -78 -64 -32 -60 101 116
14745.7A16j87Q9j1m8n2KR3L1j11J8O8M9q7L7%k2M7p9N6n7j2J18k5j47K1K4N9M7n7
$$ 116 -71 18 7 -41 -93 -91 2 33 -78 -60 8 57 -30 7 7 -15 32 -47 9 -48 -60 58 33 -114 -93 -69 -10 37 -20
14724.4b0M5M1j09J5nj47K01j05J00m6j37J12O6N4l9r5P6j1k6J4r6N5O8j52O4J24r2
$$ -20 25 66 -43 -28 -33 -180 21 -84 16 -30 -167 -55 11 65 26 -69 7 -4 -30 -16 -112 -57 11 -141 -77 47 -45
14704.6d5N3p2N9R6q6j0q0O3J39n7k6j03O9n2N7J49J73k38j15N2J7j1n6L2o1Q7qMj3
$$ -45 8 -64 -5 91 5 -5 -85 -22 117 60 34 -69 0 -52 5 154 327 89 -26 26 43 32 -24 8 -53 34 26 30 17
14683.4A7n9K7n1L3R8k4n4j3J31j06l6P7m8j33O7Q4m9Q8K3o4j52nJ48nO4o5r7J38j60
$$ 17 -42 -15 -66 -33 65 41 -13 -26 105 -1 -37 40 -8 -141 -74 10 -39 49 72 8 -144 -149 -1 -6 58 -7 -104 34 -126
14662.1a26J32J5k9l4J49n4j30J59j1n6K1q5l1n4Q4O7J9K7j00K8k8l5N5P8jr7LL2N0
$$ -126 6 21 -8 -42 107 53 -77 82 71 15 36 -49 -80 -134 -50 17 36 63 -37 -9 -37 -72 -17 61 60 -37 -34 -2 48
14640.8D8k6Lj16J20j5J5j12Q8j52J75Mq9J02J9m1j2n0k8N9m0r8O8N2P3j29J80r8R5
$$ 48 22 25 -91 29 14 29 -83 5 -147 28 32 -57 45 64 23 11 -39 -67 -8 -48 -146 -78 -26 47 -82 98 0 95
14620.3I5k11K19p0j49LJ70j46J8Q2r4J02m2M2Pn5M9j43R7j5M9p4J02o0pr7N4J20j12
$$ 95 -116 103 33 -116 -113 57 -89 -71 11 -83 19 -23 19 26 -29 20 -123 -26 -41 8 -66 36 -24 -31 -128 -74 46 -66
14599.8f6M8O3j67J06O3j2L5j04k7l0J96j41L1J71j92O9l1kj29J54j0Q1j42m1k5qR9
$$ -66 -18 45 -122 -16 47 35 70 -34 -61 -91 105 -36 -5 166 -26 43 12 10 -119 35 25 106 -36 -77 -102 -110 -11
14580a1KJ4Kj6J0j4P6r5J4m8m6M0q2K16q1om0j1J3Q1j46P0J9k3R2r6jO9J0j63J83q5
$$ -11 -9 5 7 -9 1 -13 63 -32 -18 -66 -112 -72 -154 62 -19 -25 -65 -76 -63 18 -128 -58 -39 -62 30 -66 -67 2 12 -151 32 -53
14556.5e3L8K0k4P1m3j75J30l2R2q1J7O9J4p7j1O7j13J32j53J42l5NL7k3q6K01j78
$$ -53 -15 5 -19 52 9 -166 -36 -68 24 -57 -40 29 43 -34 -45 22 -91 41 -112 30 -5 0 37 14 -72 129 -49
14536.7d9M9pk7n6K3m9K8N4R1k0nL4n9k6m1P6l9M1j11k7J1O8J5J1j14J23n6J46q1l6
$$ -49 0 -7 -34 -90 -67 -116 -88 -34 57 37 32 66 7 -19 -60 16 -23 18 -93 -120 -109 -41 -26 -15 -129 -6 -62 84 3 -33
14514.7c3m0M0n4J9N1J54j69n2N8n1J96k8r0p1J9J21j60J51p7r2Q5l8J77l09P9Q5J9
$$ -33 -73 -33 -87 -68 -17 137 -32 -84 -26 -77 119 91 1 -70 -51 70 -90 61 -16 -108 -23 -61 116 -193 -114 -29 -10
14494.9a0qk0J0N4j13P7m7Q4n3j11O1O0R0n6m1M4l7j61J68p4j4R5j57K36j62J16p1
$$ -10 -18 -38 -28 26 -87 -10 -57 27 -26 -137 -76 -16 74 18 -23 21 -16 -177 -9 -83 -97 -2 -159 77 -85 31 -40
14475.1d0p4N4j9J69j87o9K16k14J84o2rj2R7K2q6J7p8J2q5J32J12k2n6j76R5J0L8
$$ -40 -114 -60 -79 90 -97 -166 50 -164 20 -42 -51 -63 34 56 -30 -13 -91 -79 -164 -32 80 58 2 -174 -79 -69 -31
14455.3c1J4l5mn2L8R8n5j1J38o8k7p2N0K2m0L5n1M6p7j7J11r5l4J74p9K8q2J20o3
$$ -31 -17 -52 -56 -108 -70 28 -27 -38 100 32 5 -67 -17 5 -35 0 -51 -5 -82 -99 12 -83 -117 57 -22 6 -76 44 -19
14434a9p2J43j2j54J38r2k1J32n8M6j42Q4nk9RR1LL2j88k3J55KTn0M8m8k1M8n2J13
$$ -19 -91 52 40 -114 24 -68 -89 43 -15 31 -111 -27 -32 -61 -52 39 42 74 -114 -137 18 20 22 -28 20 -28 -49 -1 -53 60
14412F0j03P0m2L9M8k53K44j97N9J21P2N1k59J29j15J61j17M5k3P7k39J45N7p4l6J28
$$ 60 -43 27 -15 24 72 -181 63 -134 -75 46 118 169 -90 39 -76 85 -32 13 -10 67 -172 -27 30 -44 -80 48
14392.9D8kp3Q4m8K6p0o6J42j06J10Ll3M8j30Kj2R0j09p8R1J38j68P4K4m2J2J8J09
$$ 48 46 -27 57 9 35 -35 -101 41 -65 45 48 15 63 -67 -65 -77 13 -96 -174 -83 55 -113 -39 -15 -57 -45 -27 82
14372.4H2j05n2k7J28N5j12l2o3J66m6q6j0J04Nn8n6J11J05j28k3j4l3Q9O5L4q9j22
$$ 82 -23 -75 -102 26 81 -31 -63 -126 40 -6 -92 -102 2 7 -51 -107 4 109 -19 -42 -56 -89 0 65 99 10 -112
14352.6a12J80o4J29j82J77j31P1m5j02O3m0K4P0k05l7K27r1J24Jj30k8n0Q8N8o9j9
$$ -112 68 4 133 -49 128 -3 68 23 -79 -16 -56 -32 38 -167 -204 23 -68 56 57 -73 -101 -151 -63 -5 -74 -93
14333.5i3L5O9j18J38k0r8J2N9Q7m5j3n9n2n5L3J94j6o9K3m0L2p0J76q9r4J5P0J7j02
$$ -93 -58 11 -107 31 11 -87 -75 -16 71 26 13 -46 -98 -153 -120 74 58 -11 12 -28 4 -66 110 21 -73 -58 12 29 -73
$$ [...]
-1978.5A3
##END=$$ End of the C NMR data block
##END= $$ end of file