##TITLE=  aspirin,  2-(acetyloxy) benzoic acid
##JCAMP-DX= 4.24
##DATA TYPE= LINK
##BLOCKS= 2
##ORIGIN= Dept of Chemistry, UWI, Mona, JAMAICA
##OWNER= public domain
##TITLE= aspirin,  2-(acetyloxy) benzoic acid
##JCAMP-DX= 5.01  $$ exported from JSpecView
##DATA TYPE= NMR SPECTRUM
##DATA CLASS= XYDATA
##BLOCK ID=1
##ORIGIN= Dept of Chemistry, UWI, Mona, JAMAICA
##OWNER= public domain
##LONGDATE= 2002/05/22 17:33:00 -0500
##SPECTROMETER/DATA SYSTEM= Jeol Delta NMR
##$MODELS=
<Models>
<ModelData id="aspirin" type="MOL">
aspirin (2-(acetoxyl)benzoic acid)
RLACD/Labs0520021140  
http://wwwchem.uwimona.edu.jm/spectra
 21 21  0  0  0  0  0  0  0  0  0 V2000
   -0.8665    0.8024    0.0000 C   0  0  0  0  0  0  0  0  0  0  0  0
    0.4499    0.2908    0.0000 C   0  0  0  0  0  0  0  0  0  0  0  0
    1.5489    1.1509    0.0000 C   0  0  0  0  0  0  0  0  0  0  0  0
    1.3462    2.5308    0.0000 C   0  0  0  0  0  0  0  0  0  0  0  0
    0.0581    3.0583    0.0000 C   0  0  0  0  0  0  0  0  0  0  0  0
   -1.0298    2.1931    0.0000 C   0  0  0  0  0  0  0  0  0  0  0  0
   -2.1591    0.0020    0.0000 C   0  0  0  0  0  0  0  0  0  0  0  0
    1.5412   -2.0441    0.0000 C   0  0  0  0  0  0  0  0  0  0  0  0
    2.9836   -1.6136    0.0000 C   0  0  0  0  0  0  0  0  0  0  0  0
    0.5219   -1.1013    0.0000 O   0  0  0  0  0  0  0  0  0  0  0  0
   -3.2313    0.5672    0.0000 O   0  0  0  0  0  0  0  0  0  0  0  0
   -2.0988   -1.3365    0.0000 O   0  0  0  0  0  0  0  0  0  0  0  0
    1.1799   -3.1900    0.0000 O   0  0  0  0  0  0  0  0  0  0  0  0
    2.5593    0.7752    0.0000 H   0  0  0  0  0  0  0  0  0  0  0  0
    2.2106    3.1880    0.0000 H   0  0  0  0  0  0  0  0  0  0  0  0
   -0.0976    4.1321    0.0000 H   0  0  0  0  0  0  0  0  0  0  0  0
   -2.0482    2.5645    0.0000 H   0  0  0  0  0  0  0  0  0  0  0  0
   -1.1721   -1.6380    0.0000 H   0  0  0  0  0  0  0  0  0  0  0  0
    3.5898   -2.5187    0.0000 H   0  0  0  0  0  0  0  0  0  0  0  0
    3.2178   -1.0204   -0.8881 H   0  0  0  0  0  0  0  0  0  0  0  0
    3.2178   -1.0204    0.8881 H   0  0  0  0  0  0  0  0  0  0  0  0
  1  2  4  0  0  0  0
  1  6  4  0  0  0  0
  1  7  1  0  0  0  0
  2 10  1  0  0  0  0
  2  3  4  0  0  0  0
  3 14  1  0  0  0  0
  3  4  4  0  0  0  0
  4 15  1  0  0  0  0
  4  5  4  0  0  0  0
  5  6  4  0  0  0  0
  5 16  1  0  0  0  0
  6 17  1  0  0  0  0
  7 12  4  0  0  0  0
  7 11  4  0  0  0  0
  8  9  1  0  0  0  0
  8 10  1  0  0  0  0
  8 13  2  0  0  0  0
  9 21  1  0  0  0  0
  9 20  1  0  0  0  0
  9 19  1  0  0  0  0
 12 18  1  0  0  0  0
M  END
</ModelData>
</Models>
##$PEAKS=
<Peaks type="HNMR" xUnits="ppm" yUnits="arbitrary units" >
<PeakData  id="1" title="methyl group ~2.3" peakShape="singlet" model="aspirin" atoms="19,20,21"  xMax="2.83" xMin="1.83"  yMax="10000" yMin="0" />
<PeakData  id="2" title="H ~10.39" peakShape="multiplet" model="aspirin" atoms="18"  xMax="10.45" xMin="10.3"  yMax="10000" yMin="0" />
<PeakData  id="3" title="H ~6.94" peakShape="multiplet" model="aspirin" atoms="14"  xMax="7.0" xMin="6.9"  yMax="10000" yMin="0" />
<PeakData  id="4" title="H ~6.86" peakShape="multiplet" model="aspirin" atoms="16"  xMax="6.9" xMin="6.78"  yMax="10000" yMin="0" />
<PeakData  id="5" title="H ~7.46" peakShape="multiplet" model="aspirin" atoms="15"  xMax="7.54" xMin="7.38"  yMax="10000" yMin="0" />
<PeakData  id="6" title="H ~7.86" peakShape="multiplet" model="aspirin" atoms="17"  xMax="7.94" xMin="7.78"  yMax="10000" yMin="0" />
</Peaks>

##SOLVENT NAME= 
##.OBSERVE FREQUENCY= 300.529655924288
##.OBSERVE NUCLEUS= ^1H
##XUNITS= HZ
##YUNITS= ARBITRARY UNITS
##XFACTOR= 1
##YFACTOR= 8.248340E-02
##FIRSTX= 3.636410E+03
##FIRSTY= -1.796688E+02
##LASTX= -3.108138E+01
##NPOINTS= 26649
##XYDATA= (X++(Y..Y))
$$ [...]
1880.9427061088e91k18m36R4j87r3r4%n60K18K80TM05J55r3O2j87%l42j56m04a743
$$ -591 -809 -1245 -1151 -1338 -1431 -1525 -1525 -2085 -1867 -1587 -1307 -902 -747 -840 -778 -965 -965 -1307 -1463 -1867 -1743
1877.91606797a867O85o3O3k81J87%r3J55%l42J56M35l1j86N60k80m05k80a089
$$ -1867 -1182 -1245 -1182 -1463 -1276 -1276 -1369 -1214 -1214 -1556 -1400 -965 -996 -1182 -622 -902 -1307 -1587 -1089
1875.1646188218a058j56o2L1n91J56L11K49k18K80J87k80TR3l11K49k49%J55a027
$$ -1058 -1214 -1276 -1245 -1836 -1680 -1369 -1120 -1338 -1058 -871 -1151 -1431 -1338 -1649 -1400 -1649 -1649 -1494 -1027
1872.4131061088h71J24j24O2m05J25m05o2J25J86j55K18m67O2L11R4%j56l1a089
$$ -871 -747 -871 -809 -1214 -1089 -1494 -1556 -1431 -1245 -1400 -1182 -1649 -1587 -1276 -1182 -1182 -1338 -1369 -1089
1869.6616933959a649k80O22K80k80O2l73K18k18M36k18L73n60M36r4J25M04f85
$$ -1649 -1929 -1307 -1027 -1307 -1245 -1618 -1400 -1618 -1182 -1400 -1027 -1587 -1151 -1245 -1120 -716 -685
1867.1853061088i96j55l1J86j86J24o2R3m67k17K80O53j56k17K17L2%J55j87i65
$$ -996 -1151 -1182 -996 -1182 -1058 -1120 -1027 -1494 -1711 -1431 -778 -934 -1151 -934 -902 -902 -747 -934 -965
1864.4338933959a027r3%l1J24O22j55r3m36J24J25J24J56j25l73K80j56j24a400
$$ -1027 -1120 -1120 -1151 -1027 -405 -560 -653 -1089 -965 -840 -716 -560 -685 -1058 -778 -934 -1058 -1400
1861.8199806829a494K49M05o2J86j24r4R4l11m36J56j56K80l1J56L1K49k80a494
$$ -1494 -1245 -840 -902 -716 -840 -934 -840 -1151 -1587 -1431 -1587 -1307 -1338 -1182 -1151 -902 -1182 -1494
1859.20616797a556K80L42r3k80m04o3O54l1L73O2k18o53L42l1TJ56l1k18a369
$$ -1556 -1276 -934 -1027 -1307 -1711 -1774 -1120 -1151 -778 -716 -934 -1587 -1245 -1276 -1307 -1151 -1182 -1400 -1369
1856.4546188218a463J87o2R3O3J55R3j55N29M98%m98m67%n91N91o2j25K49j86a214
$$ -1463 -1276 -1338 -1245 -1182 -1027 -934 -1089 -560 -62 -62 -560 -1027 -1027 -1618 -1027 -1089 -1214 -965 -1151 -1214
1853.5656188218a027o2J24K49L74k18L1m36L1j24L73o22n60M04M98l11K80j55h40
$$ -1027 -1089 -965 -716 -342 -560 -529 -965 -934 -1058 -685 -1307 -1867 -1463 -965 -1276 -996 -1151 -840
1850.9516933959c11j25l42j24K80M04o22l42J24K49r3k80l74K49M67r4o22J56a151
$$ -311 -436 -778 -902 -622 -218 -840 -1182 -1058 -809 -902 -1182 -1556 -1307 -840 -934 -1556 -1400 -1151
1848.33786797a369o23R34K49j25R4K18l12j24r3O2j25l1m98K80R4O2k18L43a027
$$ -1369 -1992 -1058 -809 -934 -840 -622 -934 -1058 -1151 -1089 -1214 -1245 -1743 -1463 -1369 -1307 -1525 -1182 -1027
1845.5863061088a089k49K80J87J24o2J24j86r4j86O53%l11m05J25j87l1M98a56
$$ -1089 -1338 -1058 -871 -747 -809 -685 -871 -965 -1151 -498 -498 -809 -1214 -1089 -1276 -1307 -809 -156
1842.9724806829d67k80TJ56K18L73%k18j87r3L42K80m04R3j55j56k49J87n60a276
$$ -467 -747 -1027 -871 -653 -280 -280 -498 -685 -778 -436 -156 -560 -467 -622 -778 -1027 -840 -1400 -1276
1840.2209806829i96J87o2R3k18M67K80l42o23K49j24k18R3j55m98L73O3M97h09
$$ -996 -809 -871 -778 -996 -529 -249 -591 -1214 -965 -1089 -1307 -1214 -1369 -1867 -1494 -1431 -934 -809
1837.60716797h71l1j25l1N60j24%k80O2J55o53r3L73m05L2K80J86l42L11a089
$$ -871 -902 -1027 -1058 -498 -622 -622 -902 -840 -685 -1338 -1431 -1058 -1463 -1431 -1151 -965 -1307 -996 -1089
1834.8556188218a276r3J87K17M67l1o2n29L73K80k18m04L42k49%k18O54m05a027
$$ -1276 -1369 -1182 -965 -498 -529 -591 -1120 -747 -467 -685 -1089 -747 -996 -996 -1214 -560 -965 -1027
1832.2417933959i65o2k49O23k49m05J56L42%O85l12J56k49r3l1J86l11%R3j55a214
$$ -965 -1027 -1276 -653 -902 -1307 -1151 -809 -809 -124 -436 -280 -529 -622 -653 -467 -778 -778 -685 -840 -1214
1829.3526933959i34O3M04l11J87R3l42r4M67l11r3j87N60o2l11k80o3j55o2a400
$$ -934 -871 -467 -778 -591 -498 -840 -934 -467 -778 -871 -1058 -498 -560 -871 -1151 -1214 -1369 -1431 -1400
1826.6012933959a276j55L42j56L11J87l1r3J55k18N61j56j24k49L11j87l1j56f85
$$ -1276 -1431 -1089 -1245 -934 -747 -778 -871 -716 -934 -373 -529 -653 -902 -591 -778 -809 -965 -685
1823.9873806829a027o2k80%J55M36l73o3o2R4k81J25l1l74L43P15m04l42%M97i96
$$ -1027 -1089 -1369 -1369 -1214 -778 -1151 -1214 -1276 -1182 -1463 -1338 -1369 -1743 -1400 -685 -1089 -1431 -1431 -934 -996
1821.0983806829a027j55J24%K49L1k18O2O23j25j86o54M98J87k49k80o2L73f22
$$ -1027 -1182 -1058 -1058 -809 -778 -996 -934 -311 -436 -622 -1276 -778 -591 -840 -1120 -1182 -809 -622
1818.4844061088i34k48m36%l1o2M66L11M05l1R3l73m36J25j25O23%m67j25K49f53
$$ -934 -1182 -1618 -1618 -1649 -1711 -1245 -934 -529 -560 -467 -840 -1276 -1151 -1276 -653 -653 -1120 -1245 -996 -653
1815.5954061088g78l73M66j55j25r3K49L73J87o22J24l42L1%N29L11L74l43c42
$$ -778 -1151 -685 -840 -965 -1058 -809 -436 -249 -871 -747 -1089 -1058 -1058 -529 -218 156 -187 -342
1812.9814806829e29L11r3k49j56L1N92%m67K80R3J56o22K17m66j87O2j87M05d36
$$ -529 -218 -311 -560 -716 -685 -93 -93 -560 -280 -187 -31 -653 -436 -902 -1089 -1027 -1214 -809 -436
1810.23006797d98r3k80J86m35K18O2K49%To2r4l11M05j56M04n91L11R4o2c73
$$ -498 -591 -871 -685 -1120 -902 -840 -591 -591 -591 -653 -747 -1058 -653 -809 -405 -996 -685 -591 -653 -373
1807.3409806829f22k80L42R3J87m05J25l1L11j25O3l11o3l1R4R3N29o85L11b49
$$ -622 -902 -560 -467 -280 -685 -560 -591 -280 -405 -342 -653 -716 -747 -653 -560 -31 -716 -405 -249
1804.5895806829e60l11j25K80L43l74l11J87P47n92m04K80Tk49o22k80K80%g16
$$ -560 -871 -996 -716 -373 -747 -1058 -871 -124 -716 -1120 -840 -560 -809 -1431 -1711 -1431 -1431 -716
1801.9756188218i34j24K49M04j55K49J55j55l42J86r3l1R3j55n29L11TK18Tj25a56
$$ -934 -1058 -809 -405 -560 -311 -156 -311 -653 -467 -560 -591 -498 -653 -1182 -871 -560 -342 -124 -249 -156
1799.0866188218a24p16L1l1L1m36L74K18l2j55O2N29%l73l43l1L1R4K18m67i02
$$ -124 -840 -809 -840 -809 -1245 -871 -653 -685 -840 -778 -249 -249 -622 -965 -996 -965 -871 -653 -1120 -902
1796.19756797a400K18K17%r3M67K80k18k80l42K80J86m66R3O2M67L1T%TL43F2
$$ -1400 -1182 -965 -965 -1058 -591 -311 -529 -809 -1151 -871 -685 -1151 -1058 -996 -529 -498 -467 -467 -467 -124 62
1793.1709806829b49j24K49j56n60L1l1k18J24R4k18R3K18n29n91J120j24K80a058
$$ -249 -373 -124 -280 -840 -809 -840 -1058 -934 -840 -1058 -965 -747 -1276 -1867 -747 -871 -591 -1058
1790.5570061088i02%K17l42J87L1k49O2%l42L1l1P78N91j24m36o2J55j24j25a87
$$ -902 -902 -685 -1027 -840 -809 -1058 -996 -996 -1338 -1307 -1338 -560 31 -93 -529 -591 -436 -560 -685 -187
1787.6680061088d98o2TM98l12o2j87%J87%J25L42m36N91j86n60o3k80J25K80i65
$$ -498 -560 -622 -124 -436 -498 -685 -685 -498 -498 -373 -31 -467 124 -62 -622 -685 -965 -840 -560 -965
1784.77906797h09N29m67l11j56J87K18M36K80m67k49r3M66%L12k81o2m98h40
$$ -809 -280 -747 -1058 -1214 -1027 -809 -373 -93 -560 -809 -902 -436 -436 -124 -405 -467 -965 -840
1782.1651061088e60M04p15l74L1L43J55J56l42j56M67O2o85M05K18j56k18R4f22
$$ -560 -156 -871 -1245 -1214 -871 -716 -560 -902 -1058 -591 -529 -1214 -809 -591 -747 -965 -871 -622
1779.5511806829c73l2j24R3L12l12K18r3N60o85l73L42K49n60k18k49J56J55i02
$$ -373 -405 -529 -436 -124 -436 -218 -311 249 -436 -809 -467 -218 -778 -996 -1245 -1089 -934 -902
1776.9373061088h40%o2K49o3K18l11L1j24o3o2N91R4K80L1M67o3L2m05k18m35f85
$$ -840 -840 -902 -653 -716 -498 -809 -778 -902 -965 -1027 -436 -342 -62 -31 436 373 405 0 -218 -653 -685
1773.9106806829f85r3k49O2r3L11K80J87r3k49n92O3%O53K80L1l1r3o2M04k80c73
$$ -685 -778 -1027 -965 -1058 -747 -467 -280 -373 -622 -1214 -1151 -1151 -498 -218 -187 -218 -311 -373 31 -249 -373
1770.8840933959c73L42m36j24r4K80J87L74k49l74l11L42J87j56l1J25l42l43e91
$$ -373 -31 -467 -591 -685 -405 -218 156 -93 -467 -778 -436 -249 -405 -436 -311 -653 -996 -591
1768.27026797f2k49L42k49%m04L42o2l43l1K18%L42n29L12%k80r4M05j56e29
$$ -62 -311 31 -218 -218 -622 -280 -342 -685 -716 -498 -498 -156 -685 -373 -373 -653 -747 -342 -498 -529
1765.38116797b80L1j24L11l74K18K49k80k18r3m36J87K80K49m67l1k80J87a089
$$ -280 -249 -373 -62 -436 -218 31 -249 -467 -560 -996 -809 -529 -280 -747 -778 -1058 -871 -1089
1762.7673061088g47J56R3k80J56J86J25j87l73J55J25j25R4%L1O2K80j87R4e60
$$ -747 -591 -498 -778 -622 -436 -311 -498 -871 -716 -591 -716 -622 -622 -591 -529 -249 -436 -342 -560
1760.0158061088g16k80L1j55R3L42L74m05%K18R3m97M97L2o3J25j25k49%j24d98
$$ -716 -996 -965 -1120 -1027 -685 -311 -716 -716 -498 -405 -902 -405 -373 -436 -311 -436 -685 -685 -809 -498
1757.1268061088d98r3k49j25M36j24r4O23R3L1m36k80R4L42k18%m67M98k80f85
$$ -498 -591 -840 -965 -529 -653 -747 -124 -31 0 -436 -716 -622 -280 -498 -498 -965 -467 -747 -685
1754.3752933959g47M98o2%L1R3m35j56K80K49m04K80J55%l42%J24N92k49O2f2
$$ -747 -249 -311 -311 -280 -187 -622 -778 -498 -249 -653 -373 -218 -218 -560 -560 -436 156 -93 -31 -62
1751.4862061088F2n60r3R3J25J55K49o22l1r4R4l12K49l1k49R4N60o23%J25c11
$$ 62 -498 -591 -498 -373 -218 31 -591 -622 -716 -622 -934 -685 -716 -965 -871 -311 -934 -934 -809 -311
1748.5972061088d36L1o2k18j86O2L42N60j86j25o2K18q09r4k49L74L11J56j25c11
$$ -436 -405 -467 -685 -871 -809 -467 93 -93 -218 -280 -62 -871 -965 -1214 -840 -529 -373 -498 -311
1745.8457933959c42o3J25R3%L74k80%l12L2k80M04k49r3K18J24j56%VK18m98g78
$$ -342 -405 -280 -187 -187 187 -93 -93 -405 -373 -653 -249 -498 -591 -373 -249 -405 -405 -405 -405 -405 -187 -685 -778
1742.5439806829b18R4n29l74l1N60N29J25k18K18k18K18J55L1j55M04j86r4b80
$$ -218 -124 -653 -1027 -1058 -498 31 156 -62 156 -62 156 311 342 187 591 405 311 -280
1739.93016797@l11l42r4M67O2l1k18j86J55l73j87P47o2k18K49r4J87N29c42
$$ 0 -311 -653 -747 -280 -218 -249 -467 -653 -498 -871 -1058 -311 -373 -591 -342 -436 -249 280 -342
1737.1786188218c42%M35n29J87j87O3j56J24r3R3m66M04J56M98R3j24o3k80g78
$$ -342 -342 93 -436 -249 -436 -373 -529 -405 -498 -405 -871 -467 -311 187 280 156 93 -187 -778
1734.4272061088g16L74L42p78M98J87j56l73k49o3N92k18j56j55O2j56M05L11a24
$$ -716 -342 0 -778 -280 -93 -249 -622 -871 -934 -342 -560 -716 -871 -809 -965 -560 -249 -124
1731.8132806829b80o2j25J87%m05l42M67L1%J87N91k18j24n92R4J86J87R4K48c42
$$ -280 -342 -467 -280 -280 -685 -1027 -560 -529 -529 -342 249 31 -93 -685 -591 -405 -218 -124 124 -342
1728.9242806829c42l1O2l42L73%k18l42l1M98N29m05k18l42L1L11Tj55%l74f53
$$ -342 -373 -311 -653 -280 -280 -498 -840 -871 -373 156 -249 -467 -809 -778 -467 -156 -311 -311 -685 -653
1726.0352806829d36R4k49J55j86K49l74r3O2r3L11L42o2R3o2O2m66R3k18L73a24
$$ -436 -342 -591 -436 -622 -373 -747 -840 -778 -871 -560 -218 -280 -187 -249 -187 -653 -560 -778 -405 -124
1723.1461806829i3m36K18O2l73l1L1j56N60o2l11L1J55%J25n60M67K49R3O2F2
$$ -93 -529 -311 -249 -622 -653 -622 -778 -218 -280 -591 -560 -405 -405 -280 -840 -373 -124 -31 31 62
1720.2570933959@r3k80J86L1J56j24J55j87%l1L74j87K49j56L74l74o2n29n60i02
$$ 0 -93 -373 -187 -156 0 -124 31 -156 -156 -187 187 0 249 93 467 93 31 -498 -1058 -902
1717.3681061088d05O3%j87R3k17K80j87M04%l1J25l1k18L42n29j24L73K80l42e60
$$ -405 -342 -342 -529 -436 -653 -373 -560 -156 -156 -187 -62 -93 -311 31 -498 -622 -249 31 -311 -560
1714.4790061088a245O54%n60L42N29l11L1K49L11m67R4J86K80o2M98J56K49E29
$$ -1245 -591 -591 -1151 -809 -280 -591 -560 -311 0 -467 -373 -187 93 31 529 685 934 529
1711.8651806829B49n60L1j56l1l42M36j87K18j56J25k18K49TO53r3O2m05l73d36
$$ 249 -311 -280 -436 -467 -809 -373 -560 -342 -498 -373 -591 -342 -93 560 467 529 124 -249 -436
1709.1136806829f22j87J56j56o2k18N29J24L43l12J25J24M05m05r3k18j24l43b18
$$ -622 -809 -653 -809 -871 -1089 -560 -436 -93 -405 -280 -156 249 -156 -249 -467 -591 -934 -218
1706.4998061088b80L42K80L1m66J24l1k80l11K80%Tm67J25R3k18O2M67r3J55c1
$$ -280 62 342 373 -93 31 0 -280 -591 -311 -311 -311 -778 -653 -560 -778 -716 -249 -342 -187 -31
1703.6108061088b18p16M36L74R3j56%o2m36k49J87M98K49l42j56o2M67m98L1a87
$$ -218 -934 -498 -124 -31 -187 -187 -249 -685 -934 -747 -249 0 -342 -498 -560 -93 -591 -560 -187
1700.8592933959B18m05R4R3j87l73r3m98M98L1M66O3l1J24j24m36K80K18k18b18
$$ 218 -187 -93 0 -187 -560 -653 -1151 -653 -622 -156 -93 -124 0 -124 -560 -280 -62 -280 -218
1698.1078933959i3M04%Tl11m05N29K81k81o53L73l1K49n60M98r3L1L11l1m36b49
$$ -93 311 311 311 0 -405 124 405 124 -529 -156 -187 62 -498 0 -93 -62 249 218 -218 -249
1695.2188061088c11M35j55l74R4O84l42j87M05K18m05J56o2k18k49K49r4J25b18
$$ -311 124 -31 -405 -311 373 31 -156 249 467 62 218 156 -62 -311 -62 -156 -31 -218
1692.6049806829C1j24L1TJ55l1O3J55J25%L1r4%k80N60r3j55k49J86k49K49A56
$$ 31 -93 -62 -31 124 93 156 311 436 436 467 373 373 93 653 560 405 156 342 93 342 156
1689.5782933959F2k18K18TL73k48o3j55K49q41o2N29k80%M36l42R3TJ25O2J56B18
$$ 62 -156 62 280 653 405 342 187 436 -405 -467 62 -218 -218 218 -124 -31 62 187 249 405 218
1686.55176797C73%j55L11r3l74r3l42K17M05M67L11K49o54k80k49J56j56A56
$$ 373 373 218 529 436 62 -31 -373 -156 249 716 1027 1276 622 342 93 249 93 156
1683.9378061088F2o2k18L1O3o3o2O2O3N29l43K49l1j24l2k48L1j87l1j25m66e91
$$ 62 0 -218 -187 -124 -187 -249 -187 -124 405 62 311 280 156 124 -124 -93 -280 -311 -436 -902 -591
1680.91126797d36M67L74L42m05n29j86M66l11l73L1K49R3K49m04r4J56L73c11
$$ -436 31 405 747 342 -187 -373 93 -218 -591 -560 -311 -218 31 -373 -467 -311 62 -311
1678.2972933959e91J55r3k80P16N29J24l42%L11L73n60l11%J87k49%m36O85E60
$$ -591 -436 -529 -809 -93 436 560 218 218 529 902 342 31 31 218 -31 -31 -467 218 560
1675.5457933959A24k17%j56M67r4r3k80M36l74K18TL1k49J56o3J25O2L11l73B80
$$ 124 -93 -93 -249 218 124 31 -249 187 -187 31 249 280 31 187 124 249 311 622 249 280
1672.6567933959F2K18J56l12m97K80J55M36L42n91n29L73J87k18J25j56j55I3
$$ 62 280 436 124 -373 -93 62 498 840 249 -280 93 280 62 187 31 -124 93
1670.1805061088c11R3J25M35K49j86m36K80J56J86m67l42J56N29%l1l74L1k17a24
$$ -311 -218 -93 342 591 405 -31 249 405 591 124 -218 -62 467 467 436 62 93 -124 -124
1667.4289933959c11M98N60L11m98o2Tl74L43J86o84l43l1r3o2K80L42N29l1A56
$$ -311 187 747 1058 560 498 436 62 405 591 -93 -436 -467 -560 -622 -342 0 529 498 156
1664.6775933959f2M04O3R3k80j87o2k18r3l1l2R4J24M98m67j24J56r4l42j058a556
$$ -62 342 405 498 218 31 -31 -249 -342 -373 -405 -311 -187 311 -156 -280 -124 -218 -560 -1618 -1556
1661.7885061088A87K49N60o2l74k18L1p46M97l42M36k80l11K17J87m67R34K18F22
$$ 187 436 996 934 560 342 373 -373 124 -218 218 -62 -373 -156 31 -436 498 716 622
1659.1746806829B80L11k80%n29M36K80K18n29j56R3j55l11N91L11L42m97o3B80
$$ 280 591 311 311 -218 218 498 716 187 31 124 -31 -342 249 560 902 405 342 280
1656.5607061088A24k80K18r3L11TR4o23J25K18O2j25r3m05%o2M36O2K80n29A87
$$ 124 -156 62 -31 280 591 685 62 187 405 467 342 249 -156 -156 -218 218 280 560 31 187
1653.6716188218a56%J25J24o2K49m36J25j56N92j56J56%J24l73J86k18m04j87f2
$$ -156 -156 -31 93 31 280 -156 -31 -187 405 249 405 405 529 156 342 124 -280 -467 -62
1650.9202061088f2N91L11j55k49r4O3O2L1j25k49%R4K80k18k49n60j24R3M36F2
$$ -62 529 840 685 436 342 405 467 498 373 124 124 218 498 280 31 -529 -653 -560 -124 62
1648.0312061088D98l74o84o2P78l2J56N29K18m67j87j55O2L1J25l12K49l1J56D98
$$ 498 124 -560 -622 156 124 280 809 1027 560 373 218 280 311 436 124 373 342 498 498
1645.2796933959C73l1R4n60R3K18M04l1L1l11J25k49TO2M36O2J24L1R4k49K49C42
$$ 373 342 436 -124 -31 187 591 560 591 280 405 156 -93 -31 405 467 591 622 716 467 716 342
1642.25316797B80j24M35%k18l42J25J55L74%l74m35K48j86R3O2%l11L1R4F22
$$ 280 156 591 591 373 31 156 311 685 685 311 -124 124 -62 31 93 93 -218 -187 -93 622
1639.36406797D98J55%L74o2K17p77L1K17k17p16M04R4m05j55N60l1L42L1F53
$$ 498 653 653 1027 965 1182 405 436 653 436 -280 124 218 -187 -342 218 187 529 560 653
1636.6126188218B18j56n29M05J55r3N91O23n61%k48L42j25N29n29o2J25J86H40
$$ 218 62 -467 -62 93 0 591 1214 653 653 405 747 622 1151 622 560 685 871 840
1633.9986933959E91r3l11j56L42%TL74L11l73k80o3R4m98J55R4K80o2j87o54A24
$$ 591 498 187 31 373 373 373 747 1058 685 405 342 436 -62 93 187 467 405 218 -436 124
1631.1096933959B80O2O3k18TL11l1r3o3K49l1L74n92k80K80L43m05L11j24J24D67
$$ 280 342 405 187 -31 280 249 156 93 342 311 685 93 -187 93 436 31 342 218 342 467
1628.2205933959D67K49L1k49j25l42l73k18O84l1%J25L11L73K80l11K80k80A276
$$ 467 716 747 498 373 31 -342 -560 124 93 93 218 529 902 1182 871 1151 871 1276
1625.60676797H09%L1j87j24j56K49TJ56M67n29O2T%K49k49n91l11m98J87A24
$$ 809 809 840 653 529 373 622 871 1027 1494 965 1027 1089 1089 1338 1089 498 187 -311 -124 124
1622.7176806829F2m04M04M05J55n29J56J87L1J55M98n29j86j25l1O2r3r4K81C11
$$ 62 -342 62 467 622 93 249 436 467 622 1120 591 405 280 249 311 218 124 405 311
1619.9662806829D98r3L1J86o2O2K18o2k18r3J86L2R3l73j25l73L73M36K80j56H09
$$ 498 405 436 622 560 622 840 778 560 467 653 685 778 405 280 -93 280 716 996 840 809
1617.0771806829E29o2j56L42j24O2o2L11k18M36m05k80m97L42J24%j24O84o2F22
$$ 529 467 311 653 529 591 529 840 622 1058 653 373 -124 218 342 342 218 902 840 622
1614.32576797D36J55m98J25K18L42m98O2l1%R4%J86l1j87O54j56R4O22L42A027
$$ 436 591 93 218 436 778 280 342 311 311 405 405 591 560 373 1027 871 965 1587 1929 1027
1611.4366806829I65R3L1m67j86j87K49R3K49J25L11k18m05p15K49K18M35K80A214
$$ 965 1058 1089 622 436 249 498 591 840 965 1276 1058 653 -62 187 405 840 1120 1214
1608.8228061088H71l1l73k80o3N29j55m67o2O22l1n29J25Q09m98J86K49j86C11
$$ 871 840 467 187 124 653 498 31 -31 591 560 31 156 965 467 653 902 716 311
1606.2089806829E29r3N91M98L1n91j87TJ25J24O2j86l1j87L11j56l42r3L11D05
$$ 529 436 1027 1525 1556 965 778 591 716 840 902 716 685 498 809 653 311 218 529 405
1603.45746797D36J24J25l43R4R3N29L1l1l11j25j24J55J87R4l43k80L1O23D67
$$ 436 560 685 342 436 529 1058 1089 1058 747 622 498 653 840 934 591 311 342 965 467
1600.70606797I34o3k49L1k17%k49m67R65L42j56n60K80J56r4L2K80r4K80A058
$$ 934 871 622 653 436 436 187 -280 685 1027 871 311 591 747 653 685 965 871 1151 1058
1597.95456797A027j87j55O2L1l11L11l42k18O2j87%N92j56%TJ24O3l1O2K80I96
$$ 1027 840 685 747 778 467 778 436 218 280 93 93 685 529 529 529 653 716 685 747 1027 996
1594.9279806829A400r3j87l73L1j25j55k80O2k80J24L43M04r3O2l1L11%k18C42
$$ 1400 1307 1120 747 778 653 498 218 280 0 124 467 871 778 840 809 1120 1120 902 342
1592.17646797@L42M36R3K49l11o2R3M98m98J56k80L73R3l1j24K18l74m66E29
$$ 0 342 778 871 1120 809 747 840 1338 840 996 716 1089 1182 1151 1027 1245 871 405 529
1589.42496797F85r4J56K18J55q71M36o3R4K18L1j87O2J56K80j87k80%R3l11G78
$$ 685 591 747 965 1120 249 685 622 716 934 965 778 840 996 1276 1089 809 809 902 591 778
1586.53596797E91M98J56m67R3R4m05j87l1O3O22M04m66k80K80%r4o2k80L42G78
$$ 591 1089 1245 778 871 965 560 373 342 405 1027 1431 965 685 965 965 871 809 529 871 778
1583.64696797E91L43N91l74r3O2L11l11j55R3K18j87r3k49M35l73j56k17I96
$$ 591 934 1525 1151 1058 1120 1431 1120 965 1058 1276 1089 996 747 1182 809 653 436 996
1581.0329933959A245q40n61M67l1J87j56r3J87M97L2M66r3L11k18k49l11J25A151
$$ 1245 405 -156 311 280 467 311 218 405 902 934 1400 1307 1618 1400 1151 840 965 1151
1578.4191806829A525o2l74k49j55l43k18M05K18l42L11l1j25k18K49k49R4j25E91
$$ 1525 1463 1089 840 685 342 124 529 747 405 716 685 560 342 591 342 436 311 591
1575.80526797F22M05o2%l74M36m67O2K49L1O3l1J24j24r4k18R4M66l1k80C1
$$ 622 1027 965 965 591 1027 560 622 871 902 965 934 1058 934 840 622 716 1182 1151 871 31
1572.91626797D67P47k18TO53l1m35j56J25K48L74k18o2m98L73J87%k49L1E91
$$ 467 1214 996 778 1431 1400 965 809 934 1182 1556 1338 1276 778 1151 1338 1338 1089 1120 591
1570.1647061088A182J87l1%r3O2l1%L42m04k18O2L11k49%j24N60j56o2m98M98A463
$$ 1182 1369 1338 1338 1245 1307 1276 1276 1618 1214 996 1058 1369 1120 1120 996 1556 1400 1338 840 1338 1463
1567.13816797A307O2l73R3O22l42m67n29M05O2J25L11L1l73J86l73R3l1L73A276
$$ 1307 1369 996 1089 1711 1369 902 373 778 840 965 1276 1307 934 1120 747 840 809 1182 1276
1564.3866188218A494l43o2l1m36m04R3M36%l74O3K80K49k18L11m05K81K48M36A463
$$ 1494 1151 1089 1058 622 218 311 747 747 373 436 716 965 747 1058 653 934 1182 1618 1463
1561.6352061088A556k80k18n60M36r4K80%R4l74M36l11%L1K80l74o2o22J87D98
$$ 1556 1276 1058 498 934 840 1120 1120 1214 840 1276 965 965 996 1276 902 840 218 405 498
1558.8836933959H71k49J56j25o2N29M36m05K49Tj24l74%m98L43N60J24l42j56I34
$$ 871 622 778 653 591 1120 1556 1151 1400 1649 1525 1151 1151 653 996 1556 1680 1338 1182 934
1556.1322933959A151K18j55m98M35l11R4l12M05M04o2m98%K80Tl11j86j87M98A027
$$ 1151 1369 1214 716 1151 840 934 622 1027 1431 1369 871 871 1151 1431 1120 934 747 1245 1027
1553.3807933959H09K49J56o3O3j25L1M67L11o84j56J24j55O2M67o22O2R3L11F22
$$ 809 1058 1214 1151 1214 1089 1120 1587 1898 1214 1058 1182 1027 1089 1556 934 996 1089 1400 622
1550.6293806829A058L42L74l11l43j24o2k49J24o2O2TN92j25m36j86M66J56A431
$$ 1058 1400 1774 1463 1120 996 934 685 809 747 809 871 1463 1338 902 716 1182 1338 1431
1548.0154061088A369J56j87O2o2K80l1l42J24L11m66k80j56l1R3K18m05J87D67
$$ 1369 1525 1338 1400 1338 1618 1587 1245 1369 1680 1214 934 778 747 840 1058 653 840 467
1545.4015933959E29J24L2l12L12J86R4J55r3%M04j86K80o2L1l74K80j24l1j25A120
$$ 529 653 685 373 685 871 965 1120 1027 1027 1431 1245 1525 1463 1494 1120 1400 1276 1245 1120 1120
1542.5125061088H71j55L42R02o2q40L1j24J55J56j25K49j55r4k49Q09O3%j25A369
$$ 871 716 1058 1960 1898 1058 1089 965 1120 1276 1151 1400 1245 1151 902 1711 1774 1774 1649 1369
1539.7610933959A276L42j55J55m98O2%Tk17R02m36m04M04l1k49j24r3K17L12A711
$$ 1276 1618 1463 1618 1120 1182 1182 1182 965 1867 1431 1027 1431 1400 1151 1027 934 1151 1463 1711
1537.0095806829A680k17%Tk49J86J25j56k18o2R3J25j87L11l11K49R4l74K80A494
$$ 1680 1463 1463 1463 1214 1400 1525 1369 1151 1089 1182 1307 1120 1431 1120 1369 1463 1089 1369 1494
1534.25816797A494%m67%O2L11k49O3O2J87K48n60n29J25k49J55M36Tk18k49A369
$$ 1494 1494 1027 1027 1089 1400 1151 1214 1276 1463 1711 1151 622 747 498 653 1089 1525 1307 1058 1369
1531.36906797A711n29R4L1%j56K18k80J25J55k18L1L2l2M98l11J25O2j25A245
$$ 1711 1182 1276 1307 1307 1151 1369 1089 1214 1369 1151 1182 1214 1182 1680 1369 1494 1556 1431 1245
1528.6176188218A556l1k49l11r4J25M35l11r3L11m98m35R33k49l42K49L42TO3A245
$$ 1556 1525 1276 965 871 996 1431 1120 1027 1338 840 405 1338 1089 747 996 1338 1680 1743 1245
1525.8661061088A400%O54p47m67M36l1k49%K80K49l43J56j24N29J24O2k49K80A711
$$ 1400 1400 2054 1307 840 1276 1245 996 996 1276 1525 1182 1338 1214 1743 1867 1929 1680 1960 1711
1523.1147061088A680j86l1l2k80n60O85R3K18L1N29k80l11j25N61j87l1%K49A867
$$ 1680 1494 1463 1431 1151 591 1276 1369 1587 1618 2147 1867 1556 1431 1992 1805 1774 1774 2023 1867
1520.3632061088B116m05L12j56m04l43L11L2l2l1J25L1k49m36L74l1P15k49A649
$$ 2116 1711 2023 1867 1463 1120 1431 1463 1431 1400 1525 1556 1307 871 1245 1214 1929 1680 1649
1517.7493806829A307M04l1o2m04j56%M98L73J25R3l11j87o2k49k18o22K80N91A898
$$ 1307 1711 1680 1618 1214 1058 1058 1556 1929 2054 2147 1836 1649 1587 1338 1120 498 778 1369 1898
1514.99786797B085L1j56%TO3k80K49l12L43l43J87l73j25j24J24J87K80o2A649
$$ 2085 2116 1960 1960 1960 2023 1743 1992 1680 2023 1680 1867 1494 1369 1245 1369 1556 1836 1774 1649
1512.2464061088A338R3R4J24r3%l11J86k17J55K18J87j56k18r3J24K80L12O2A805
$$ 1338 1431 1525 1649 1556 1556 1245 1431 1214 1369 1587 1774 1618 1400 1307 1431 1711 2023 2085 1805
1509.4948933959A494K80o3l11O3N60l1l2m04M67J55n91%K49m05L12K49R3n29B147
$$ 1494 1774 1711 1400 1463 2023 1992 1960 1556 2023 2178 1587 1587 1836 1431 1743 1992 2085 1556 2147
1506.7434806829B240o53o2M98J55o2l11N91k80n60L1J56J24j87O3j56k80L42A867
$$ 2240 1587 1525 2023 2178 2116 1805 2396 2116 1556 1587 1743 1867 1680 1743 1587 1307 1649 1867
1504.12956797B116j56L43K80%l43o22k18%l42K80L11k18N92M35o53k49l11A587
$$ 2116 1960 2303 2583 2583 2240 1618 1400 1400 1058 1338 1649 1431 2023 2458 1805 1556 1245 1587
1501.5157061088A307J24l1K49l42o2N60O2k49M05j25%Tr3k18J24L74K49j56B147
$$ 1307 1431 1400 1649 1307 1245 1805 1867 1618 2023 1898 1898 1898 1805 1587 1711 2085 2334 2178 2147
1498.7642061088A463%q10K49Tl1K80L43j87J24j86j25J25K17O3J55%J56p16A774
$$ 1463 1463 653 902 1151 1120 1400 1743 1556 1680 1494 1369 1494 1711 1774 1929 1929 2085 1369 1774
1496.0127933959A525J86K49o2n60Q71M67l73m36k49K49J56l43L74j25j24j56A680
$$ 1525 1711 1960 1898 1338 2209 2676 2303 1867 1618 1867 2023 1680 2054 1929 1805 1649 1680
1493.5364061088A369K18O2l1R3N29N61J24n29n91J87M35p16J87l11M98l1O2A494
$$ 1369 1587 1649 1618 1711 2240 2801 2925 2396 1805 1992 2427 1711 1898 1587 2085 2054 2116 1494
1490.9225806829A120r3M67j56K49O2K49l1%O2m04J24O23n61L43K49k49o2K48A836
$$ 1120 1027 1494 1338 1587 1649 1898 1867 1867 1929 1525 1649 2272 1711 2054 2303 2054 1992 2240 1836
1488.17106797B209J87l42k49L42k49r3j56J56m05o2r3M66M05o2K18j25o22B085
$$ 2209 2396 2054 1805 2147 1898 1805 1649 1805 1400 1338 1245 1711 2116 2054 2272 2147 1525 2085
1485.5572061088A929o53m36P16R02L1o53K80j182O53m05k17L1K80k49N29Q40C236
$$ 1929 1276 840 1556 2458 2489 1836 2116 934 1587 1182 965 996 1276 1027 1556 2396 3236
1483.08086797B707o22m36k49%TJ56O53l42P16o85r3K49J55M98P47M05%j338B583
$$ 2707 2085 1649 1400 1400 1400 1556 2209 1867 2583 1898 1805 2054 2209 2707 3454 3859 3859 2521 2583
1480.32946797B925M98r96L11R4N29j183j24M35J56n29r3R3K80L1R34p16k18B458
$$ 2925 3423 2427 2738 2832 3361 2178 2054 2489 2645 2116 2023 2116 2396 2427 3361 2645 2427 2458
1477.7155061088B521J86l73L1j87o2L11n60N91L43m98r4j86k49R3j87J87%M05B521
$$ 2521 2707 2334 2365 2178 2116 2427 1867 2458 2801 2303 2209 2023 1774 1867 1680 1867 1867 2272 2521
1474.9640933959B863m67l1j56K80j24M98L1k49K49L11k49K80J25L1n29J87M04C952
$$ 2863 2396 2365 2209 2489 2365 2863 2894 2645 2894 3205 2956 3236 3361 3392 2863 3050 3454 3952
1472.35016797C579n29m67%j25K80Tk80k49J25j56K49M05M04k80O2m97r4M05C423
$$ 3579 3050 2583 2583 2458 2738 3018 2738 2489 2614 2458 2707 3112 3516 3236 3298 2801 2707 3112 3423
1469.5986188218C485l42j56J87o53j87k18M98L1L42K49m35k18N29n60J55N60C330
$$ 3485 3143 2987 3174 2521 2334 2116 2614 2645 2987 3236 2801 2583 3112 2552 2707 3267 3330
1467.1223806829B956R4l2L12n29L1r4l1j55j25R4N29o3L43k49m67k80K49R3B583
$$ 2956 3050 3018 3330 2801 2832 2738 2707 2552 2427 2521 3050 2987 3330 3081 2614 2334 2583 2676 2583
1464.37096797B427J25k49L11k80N60R3K80J56L1l42P47m05l11k49M67o3O3C392
$$ 2427 2552 2303 2614 2334 2894 2987 3267 3423 3454 3112 3859 3454 3143 2894 3361 3298 3361 3392
1461.7569933959C796r3J24J56j56j24k18o53R02L74J86m98%J87%K18TR3J56D450
$$ 3796 3703 3827 3983 3827 3703 3485 2832 3734 4108 4294 3796 3796 3983 3983 4201 4419 4512 4668 4450
1459.0055933959D699O2J56o85K49n91N29j87R3j24R3m04O22r3k18J87M04L1E352
$$ 4699 4761 4917 4232 4481 3890 4419 4232 4325 4201 4294 3890 4512 4419 4201 4388 4792 4823 5352
1456.3916806829E134j55O2m04J24N29l11o2l43k49K49R4R3P78L1j24j87J55E134
$$ 5134 4979 5041 4637 4761 5290 4979 4917 4574 4325 4574 4668 4761 5539 5570 5446 5259 5414 5134
1453.7778061088E477m05L42L12%j87J87l1j56m67L11O3%N29L1q09L11%o2k49E757
$$ 5477 5072 5414 5726 5726 5539 5726 5695 5539 5072 5383 5446 5446 5975 6006 5197 5508 5508 5446 5197 5757
1450.8887061088E912r3k80L1r3Q40J87k49p16L73J87o2l1M98%K49k81k17l43F068
$$ 5912 5819 5539 5570 5477 6317 6504 6255 5539 5912 6099 6037 6006 6504 6504 6753 6472 6255 5912 6068
1448.1372061088F224r4k80J87j25O3J55J56m36K80O2L2l43M36K49%o2L42k80F939
$$ 6224 6130 5850 6037 5912 5975 6130 6286 5850 6130 6192 6224 5881 6317 6566 6566 6504 6846 6566 6939
1445.3857933959F566L1%r3l2O85R3R4m05L43k18R3TJ56m05L74%k18%J56j25G157
$$ 6566 6597 6597 6504 6472 7157 7250 7344 6939 7282 7064 7157 7250 7406 7001 7375 7375 7157 7157 7313 7188 7157
1442.3592061088G126J56o3M67M98L11r3M67K49M04N29L42L74J120L42k18K81A3069
$$ 7126 7282 7219 7686 8184 8495 8402 8869 9118 9522 10051 10393 10767 11887 12229 12011 12292 13069
1439.88286797A3381%L42Q40r3N91O22R65R3N60J152J276P15J089J058N92B3836
$$ 13381 13381 13723 14563 14470 15061 15683 16648 16741 17301 18453 19729 20444 21533 22591 23183 23836
1437.5441806829B5205J245J120J027J058O85J338J089O85P78J151O22J214R96C9924
$$ 25205 26450 27570 28597 29655 30340 31678 32767 33452 34230 35381 36003 37217 38213 39924
1435.48056797D0858J649J556J618J836K178K365K396J867K956K894J805J058F6499
$$ 40858 42507 44063 45681 47517 49695 52060 54456 56323 59279 62173 63978 65036 66499
1433.5544806829F7494N61r34r96p78%n60j24k18M67O22P78M98J213K148K178G4371
$$ 67494 68055 67121 66125 65347 65347 64787 64663 64445 64912 65534 66312 66810 68023 70171 72349 74371
1431.2157933959G6332J276J431J058M67l42O2o23m04j87m04j25l1r33o23j245G4403
$$ 76332 77608 79039 80097 80564 80222 80284 79661 79257 79070 78666 78541 78510 77577 76954 75709 74403
1428.8769933959G2753j338k302k614k770k894Tk676k800k303j836j089j401D4498
$$ 72753 71415 69113 66499 63729 60835 57941 55265 52465 50162 48326 47237 45836 44498
1426.95096797D3845l1k18Tr3L73J25J55K18Q71J87K49N60j24l11q72k676C8959
$$ 43845 43814 43596 43378 43285 43658 43783 43938 44156 45027 45214 45463 46023 45899 45588 44716 42040 38959
1424.4746806829C4914l921l952k894k582j930j742j245j431p78j121k80m04A2167
$$ 34914 30993 27041 24147 21565 19635 17893 16648 15217 14439 13318 13038 12634 12167
1422.5486933959A1763p47m05j87r95M66L74M98L42R3l11L43k18J86L43%L1J55A1638
$$ 11763 11016 10611 10424 9429 9895 10269 10767 11109 11202 10891 11234 11016 11202 11545 11545 11576 11731 11638
1419.93476797A2167R02L74l74M36m98J87L1k18l42r3l43L43j25M36J86%r3A3225
$$ 12167 13069 13443 13069 13505 13007 13194 13225 13007 12665 12572 12229 12572 12447 12883 13069 13069 12976 13225
1417.3208061088A2603j87K18Tj87K80k80p16k18K18K80J56p47o2TJ55k80L74A1638
$$ 12603 12416 12634 12852 12665 12945 12665 11949 11731 11949 12229 12385 11638 11576 11514 11669 11389 11763 11638
1414.7069933959A1482k17l12o84n91n60m36m05j86o85M67p16j24j56k80m67F099
$$ 11482 11265 10953 10269 9678 9118 8682 8277 8091 7406 7873 7157 7033 6877 6597 6130 6099
1412.3682061088E726r4n60k80L1%j86O2m98r3m05J56l43O3l43R4m05k18TK80B863
$$ 5726 5632 5072 4792 4823 4823 4637 4699 4201 4108 3703 3859 3516 3579 3236 3330 2925 2707 2489 2769 2863
1409.4792061088B458m35l43J25N60J24P78l42j24m36m67l11N29N60O2L1L74C361
$$ 2458 2023 1680 1805 2365 2489 3267 2925 2801 2365 1898 1587 2116 2676 2738 2769 3143 3361
1407.00286797C672k80o2k80k49k80M04L11J56o23L74%L42o2J87l74l42%J24B769
$$ 3672 3392 3330 3050 2801 2521 2925 3236 3392 2769 3143 3143 3485 3423 3610 3236 2894 2894 3018 2769
1404.25146797B676l42M04L1R4o2K17R4L11l73L1K17%n60l42K80M36k18K80C081
$$ 2676 2334 2738 2769 2863 2801 3018 3112 3423 3050 3081 3298 3298 2738 2396 2676 3112 2894 3174 3081
1401.49996797C672o2k80j25K49m04L1j56L1j55O84%K18j24l43n91k18TK49B427
$$ 3672 3610 3330 3205 3454 3050 3081 2925 2956 2801 3485 3485 3703 3579 3236 2645 2427 2209 2458 2427
1398.7485061088B489j55o2j87r3O2O53n29k49l42k49r3P15r3l1n60K80R3j55A431
$$ 2489 2334 2272 2085 1992 2054 2707 2178 1929 1587 1338 1245 1960 1867 1836 1276 1556 1649 1494 1431
1395.9969933959A649m04K18O2K49J86m35j87L42o2L11L1r3k18L74N29n29TL42A556
$$ 1649 1245 1463 1525 1774 1960 1525 1338 1680 1618 1929 1960 1867 1649 2023 2552 2023 1494 1836 1556
1393.2455806829B116J24o2k80K80k49r3l1l11R3TL1K81L1r4L1P78%m98q40%A525
$$ 2116 2240 2178 1898 2178 1929 1836 1805 1494 1587 1680 1711 1992 2023 1929 1960 2738 2738 2240 1400 1400 1525
1390.2188933959B054o2K17k49l11L1J56k49M67J24j55O2Tm67L43M04L42L2m05B272
$$ 2054 1992 2209 1960 1649 1680 1836 1587 2054 2178 2023 2085 2147 1680 2023 2427 2769 2801 2396 2272
1387.4674806829B956l11l42l74j86r4K18k49r3r4M67k80J56k18K18L73M05n92A618
$$ 2956 2645 2303 1929 1743 1649 1867 1618 1525 1431 1898 1618 1774 1556 1774 2147 2552 1960 1618
1384.85356797A120N60%k17O2r4l11O2j86N91O2k80m35L11j87l1l74J25l1A058
$$ 1120 1680 1680 1463 1525 1431 1120 1182 996 1587 1649 1369 934 1245 1058 1027 653 778 747 1058
1382.10216797I96r4j86L1M35M98m35r4l42M36r4%l73j87J25L73o2J87J24A058
$$ 996 902 716 747 1182 1680 1245 1151 809 1245 1151 1151 778 591 716 1089 1027 1214 1338 1058
1379.3506188218I65K17L43j56l73M67k18O2o2K18%O2k49J87m05j87L1L43j25H71
$$ 965 1182 1525 1369 996 1463 1245 1307 1245 1463 1463 1525 1276 1463 1058 871 902 1245 1120 871
1376.5992061088E60N60L1K18K49O22n60p78k80M98o2L42L74J86O3o3l73O2k18A649
$$ 560 1120 1151 1369 1618 2240 1680 902 622 1120 1058 1400 1774 1960 2023 1960 1587 1649 1431 1649
1373.8476933959B303M98o23L1k17l2m97%N29O22m98L1o2l1j25j86r4O2L2L11A992
$$ 2303 2801 2178 2209 1992 1960 1463 1463 1992 2614 2116 2147 2085 2054 1929 1743 1649 1711 1743 2054 1992
1370.9586933959B147j55l2j86L42m36l73L1j56J87O54k49O2n29k18%R3n91M05A182
$$ 2147 1992 1960 1774 2116 1680 1307 1338 1182 1369 2023 1774 1836 1307 1089 1089 1182 591 996 1182
1368.2071806829A307k49K80j87r3m67j55O84P78j87k80n60j24l1R33k18r3m04A338
$$ 1307 1058 1338 1151 1058 591 436 1120 1898 1711 1431 871 747 716 1649 1431 1338 934 1338
1365.5933061088A151k80L11O54j87J25r4l42k49R3L74K49m67K49k49J25j56A494
$$ 1151 871 1182 1836 1649 1774 1680 1338 1089 1182 1556 1805 1338 1587 1338 1463 1307 1494
1363.1169806829A338M98O2j55k49j25O2K80k48R3o2O2j56l1J87j56k49K18l1A151
$$ 1338 1836 1898 1743 1494 1369 1431 1711 1463 1556 1494 1556 1400 1369 1556 1400 1151 1369 1338 1151
1360.3655806829A089L74L1r4m35J86%L12l12l1o2l1L1L73j24j25j55L73j24A400
$$ 1089 1463 1494 1400 965 1151 1151 1463 1151 1120 1058 1027 1058 1431 1307 1182 1027 1400 1276 1400
1357.61406797A245m98%K18l12L43O2Tk80J87j87J87O2l1n29L73J25J55j24A525
$$ 1245 747 747 965 653 996 1058 1120 840 1027 840 1027 1089 1058 529 902 1027 1182 1058 1525
1354.8626188218A587j56O3J55r3j56O3J55r3M04n29k49l1o84o3L12M66M36m67A431
$$ 1587 1431 1494 1649 1556 1400 1463 1618 1525 1929 1400 1151 1120 436 373 685 1151 1587 1120 1431
1352.1111061088A089J25j25O2O3M97o53O2o2J87K49j25m98M98L42O3l11%j87A618
$$ 1089 1214 1089 1151 1214 1711 1058 1120 1058 1245 1494 1369 871 1369 1711 1774 1463 1463 1276 1618
1349.3596933959A618%K49k80To2l74l1N60n60j87M67M36K18j25l11n60K49j56G47
$$ 1618 1618 1867 1587 1307 1245 871 840 1400 840 653 1120 1556 1774 1649 1338 778 1027 871 747
1346.6081806829F22K18L11L74m05O2J25k49m36Q09j86O2l1O2r3M66o2M05l11A587
$$ 622 840 1151 1525 1120 1182 1307 1058 622 1431 1245 1307 1276 1338 1245 1711 1649 2054 1743 1587
1343.85676797A680L74%L1l11K49TR3o54J87k80O2O3J55m04M35%R4l1k81l42A774
$$ 1680 2054 2054 2085 1774 2023 2272 2365 1711 1898 1618 1680 1743 1898 1494 1929 1929 2023 1992 1711 1369 1774
1340.8300933959A711M05j87j86l12r3J25L11O2l1r4l11O3j56l73O2M67P46j24B272
$$ 1711 2116 1929 1743 1431 1338 1463 1774 1836 1805 1711 1400 1463 1307 934 996 1463 2209 2085 2272
1338.0786933959A649%m35N29J55k49p78K18K49%k18O2L43K18q09o3J25K80r4I02
$$ 1649 1649 1214 1743 1898 1649 871 1089 1338 1338 1120 1182 1525 1743 934 871 996 1276 1182 902
1335.3271806829H71O54j87R3k17L1l74M05J24L1K49K80m04k80l1J55j55L11A867
$$ 871 1525 1338 1431 1214 1245 871 1276 1400 1431 1680 1960 1556 1276 1245 1400 1245 1556 1867
1332.7133061088A898m04L1m67J56K17R4l74J25k80J24j24l43l11M98J56j87F22
$$ 1898 1494 1525 1058 1214 1431 1525 1151 1276 996 1120 996 653 342 840 996 809 622
1330.2369806829A680M36q40r4K49r3K18l74L2K49l2k80o2l73R3M05K49j25L11A774
$$ 1680 2116 1276 1182 1431 1338 1556 1182 1214 1463 1431 1151 1089 716 809 1214 1463 1338 1649 1774
1327.48556797A525l43N29k80J25l42O2J87J55l42r4k80%n60K80O23L73k18A680
$$ 1525 1182 1711 1431 1556 1214 1276 1463 1618 1276 1182 902 902 342 622 1245 1618 1400 1680
1324.8716933959A774J86q09l11l1L11k18J87k80O85M66j24l73L1J24O2l11R4A494
$$ 1774 1960 1151 840 809 1120 902 1089 809 1494 1960 1836 1463 1494 1618 1680 1369 1463 1494
1322.25776797A494k49o3K18O3%j87n60L1M98L1j25K18k80L42o2%k18J56o2A525
$$ 1494 1245 1182 1400 1463 1463 1276 716 747 1245 1276 1151 1369 1089 1431 1369 1369 1151 1307 1245 1525
1319.3686806829A867k49o2m36l73j25k17P77K18j55k18R3O2J56j87l1p78K18I34
$$ 1867 1618 1556 1120 747 622 405 1182 1400 1245 1027 1120 1182 1338 1151 1120 342 560 934
1316.75486797I96l1N29o3r3K80L42n29l1l42O2M05l1TL11n29J24L1J25m67A120
$$ 996 965 1494 1431 1338 1618 1960 1431 1400 1058 1120 1525 1494 1463 1774 1245 1369 1400 1525 1058 1120
1313.86576797A120%L43R3k18l11r3M66%To2L73l1%l11L74j56k49k80UK18H40
$$ 1120 1120 1463 1556 1338 1027 934 1400 1400 1400 1338 1711 1680 1680 1369 1743 1587 1338 1058 778 498 716 840
1310.7015933959A463l74%j55O2k49L42J87M04k17L1j25J56O2J56l74o2j25%H09
$$ 1463 1089 1089 934 996 747 1089 1276 1680 1463 1494 1369 1525 1587 1743 1369 1307 1182 1182 809
1307.9500933959I65L73K80j24l74m04l1L1J55J25M67l2%l73K80j87%j86M04A369
$$ 965 1338 1618 1494 1120 716 685 716 871 996 1463 1431 1431 1058 1338 1151 1151 965 1369 1369
1305.1986806829A276l42J24k80L42O2l1o2K49K80R3l42L11l73o2n60O22M98A618
$$ 1276 934 1058 778 1120 1182 1151 1089 1338 1618 1711 1369 1680 1307 1245 685 1307 1805 1618
1302.5848061088A587r3m05j55J24P78m98J56l1J86l73j56L74L1l74j86J86K80A494
$$ 1587 1494 1089 934 1058 1836 1338 1494 1463 1649 1276 1120 1494 1525 1151 965 1151 1431 1494
1299.9708806829A867n91P78k80p16j56M67k18o2r3L42R3M05k80j25j86L42j87A369
$$ 1867 1276 2054 1774 1058 902 1369 1151 1089 996 1338 1431 1836 1556 1431 1245 1587 1400 1369
1297.35706797A214O2l42M97J87J56q40j25l1R3m66N60Q40j56r3R3m35k80F53
$$ 1214 1276 934 1431 1618 1774 934 809 778 871 405 965 1805 1649 1556 1649 1214 934 653
1294.7431061088I65N60J55n91L42R4L1n91l1%K80n29o3N29%l1o2K80T%K80j55A214
$$ 965 1525 1680 1089 1431 1525 1556 965 934 934 1214 685 622 1151 1151 1120 1058 1338 1618 1618 1898 1743 1214
1291.5789806829E91N91J56O2n91K49N29K49o85K18J87k18m67l1O2K80R4R3k80I34
$$ 591 1182 1338 1400 809 1058 1587 1836 1151 1369 1556 1338 871 840 902 1182 1276 1369 1089 934
1288.82746797H09j24K80K49k80o3R4K49m05J25L42L1o2M66o2j86j56j25o2A618
$$ 809 685 965 1214 934 871 965 1214 809 934 1276 1307 1245 1711 1649 1463 1307 1182 1120 1618
1286.07596797I96r4l1M05N91L11p15l2%J25k18%l42J86J25J56k81J87l1K18A276
$$ 996 902 871 1276 1867 2178 1463 1431 1431 1556 1338 1338 996 1182 1307 1463 1182 1369 1338 1556 1276
1283.18696797G78K49J24r3K49R3N60n29R4J24K80m04k18J56l12m98N92R3A120
$$ 778 1027 1151 1058 1307 1400 1960 1431 1525 1649 1929 1525 1307 1463 1151 653 1245 1338 1120
1280.5730933959A027L1j56K80l1r3o22k18l1L11%P16l2r3j24J86j24M98j56A369
$$ 1027 1058 902 1182 1151 1058 436 218 187 498 498 1214 1182 1089 965 1151 1027 1525 1369 1369
1277.8215806829A214L73n60j56M05O2l11O53J56K49q40r4j24L42R4m36r3R3F22
$$ 1214 1587 1027 871 1276 1338 1027 1680 1836 2085 1245 1151 1027 1369 1463 1027 934 1027 622
1275.20776797F53L74l1%J86J56O2j55j56l11j25l1M36%L42m35%K80K49k18A245
$$ 653 1027 996 996 1182 1338 1400 1245 1089 778 653 622 1058 1058 1400 965 965 1245 1494 1276 1245
1272.3186806829D67J55N29o2%M67k18o2k18L42l73J87m05o2l1K49l1N60k80I96
$$ 467 622 1151 1089 1089 1556 1338 1276 1058 1400 1027 1214 809 747 716 965 934 1494 1214 996
1269.56726797H09O2j24K18r4J87k80L11j55L11O2o22J24L11L43K48J56j24A431
$$ 809 871 747 965 871 1058 778 1089 934 1245 1307 685 809 1120 1463 1711 1867 1743 1431
1266.9532933959A338n29r3k18L11r3L11k49R3K80j24j56j24m36K80K49R4R3A400
$$ 1338 809 716 498 809 716 1027 778 871 1151 1027 871 747 311 591 840 934 1027 1400
1264.3394806829A649%k18L2l74K49n29%L42M98m35K80m36TK80J87m67R4J86A338
$$ 1649 1649 1431 1463 1089 1338 809 809 1151 1649 1214 1494 1058 622 902 1089 622 716 902 1338
1261.5879806829A089r3O2J87J55%m35n92l1O54k49M67K49k18p47k49J87L1R3G47
$$ 1089 996 1058 1245 1400 1400 965 373 342 996 747 1214 1463 1245 498 249 436 467 560 747
1258.83646797G16L1l74R4J55L74o2L11O2K18r4J87l42o2l12l1l11J87l42D05
$$ 716 747 373 467 622 996 934 1245 1307 1525 1431 1618 1276 1214 902 871 560 747 405 405
1256.0850061088E29L42l73P78L1j25j24m05r3N29m36L74j25K80l11K18k18r3F53
$$ 529 871 498 1276 1307 1182 1058 653 560 1089 653 1027 902 1182 871 1089 871 778 653
1253.4710933959A058n60M36j87J55R4R3k80k49M67O53m66r4n60N60J87R3l1A276
$$ 1058 498 934 747 902 996 1089 809 560 1027 1680 1214 1120 560 1120 1307 1400 1369 1276
1250.85726797F85L42Tr3k49K49m05l1K80J25l74M05l11J55r3l1l11O2J87A494
$$ 685 1027 1369 1276 1027 1276 871 840 1120 1245 871 1276 965 1120 1027 996 685 747 934 1494
1248.1058061088A151R4k18K49m05K18L1J87m36k18J87L11K18%l11l1r3K17k17A307
$$ 1151 1245 1027 1276 871 1089 1120 1307 871 653 840 1151 1369 1369 1058 1027 934 1151 934 1307
1245.3542933959A649j86k49J86l1l42r3J55l42K18J86K49m35r4j55L42r3K17H40
$$ 1649 1463 1214 1400 1369 1027 934 1089 747 965 1151 1400 965 871 716 1058 965 1182 840
1242.7404806829I02m35L42J87k18j027k18P16L11k49j24%L11%M98r4m66l12H09
$$ 902 467 809 996 778 -249 -467 249 560 311 187 187 498 498 996 902 436 124 809
1240.12656797I34K80k80L1j56O2J87j87l1K49k18R4j87N29o54L2r4M05j56E29
$$ 934 1214 934 965 809 871 1058 871 840 1089 871 965 778 1307 653 685 591 996 840 529
1237.3750061088H09O2r3%k18L1m67K18J87O2J56M35n29L74l42k80R3j25J25H09
$$ 809 871 778 778 560 591 124 342 529 591 747 1182 653 1027 685 405 498 373 498 809
1234.6235933959E91L1n29K49O85N91R3k17l12k48j25l1R3R4j25K18j87L1k49G47
$$ 591 622 93 342 1027 1618 1711 1494 1182 934 809 778 871 965 840 1058 871 902 653 747
1231.8720933959H09M67k18Tl73L42l1L1L11k49j24O2m04N60%j25n60R3l1K49D05
$$ 809 1276 1058 840 467 809 778 809 1120 871 747 809 405 965 965 840 280 373 342 591 405
1228.9830933959A089J25l2l11o2k80N60r3O2l1J24l11L1l1R4m05J24J56L73A494
$$ 1089 1214 1182 871 809 529 1089 996 1058 1027 1151 840 871 840 934 529 653 809 1182 1494
1226.2316806829A369j87o2l42J87m98O2K80R3l11j24J55N29k80k49j86N91k18G16
$$ 1369 1182 1120 778 965 467 529 809 902 591 467 622 1151 871 622 436 1027 809 716
1223.6177061088C42j24L73M67l11L1j56M36n29J24l1M67j87k49o2J56o2K80I34
$$ 342 218 591 1058 747 778 622 1058 529 653 622 1089 902 653 591 747 685 965 934
1221.0038933959A027j87o2L1M67j87m67r3M98j25k80l73L11l11R3%K49O2O3I02
$$ 1027 840 778 809 1276 1089 622 529 1027 902 622 249 560 249 342 342 591 653 716 902
1218.2523933959A182J25L11j24l12%j24k49%o53o3j86K80TJ86R4j56K49L11C73
$$ 1182 1307 1618 1494 1182 1182 1058 809 809 156 93 -93 187 467 653 747 591 840 1151 373
1215.5008806829D67j87J56j25L11L12j87L1K18o85k18O23r4R4P78k49o23m04D98
$$ 467 280 436 311 622 934 747 778 996 311 93 716 622 716 1494 1245 622 218 498
1212.8870061088D36%l12m35M04L43J24M98J56m67l74L12O2k49l74L43o2M04F22
$$ 436 436 124 -311 93 436 560 1058 1214 747 373 685 747 498 124 467 405 809 622
1210.2730933959D67l11l12%Q41k80R3j87%l1M05J24j87k80K49m04J55l1M98I02
$$ 467 156 -156 -156 685 405 498 311 311 280 685 809 622 342 591 187 342 311 809 902
1207.5216806829G16k18L11k49J87L1Tr3j87o2L42j24L1J55j86k18J86l11k18B49
$$ 716 498 809 560 747 778 809 716 529 467 809 685 716 871 685 467 653 342 124 249
1204.77026797H09o2O22m67O3l1J55O2j86m05r3R3L74k18Tm05J25k49M04N29A338
$$ 809 747 1369 902 965 934 1089 1151 965 560 467 560 934 716 498 93 218 -31 373 902 1338
1201.88116797C73j86J86%o2K80K49L42k17o3m66K80k80k49m05M36L1M04j55G78
$$ 373 187 373 373 311 591 840 1182 965 902 436 716 436 187 -218 218 249 653 498 778
1199.12976797I96k18l11J24m98M36L73k17l43N29J56j25o53K18K80m05m98F2
$$ 996 778 467 591 93 529 902 685 342 871 1027 902 249 467 747 342 -156 62
1196.6533933959A87K18j25l1o2N91o22r4J87R3J87K80r3M35r3L42k18m04m05G78
$$ 187 405 280 249 187 778 156 62 249 342 529 809 716 1151 1058 1400 1182 778 373 778
1193.9019806829H09K49r3j25p47K49M67K18O2J87n60l1k49J55m98o2L11N92B49
$$ 809 1058 965 840 93 342 809 1027 1089 1276 716 685 436 591 93 31 342 934 249
1191.2880061088b80l73L42L11N29j87k18O3L73r3o2L1l1m05K80l1R3r3O2L1C73
$$ -280 -653 -311 0 529 342 124 187 560 467 405 436 405 0 280 249 342 249 311 342 373
1188.39896797C73o2%l1TL73l73K49J87l2j24M36l43j86k18L1O2TJ25L1k49F85
$$ 373 311 311 280 249 622 249 498 685 653 529 965 622 436 218 249 311 373 498 529 280 685
1185.3723806829A56j56O2K80K18L1m67J56j56N29m97p78O2M04K18L74K49o3A56
$$ 156 0 62 342 560 591 124 280 124 653 156 -622 -560 -156 62 436 685 622 156
1182.7585061088D98M36L73k49L11j55m36r02l2k80%O23P15m66o3m97k18L73C42
$$ 498 934 1307 1058 1369 1214 778 -124 -156 -436 -436 187 902 436 373 -124 -342 31 342
1180.1445806829C73J56m67J87L1T%k49K18J25r4M67m67N29l1j56m66L73l73B49
$$ 373 529 62 249 280 311 311 62 280 405 311 778 311 840 809 653 187 560 187 249
1177.3931806829E29R3l11J25j56J87K18l2l1K80n29L2j25J25k49J151K18m98H40
$$ 529 622 311 436 280 467 685 653 622 902 373 405 280 405 156 1307 1525 1027 840
1174.77926797A058J24k80j55l11j25M67L1j24L1UK49O2P47J24j058j307k80c42
$$ 1058 1182 902 747 436 311 778 809 685 716 747 778 1027 1089 1836 1960 902 -405 -685 -342
1172.0278061088C73K49K80o84j25r3L1K18K49l42K17O3k49l1R3j25L12J24l11b18
$$ 373 622 902 218 93 0 31 249 498 156 373 436 187 156 249 124 436 560 249 -218
1169.2762933959f2O2L42L1l1j24J87r4K80o2j56L2M35j24L42j24j56n29J87A56
$$ -62 0 342 373 342 218 405 311 591 529 373 405 840 716 1058 934 778 249 436 156
1166.5247933959D67%N91k49m04r4O2k17M35%P16m36o2k18k80n60j24M97J56c1
$$ 467 467 1058 809 405 311 373 156 591 591 1307 871 809 591 311 -249 -373 124 280 -31
1163.7733806829a56%L43j87m36%M36m05j24K18R3l73M04M36N29k80TJ55J25A87
$$ -156 -156 187 0 -436 -436 0 -405 -529 -311 -218 -591 -187 249 778 498 218 373 498 187
1161.02196797D98O2o2m98k49l11Q71j87M36j55L11m36j24l2P78k80%j55R3H40
$$ 498 560 498 0 -249 -560 311 124 560 405 716 280 156 124 902 622 622 467 560 840
1158.2704061088F53l11L11j55l74K18J56m98l73k80M66J56J87k49K49j25N60I65
$$ 653 342 653 498 124 342 498 0 -373 -653 -187 -31 156 -93 156 31 591 965
1155.7941806829H71n60L1K80L1L2j56j87k18m04L42N29J87k49L1m36K18m66a87
$$ 871 311 342 622 653 685 529 342 124 -280 62 591 778 529 560 124 342 -124 -187
1153.18026797@R3R4O2l73M35j87J25R3k49m66L42j87L42r3j55m98K49J55A87
$$ 0 93 187 249 -124 311 124 249 342 93 -373 -31 -218 124 31 -124 -622 -373 -218 187
1150.4288061088c1K18l11k49o3l1L1K18k18M98k18K80K18R4J55J87l1j87L1B80
$$ -31 187 -124 -373 -436 -467 -436 -218 -436 62 -156 124 342 436 591 778 747 560 591 280
1147.6772933959B18o2l74K80k80k49K49L11K49J87m67L11l73O85o3q40k18O23F2
$$ 218 156 -218 62 -218 -467 -218 93 342 529 62 373 0 685 622 -218 -436 187 62
1145.0633806829C73k17o3%J25k49L1K49N60O2n91l11L42l73l11L73M05k18j25C1
$$ 373 156 93 93 218 -31 0 249 809 871 280 -31 311 -62 -373 0 405 187 62 31
1142.31196797C1o2N60L1o2K18m36k18K49k18M05o22L73J87%o54l1J87%k49d05
$$ 31 -31 529 560 498 716 280 62 311 93 498 -124 249 436 436 -218 -249 -62 -62 -311 -405
1139.42296797d98O22J87o2m05K49K80r3l1l42k80M97m66j87J24K81r4l1r3a87
$$ -498 124 311 249 -156 93 373 280 249 -93 -373 124 -342 -529 -405 -124 -218 -249 -342 -187
1136.6714061088d05L12l12J56j24L73j87j55L1P47l43L1M36L1l11K18r3k18F2
$$ -405 -93 -405 -249 -373 0 -187 -342 -311 436 93 124 560 591 280 498 405 187 62
1134.0575933959A24o2K49p16%M98L74j25r3L1l1m98M98j87%J56j87J87r4k48A56
$$ 124 62 311 -405 -405 93 467 342 249 280 249 -249 249 62 62 218 31 218 124 -124 156
1131.1685061088A24O3m36k18J25M04%l11j24L1O2Tk49N91j86J55k49j55K49c11
$$ 124 187 -249 -467 -342 62 62 -249 -373 -342 -280 -218 -467 124 -62 93 -156 -311 -62 -311
1128.4170933959f53M04r3M66j55%R3N29R4L1j56j24m05J25K17K80K18L11n29D05
$$ -653 -249 -342 124 -31 -31 62 591 685 716 560 436 31 156 373 653 871 1182 653 405
1125.6655806829E29L42m35N91J24j24m67n29TJ089r3o54r3l1%J56M66o2k18C11
$$ 529 871 436 1027 1151 1027 560 31 -498 591 498 -156 -249 -280 -280 -124 342 280 62 311
1122.9141806829i3J55J87j25l11L11L2%J24l1o54K81J55J87j87l11J87J55K18E60
$$ -93 62 249 124 -187 124 156 156 280 249 -405 -124 31 218 31 -280 -93 62 280 560
1120.1626806829C11l42j25K18K80N60j24J56l12k17o3J25k18j56k17%r4%O2i3
$$ 311 -31 -156 62 342 902 778 934 622 405 342 467 249 93 -124 -124 -218 -218 -156 -93
1117.41126797i3M66j55l11m36M36J86M05k18R3o22J25L73j56j86M66J87L42F22
$$ -93 373 218 -93 -529 -93 93 498 280 373 -249 -124 249 93 -93 373 560 902 622
1114.7972933959H71n29M05m98%j25j86n29J86R4K49N29%m05Q09l1m67M67M05I65
$$ 871 342 747 249 249 124 -62 -591 -405 -311 -62 467 467 62 871 840 373 840 1245 965
1112.0457933959A027l1j87o22K18n29l2r3N60n60j87N92O84n29j87n91%J56C1
$$ 1027 996 809 187 405 -124 -156 -249 311 -249 -436 156 840 311 124 -467 -467 -311 31
1109.43196797b49%K80L1j55L11k18R3k80O3k49%k49K49O2R3k49r3o2l1L1c73
$$ -249 -249 31 62 -93 218 0 93 -187 -124 -373 -373 -622 -373 -311 -218 -467 -560 -622 -653 -622 -373
1106.4053806829d36N29L12J24%M98j56j86r4j86l12R4l11L1O2L11k80m98k80e91
$$ -436 93 405 529 529 1027 871 685 591 405 93 187 -124 -93 -31 280 0 -498 -778 -591
1103.65386797c42M98k80j56l73N60j87J56o3M67j24m67L1N60%R3r3l1k18F2
$$ -342 156 -124 -280 -653 -93 -280 -124 -187 280 156 -311 -280 280 280 373 280 249 31 62
1100.90246797c11o2o3%k17M04J56N91n29j87K18M36R3J24m97j87R3j24n29a87
$$ -311 -373 -436 -436 -653 -249 -93 498 -31 -218 0 436 529 653 156 -31 62 -62 -591 -187
1098.15096797A24L43k49r4o2K18j24J86k49L1K18l73l42L42J87k18j56P16A87
$$ 124 467 218 124 62 280 156 342 93 124 342 -31 -373 -31 156 -62 -218 498 187
1095.5370933959@l73k80J55N60o2L11m35l74j87j55O2N91o2J87j25J25m98J24d67
$$ 0 -373 -653 -498 62 0 311 -124 -498 -685 -840 -778 -187 -249 -62 -187 -62 -560 -436 -467
1092.7855806829a24%J86%Tl11J87J24J56j87L1k49L74r4m35O2K49o2K17J56B80
$$ -124 -124 62 62 62 -249 -62 62 218 31 62 -187 187 93 -342 -280 -31 -93 124 280 280
1089.8965806829b49r3k80K80L11O22O2k80o22%R3j24r3L11L1l1L1M67J86k17b49
$$ -249 -342 -622 -342 -31 591 653 373 -249 -249 -156 -280 -373 -62 -31 -62 -31 436 622 405 -249
1087.0074806829@L1J56l43j55l74O3K80J86k80J56l1L1l1R3j24J86J87Tn29b49
$$ 0 31 187 -156 -311 -685 -622 -342 -156 -436 -280 -311 -280 -311 -218 -342 -156 31 218 -311 -249
1084.1184806829B18L1l11R3r3l1m36o2j25P16j87l73l11M35M05N91m67k17L1i3
$$ 218 249 -62 31 -62 -93 -529 -591 -716 0 -187 -560 -871 -436 -31 560 93 -124 -93 -93
1081.3669806829f53J86K80M36k49j87j55L1l11J24k49R4k81J25M36K17m97L42a24
$$ -653 -467 -187 249 0 -187 -342 -311 -622 -498 -747 -653 -934 -809 -373 -156 -653 -311 -124
1078.75316797F2m98l73L1O54J86K18l1l73l12J25l1J55J56L11k49m04j25a24
$$ 62 -436 -809 -778 -124 62 280 249 -124 -436 -311 -342 -187 -31 280 31 -373 -498 -124
1076.1392061088F2L74l43l42%J56j56R3l42j24K80J86m66j25l1K18M36N29j87A56
$$ 62 436 93 -249 -249 -93 -249 -156 -498 -622 -342 -156 -622 -747 -778 -560 -124 405 218 156
1073.3877933959i3J55j86j87%J55m35R3J87M04l11k49k18P16k18r3j87O85M35C73
$$ -93 62 -124 -311 -311 -156 -591 -498 -311 93 -218 -467 -685 31 -187 -280 -467 218 653 373
1070.6362806829b18k18k49K80O3L42l1r3l12N60j24O2o53j25r3J87L11Tl42a24
$$ -218 -436 -685 -405 -342 0 -31 -124 -436 124 0 62 -591 -716 -809 -622 -311 0 -342 -124
1067.88486797b49K49%Tk80o2l43R4k18R3%J87r3O2K18K49j56j87l42L42J56e60
$$ -249 0 0 0 -280 -342 -685 -591 -809 -716 -716 -529 -622 -560 -342 -93 -249 -436 -778 -436 -280 -560
1064.8581806829i96M98l11r3%O84%O2m97j56j87M05k49K49k18j25O3R3k80K49i65
$$ -996 -498 -809 -902 -902 -218 -218 -156 -653 -809 -996 -591 -840 -591 -809 -934 -871 -778 -1058 -809 -965
1061.9691806829e29J56L1O2J87%R3o22O2Tl1j87K80O3O84l11j87j86L73k18e91
$$ -529 -373 -342 -280 -93 -93 0 -622 -560 -498 -529 -716 -436 -373 311 0 -187 -373 0 -218 -591
1059.0800933959d98L42J56K49o85l11l1J56J55L11k17r4k18L2L1J24j55J24d36
$$ -498 -156 0 249 -436 -747 -778 -622 -467 -156 -373 -467 -685 -653 -622 -498 -653 -529 -436
1056.4662806829C1j24R3m98K80J25M35j24L42l1Tl42%k18L1r3j25k49%r3J86f53
$$ 31 -93 0 -498 -218 -93 342 218 560 529 498 156 156 -62 -31 -124 -249 -498 -498 -591 -405 -653
1053.4395933959d67R4R3J24k17o3o2m98J25j56K80M98M36o23%R4J24q40k18a027
$$ -467 -373 -280 -156 -373 -436 -498 -996 -871 -1027 -747 -249 187 -436 -436 -342 -218 -1058 -1276 -1027
1050.6881806829f85L2%j87M04O3K17j55L1j87R4R3O2m35J86l1K18J24L74l11A87
$$ -685 -653 -653 -840 -436 -373 -156 -311 -280 -467 -373 -280 -218 -653 -467 -498 -280 -156 218 -93 187
1047.7990933959A56r4O2r3J25M35j24j25j55m05m98j86k49L73j56J25j56L43d98
$$ 156 62 124 31 156 591 467 342 187 -218 -716 -902 -1151 -778 -934 -809 -965 -622 -498
1045.18526797b18k80%j87M98J87K80L1m98o84k49M35R4R3k18j55J24j87o2f22
$$ -218 -498 -498 -685 -187 0 280 311 -187 -871 -1120 -685 -591 -498 -716 -871 -747 -934 -996 -622
1042.4338061088f85k17J86%l1n60j87r3N29J24N29O3l1l74L1N92n29j25M36a56
$$ -685 -902 -716 -716 -747 -1307 -1494 -1587 -1058 -934 -405 -342 -373 -747 -716 -124 -653 -778 -342 -156
1039.6822933959b80j87R4l12L74q09O2J87L11l11r4J87O22M05m36m04j25o2a089
$$ -280 -467 -373 -685 -311 -1120 -1058 -871 -560 -871 -965 -778 -156 249 -187 -591 -716 -778 -1089
1037.0684806829a214N29j24%L1J25l2K49m98K49J56L11l42L1l11K49J24%R4c42
$$ -1214 -685 -809 -809 -778 -653 -685 -436 -934 -685 -529 -218 -560 -529 -840 -591 -467 -467 -373 -342
1034.3169806829i02o3r3L73r3k18K80N60j55%J87O2m05l1l73L1l42%J55K18g16
$$ -902 -965 -1058 -685 -778 -996 -716 -156 -311 -311 -124 -62 -467 -498 -871 -840 -1182 -1182 -1027 -809 -716
1031.4279806829f2J24l11m98o2k18j24l1%l2J25K18Tk81L74j87J25j25L11j55b49
$$ -62 62 -249 -747 -809 -1027 -1151 -1182 -1182 -1214 -1089 -871 -653 -934 -560 -747 -622 -747 -436 -591 -249
1028.5388806829d36M36k80J24r3J56k49r4k17J55l42L1K18L42k80j56l11J25i34
$$ -436 0 -280 -156 -249 -93 -342 -436 -653 -498 -840 -809 -591 -249 -529 -685 -996 -871 -934
1025.92496797a151k18Q40%R3K49j24k49K49J87J55l11L1k49M67J55O3p47h71
$$ -1151 -1369 -529 -529 -436 -187 -311 -560 -311 -124 31 -280 -249 -498 -31 124 187 -560 -871
1023.3110933959a182M04K18N29n91k18j56L43m67j56M67L11r3K18%O2l42P46b49
$$ -1182 -778 -560 -31 -622 -840 -996 -653 -1120 -1276 -809 -498 -591 -373 -373 -311 -653 93 -249
1020.69726797g16l11M05j25M36m67K18j87K18m98r3R3M67L11N60K18m05p77g16
$$ -716 -1027 -622 -747 -311 -778 -560 -747 -529 -1027 -1120 -1027 -560 -249 311 529 124 -653 -716
1018.0832933959e29L42r3j56l42L73J25j87k18l1Tj55k49J86k49M67j24J86f85
$$ -529 -187 -280 -436 -778 -405 -280 -467 -685 -716 -747 -902 -1151 -965 -1214 -747 -871 -685 -685
1015.4694806829d36o2k18l73j87k80M36K18K49o3M05o2m98L42r3k49M04L43A56
$$ -436 -498 -716 -1089 -1276 -1556 -1120 -902 -653 -716 -311 -373 -871 -529 -622 -871 -467 -124 156
1012.85556797F2r3TM35l42k49l73K17K18To22J24P16M67q41k17%L42k18j24f85
$$ 62 -31 -124 311 -31 -280 -653 -436 -218 0 -622 -498 218 685 -156 -373 -373 -31 -249 -373 -685
1009.96656797f53j25J56l74M36j25N61j87j56o2Tk80J86O3N60K18l2m04j56b18
$$ -653 -778 -622 -996 -560 -685 -124 -311 -467 -529 -591 -871 -685 -622 -62 156 124 -280 -436 -218
1007.2150061088A24O3o3%l73k80L42n29L11j86O2R3r3%K18n91j87N91J25j87d36
$$ 124 187 124 124 -249 -529 -187 -716 -405 -591 -529 -436 -529 -529 -311 -902 -1089 -498 -373 -560 -436
1004.32596797c42J24l73K49j56r3m67K18j56M05k80r4K49N92n61m97l74O54h40
$$ -342 -218 -591 -342 -498 -591 -1058 -840 -996 -591 -871 -965 -716 -124 -685 -1182 -1556 -902 -840
1001.7120933959h40R3M05l74j24K18J55o53L73K49%k80K80j55k18j56N29j24g47
$$ -840 -747 -342 -716 -840 -622 -467 -1120 -747 -498 -498 -778 -498 -653 -871 -1027 -498 -622 -747
999.09826797h40L73k18j55J87N29L1R3k49r3R3o2n60k80TP46%j24o2L42g78
$$ -840 -467 -685 -840 -653 -124 -93 0 -249 -342 -249 -311 -871 -1151 -1431 -685 -685 -809 -871 -529 -778
996.20916797g78%R3%N29k80k17k18J24m04j25M67J56m98o3r3M05N60K18h71
$$ -778 -778 -685 -685 -156 -436 -653 -871 -747 -1151 -1276 -809 -653 -1151 -1214 -1307 -902 -342 -124 -871
993.45776797f85L12O2j25k17%M66%o2m36O23L11p47n60l1l42M66J87J56i34
$$ -685 -373 -311 -436 -653 -653 -187 -187 -249 -685 -62 249 -498 -1058 -1089 -1431 -965 -778 -622 -934
990.70626797f85O3J24l1J24j55o2L1N60k18O2k18j86l43J87J25L11j87R3f22
$$ -685 -622 -498 -529 -405 -560 -622 -591 -31 -249 -187 -405 -591 -934 -747 -622 -311 -498 -405 -622
987.9548061088f22O2L73o2j56k17L73j56R4m98L73J25L1j25L12k80l12j55d36
$$ -622 -560 -187 -249 -405 -622 -249 -405 -311 -809 -436 -311 -280 -405 -93 -373 -685 -840 -436
985.3408806829d05K49o53J24P16k49l73J86O3%k49K18k49K17l73k18r3l1k80h71
$$ -405 -156 -809 -685 31 -218 -591 -405 -342 -342 -591 -373 -622 -405 -778 -996 -1089 -1120 -1400 -871
982.5894806829h09K49o2%o3J87Tj25l11R4%To3R4O2K18l74O3m05L11J56%J24d05
$$ -809 -560 -622 -622 -685 -498 -311 -436 -747 -653 -653 -653 -716 -622 -560 -342 -716 -653 -1058 -747 -591 -591 -467 -405
979.2876806829d98r3J24J25n60M66r3L42k49j55j25R4j25L11j86o3J25O2m98h71
$$ -498 -591 -467 -342 -902 -436 -529 -187 -436 -591 -716 -622 -747 -436 -622 -685 -560 -498 -996 -871
976.53626797a027%r3J55J56M36J24N91m98k17R3K80l11r34L74J86k49K49h71
$$ -1027 -1027 -1120 -965 -809 -373 -249 342 -156 -373 -280 0 -311 -1245 -871 -685 -934 -685 -871
973.9222933959i34O3N60k80l11l12M05l73K17J56J87K49k80m67J86K18L43e91
$$ -934 -871 -311 -591 -902 -1214 -809 -1182 -965 -809 -622 -373 -653 -1120 -934 -716 -373 -591
971.44596797e29%K49p16K80l1J87O2m67K18%o2M98j25K80n60j86o3K49l1i65
$$ -529 -529 -280 -996 -716 -747 -560 -498 -965 -747 -747 -809 -311 -436 -156 -716 -902 -965 -716 -747 -965
968.55696797g47k18J56M67j56L1K49k18l42M98K80J87n92K18k18K18l42b49
$$ -747 -965 -809 -342 -498 -467 -218 -436 -778 -280 0 187 -405 -187 -405 -187 -529 -249
966.0806806829e91m36j87P47k49k80k49J87L1k49J87L73k49N60r3j55j25J56e60
$$ -591 -1027 -1214 -467 -716 -996 -1245 -1058 -1027 -1276 -1089 -716 -965 -405 -498 -653 -778 -622 -560
963.4667061088a87m35l1p78L73M67K49L1j87m04k49L42K49TR3%Tk18m04k18i34
$$ -187 -622 -653 -1431 -1058 -591 -342 -311 -498 -902 -1151 -809 -560 -311 -218 -218 -218 -436 -840 -1058 -934
960.57776797a089M98o2r4r3J87r4m04J55M36k80L11O2TK18%n29m35k80L42a214
$$ -1089 -591 -653 -747 -840 -653 -747 -1151 -996 -560 -840 -529 -467 -405 -187 -187 -716 -1151 -1431 -1089 -1214
957.6886806829a151L42L11l1L1l42L73l42%L73o2n91l1o2M35O2K18L1Tl42A24
$$ -1151 -809 -498 -529 -498 -840 -467 -809 -809 -436 -498 -1089 -1120 -1182 -747 -685 -467 -436 -405 -747 124
954.7996806829A87m67J56K48k17r4n91K80l11L1l73J24l42J87L1J24k18J56a214
$$ 187 -280 -124 124 -93 -187 -778 -498 -809 -778 -1151 -1027 -1369 -1182 -1151 -1027 -1245 -1089 -1214
952.1857061088h09L1K18l1r4j86J55%L74%o3j24J24l42m67L2L42j56j24j56f85
$$ -809 -778 -560 -591 -685 -871 -716 -716 -342 -342 -405 -529 -405 -747 -1214 -1182 -840 -996 -1120 -1276 -685
949.2966188218f22J86k80K49n91l1O2J25k49K49J24J25k81j86L11J56j56%a151
$$ -622 -436 -716 -467 -1058 -1089 -1027 -902 -1151 -902 -778 -653 -934 -1120 -809 -653 -809 -809 -1151
946.6827933959h71j25M98k80k18L1O85k49n60K49O53o84%l43J25J87J55%K80d67
$$ -871 -996 -498 -778 -996 -965 -280 -529 -1089 -840 -187 -871 -871 -1214 -1089 -902 -747 -747 -467 -467
943.9313806829b80k49J24k48o3%n29k18R96M98o2j56J56l74q40m35P15R4L1i02
$$ -280 -529 -405 -653 -716 -716 -1245 -1463 -467 31 -31 -187 -31 -405 -1245 -1680 -965 -871 -840 -902
941.17986797i02n61K18o2m36O3M66J87K18l1o2k49l74j55L11l1J55m98M05a089
$$ -902 -1463 -1245 -1307 -1743 -1680 -1214 -1027 -809 -840 -902 -1151 -1525 -1680 -1369 -1400 -1245 -1743 -1338 -1089
938.42846797d67l1%m04J24r3O2k80l1m05J25L1L11j87j55o3N61K17l73j87h09
$$ -467 -498 -498 -902 -778 -871 -809 -1089 -1120 -1525 -1400 -1369 -1058 -1245 -1400 -1463 -902 -685 -1058 -1245 -809
935.5393806829a182k18J55M98R4r4%K80l42%L11L42k49K49m66n92j24K49R3a182
$$ -1182 -1400 -1245 -747 -653 -747 -747 -467 -809 -809 -498 -156 -405 -156 -622 -1214 -1338 -1089 -996 -1182
932.78796797a182K48k17j56k80K80L42M36L1r3J55n60n91L1R3N29K18O3i34
$$ -1182 -934 -1151 -1307 -1587 -1307 -965 -529 -498 -591 -436 -996 -1587 -1556 -1463 -934 -716 -653 -934
930.1739933959e91l74j55m98R3L1J25K80M36j87K49j87R3j55j87m04L1K80c42
$$ -591 -965 -1120 -1618 -1525 -1494 -1369 -1089 -653 -840 -591 -778 -685 -840 -1027 -1431 -1400 -1120 -342
927.56016797F2o84m67M98l43o2J87L11j24N60k18n60j25N29k49k80l1O54e60
$$ 62 -622 -1089 -591 -934 -996 -809 -498 -622 -62 -280 -840 -965 -436 -685 -965 -996 -342 -560
924.9462061088f53m36K80j56R4m98j56N60L12L42L11p16j24L73J56n29K18h40
$$ -653 -1089 -809 -965 -871 -1369 -1525 -965 -653 -311 0 -716 -840 -467 -311 -840 -622 -840
922.46996797h71l43m66r4O23J55J87m05K80K18M05k18M05l74J87l1k18j87a151
$$ -871 -1214 -1680 -1774 -1151 -996 -809 -1214 -934 -716 -311 -529 -124 -498 -311 -342 -560 -747 -1151
919.8559933959a276j87O3L1L73N91l11O3K48K81m67o2m98k80j25K49%J56L73d67
$$ -1276 -1463 -1400 -1369 -996 -405 -716 -653 -405 -124 -591 -653 -1151 -1431 -1556 -1307 -1307 -1151 -778 -467
917.1045933959a027J56l1%O2l11m67K80M67%k18l1j56%L42l1j86K49o23k80a774
$$ -1027 -871 -902 -902 -840 -1151 -1618 -1338 -871 -871 -1089 -1120 -1276 -1276 -934 -965 -1151 -902 -1525 -1805 -1774
914.2155061088a307J87M98K49l12o53O53J25m36m04l1K17K49L1K49m66K80g78
$$ -1307 -1120 -622 -373 -685 -1338 -685 -560 -996 -1400 -1431 -1214 -965 -934 -685 -1151 -871 -778
911.73926797b80l42J24l11L11r3L1l11j87l42L73K49J87k80%l74%K80R4a680
$$ -280 -622 -498 -809 -498 -591 -560 -871 -1058 -1400 -1027 -778 -591 -871 -871 -1245 -1245 -965 -871 -1680
908.9877061088a649M04N60j86l43l1j24k49M98r4K49k17k81O3N60m05R4O22A56
$$ -1649 -1245 -685 -871 -1214 -1245 -1369 -1618 -1120 -1214 -965 -1182 -1463 -1400 -840 -1245 -1151 -529 156
906.3737933959b80n29k18%r3K18j56M05L73n91o54M67r3K49L11J86l11r3j25d98
$$ -280 -809 -1027 -1027 -1120 -902 -1058 -653 -280 -871 -1525 -1058 -1151 -902 -591 -405 -716 -809 -934 -498
903.6223806829B18%j87k49m35k81J25r3l43L43j87J87m05K80k49o2M98N29e60
$$ 218 218 31 -218 -653 -934 -809 -902 -1245 -902 -1089 -902 -1307 -1027 -1276 -1338 -840 -311 -560
901.0085061088f22m36L73L74r4m04L11l42j56j55K17n60K80N29k49o2L43J24c73
$$ -622 -1058 -685 -311 -405 -809 -498 -840 -996 -1151 -934 -1494 -1214 -685 -934 -996 -653 -529 -373
898.3945806829g78l11L11Tm04o3l1L12k49r4J56J24m35%r4L43J24j87k80%a556
$$ -778 -1089 -778 -467 -871 -934 -965 -653 -902 -996 -840 -716 -1151 -1151 -1245 -902 -778 -965 -1245 -1245 -1556
895.5055933959a587K80K49k18K18r3M35R4O2L11l1R3l11j55L42m98L1m36j24a556
$$ -1587 -1307 -1058 -1276 -1058 -1151 -716 -622 -560 -249 -280 -187 -498 -653 -311 -809 -778 -1214 -1338 -1556
892.7540933959a369%l1n29O22L42K80n91r3L11K18%r4j55o2l74L43K48M98d05
$$ -1369 -1369 -1400 -1929 -1307 -965 -685 -1276 -1369 -1058 -840 -840 -934 -1089 -1151 -1525 -1182 -934 -436 -405
890.0026806829c11m05k80l42k18J87K49M98L73m36l11O2O54R3j55p16N91k80i34
$$ -311 -716 -996 -1338 -1556 -1369 -1120 -622 -249 -685 -996 -934 -280 -187 -342 -1058 -467 -747 -934
887.3887061088a182O84l11K80L42n91r3N29j87k18j55n29l2O23l74K18q09a805
$$ -1182 -498 -809 -529 -187 -778 -871 -342 -529 -747 -902 -1431 -1463 -840 -1214 -996 -1805 -1805
884.9123806829a556J87R3K80o2L73O3l12n91L43J86r3m36K80L11L12k49K80e60
$$ -1556 -1369 -1276 -996 -1058 -685 -622 -934 -1525 -1182 -996 -1089 -1525 -1245 -934 -622 -871 -591 -560
882.2985061088f53k49o3O3K80J24L1TR4k80J24k49O2n91K18j24m05n60O84a463
$$ -653 -902 -965 -902 -622 -498 -467 -436 -342 -622 -498 -747 -685 -1276 -1058 -1182 -1587 -2147 -1463 -1463
879.5470933959a307K49J24l73J87K49l1k80M04r3k80%K80l43L43O2o2o54R65d05
$$ -1307 -1058 -934 -1307 -1120 -871 -902 -1182 -778 -871 -1151 -1151 -871 -1214 -871 -809 -871 -1525 -560 -405
876.7955806829f53%k18l11M04L1l11K18R3k18r3o2K49j25J25%J24k18L74J86b49
$$ -653 -653 -871 -1182 -778 -747 -1058 -840 -747 -965 -1058 -1120 -871 -996 -871 -871 -747 -965 -591 -405 -249
873.9065933959d67J56m98j25o2%m67K81M35M67k80l42j87L1J56M35R4O2l74h71
$$ -467 -311 -809 -934 -996 -996 -1463 -1182 -747 -280 -560 -902 -1089 -1058 -902 -467 -373 -311 -685 -871
871.1550933959d98m67m98L74L42j24n60K80o3J87J56M35j24m36j86N60m36a120
$$ -498 -965 -1463 -1089 -747 -871 -1431 -1151 -1214 -1027 -871 -436 -560 -996 -1182 -622 -1058 -1120
868.6788061088h09R3K18m98l1O22%j24k80l11J24R4j56k49o2L11l1M67k49f85
$$ -809 -716 -498 -996 -1027 -405 -405 -529 -809 -1120 -996 -902 -1058 -1307 -1369 -1058 -1089 -622 -871 -685
865.9272933959h71k18j56J25K49o3o2J25L42Tk49j24m67J87k49N29j87k49a058
$$ -871 -1089 -1245 -1120 -871 -934 -996 -871 -529 -187 -436 -560 -1027 -840 -1089 -560 -747 -996 -1058
863.3133806829g78j24O2l1%r4M05R3k18j55l11o3o2j55M35o2O2k49P16l1j87i65
$$ -778 -902 -840 -871 -871 -965 -560 -467 -685 -840 -1151 -1214 -1276 -1431 -996 -1058 -996 -1245 -529 -560 -747 -965
860.2867933959f53m05N29m05m04J24r3L1L74%K17J25J24m66%R3J87L1l1k49a120
$$ -653 -1058 -529 -934 -1338 -1214 -1307 -1276 -902 -902 -685 -560 -436 -902 -902 -809 -622 -591 -622 -871 -1120
857.3977933959a151r4L1j55L1K80J24M67m98J87K80R3k17K80k80L1l11L1j87h40
$$ -1151 -1245 -1214 -1369 -1338 -1058 -934 -467 -965 -778 -498 -405 -622 -342 -622 -591 -902 -871 -1058 -840
854.6462806829e29J56n61O3l1R3j25m66r4O3k18o2J55L74O2l74L1L43j87L11a027
$$ -529 -373 -934 -871 -902 -809 -934 -1400 -1494 -1431 -1649 -1711 -1556 -1182 -1120 -1494 -1463 -1120 -1307 -996 -1027
851.7572933959g16L1J25k49R3k18r3n91o2R3k80l1N91J87r4o2M67J56o3k80i34
$$ -716 -685 -560 -809 -716 -934 -1027 -1618 -1680 -1587 -1867 -1898 -1307 -1120 -1214 -1276 -809 -653 -716 -996 -934
848.8682061088a120O2%L42m35n60r4N91j24L73r3o22J55K80r3K49R3J25j56a120
$$ -1120 -1058 -1058 -716 -1151 -1711 -1805 -1214 -1338 -965 -1058 -1680 -1525 -1245 -1338 -1089 -996 -871 -1027 -1120
846.1167933959i65L43l43J25k18L73k17J24k18L1r3k18TL43r4%j24L42l11a400
$$ -965 -622 -965 -840 -1058 -685 -902 -778 -996 -965 -1058 -1276 -1494 -1151 -1245 -1245 -1369 -1027 -1338 -1400
843.3652806829i96J25%K80r34k49L11K18o22M36L1M98J24m04m36P16j56r3a369
$$ -996 -871 -871 -591 -1525 -1774 -1463 -1245 -1867 -1431 -1400 -902 -778 -1182 -1618 -902 -1058 -1151 -1369
840.75146797a151j87L1j87M98K49j24j87l1o2l1j87L73J87K18k18L1n29a089
$$ -1151 -1338 -1307 -1494 -996 -747 -871 -1058 -1089 -1151 -1182 -1369 -996 -809 -591 -809 -778 -1307 -1089
838.1375061088a120k18k49K18l1K80R3l1j24J86J25K18j87l1j25j24m05M05a027
$$ -1120 -1338 -1587 -1369 -1400 -1120 -1027 -1058 -1182 -996 -871 -653 -840 -871 -996 -1120 -1525 -1120 -1027
835.5236806829h09n91%j25J87K18k80j87L73k80J87l11N60J87J24l73L1o22a992
$$ -809 -1400 -1400 -1525 -1338 -1120 -1400 -1587 -1214 -1494 -1307 -1618 -1058 -871 -747 -1120 -1089 -1711 -1992
832.9097061088a587K18J55j24j25M67j24O2m98l1R3%k49M67k80o2K49o2R3h71
$$ -1587 -1369 -1214 -1338 -1463 -996 -1120 -1058 -1556 -1587 -1494 -1494 -1743 -1276 -1556 -1618 -1369 -1431 -1338 -871
830.1582061088i96O2j55K18j87N60L74K17j55j87n29l11k18k49j55N29O2j25a369
$$ -996 -934 -1089 -871 -1058 -498 -124 93 -62 -249 -778 -1089 -1307 -1556 -1711 -1182 -1120 -1245 -1369
827.5443806829a556J25M66l1K18%L1K80J56l74O3k49k80TJ86r3J24K49M67g78
$$ -1556 -1431 -965 -996 -778 -778 -747 -467 -311 -685 -622 -871 -1151 -1431 -1245 -1338 -1214 -965 -498 -778
824.79296797a120k18j25L74j56l11P16O2m36l11N60k49N29J25j56n29L43a338
$$ -1120 -1338 -1463 -1089 -1245 -1556 -840 -778 -1214 -1525 -965 -1214 -685 -560 -716 -1245 -902 -1338
822.3165806829h40R3R4l74O2L74l74r3M36j25k18j24J24r3l1l42K80k18J55a307
$$ -840 -747 -653 -1027 -965 -591 -965 -1058 -622 -747 -965 -1089 -965 -1058 -1089 -1431 -1151 -1369 -1214 -1307
819.5651806829i02k49m67o2N29%K49R3r3J55J87o2l43j86R3p78k49N60M36a214
$$ -902 -1151 -1618 -1680 -1151 -1151 -902 -809 -902 -747 -560 -622 -965 -1151 -1058 -1836 -2085 -1525 -1089 -1214
816.8136806829a058L1R3l1k80To2K49M04j24k49p47K80L74r4N92L73l42l43a618
$$ -1058 -1027 -934 -965 -1245 -1525 -1587 -1338 -934 -1058 -1307 -2054 -1774 -1400 -1494 -902 -529 -871 -1214 -1618
814.06226797a151L11n91l2M05l11l1r4J56J24J25o2N91k80k49j25k49R4a525
$$ -1151 -840 -1431 -1463 -1058 -1369 -1400 -1494 -1338 -1214 -1089 -1151 -560 -840 -1089 -1214 -1463 -1369 -1525
811.4482933959a618M67r4l1J25J55m04K18N29K17l73K18k80J86j55J87l43a058
$$ -1618 -1151 -1245 -1276 -1151 -996 -1400 -1182 -653 -436 -809 -591 -871 -685 -840 -653 -996 -1058
808.97196797a214%k49J56K80J87m67M36L1%l1r4l42m04%R3K18Tj25k18m67a898
$$ -1214 -1214 -1463 -1307 -1027 -840 -1307 -871 -840 -840 -871 -965 -1307 -1711 -1711 -1618 -1400 -1182 -1307 -1525 -1992 -1898
805.9453806829a711R64M36r4l73j24l2K49k17k18j25L11r3k18O3L73j87J56a089
$$ -1711 -747 -311 -405 -778 -902 -934 -685 -902 -1120 -1245 -934 -1027 -1245 -1182 -809 -996 -840 -1089
803.3315061088a058m36O3l2M05l1J24m04l42K48M36m36J56j87l1O2M36l11i96
$$ -1058 -1494 -1431 -1463 -1058 -1089 -965 -1369 -1711 -1463 -1027 -1463 -1307 -1494 -1525 -1463 -1027 -1338 -996
800.7175806829h71l1o54%L1L11k49J25M98J24n91O22K18l73l1R3%K49k18j24a182
$$ -871 -902 -1556 -1556 -1525 -1214 -1463 -1338 -840 -716 -1307 -685 -467 -840 -871 -778 -778 -529 -747 -871 -1182
797.8285933959i65j86J86m35J86l11j86M97L2m05J24K18M98j87%l42K80k49a369
$$ -965 -1151 -965 -1400 -1214 -1525 -1711 -1214 -1182 -1587 -1463 -1245 -747 -934 -934 -1276 -996 -1245 -1369
795.2146806829a276j24%R3K49o2R3j24J86o2j55L1m67O22J87l1l11K17R4J87g16
$$ -1276 -1400 -1400 -1307 -1058 -1120 -1027 -1151 -965 -1027 -1182 -1151 -1618 -996 -809 -840 -1151 -934 -840 -653 -716
792.3256806829h09k80o2k49R3k49J87M35K18n91r3R3M36%l74%O3M04K80%J87i34
$$ -809 -1089 -1151 -1400 -1307 -1556 -1369 -934 -716 -1307 -1400 -1307 -871 -871 -1245 -1245 -1182 -778 -498 -498 -311 -934
789.2989933959i34O3L1l1J55j86L42o2L73j87j24J24l1m35o3o22k18M05L73i65
$$ -934 -871 -840 -871 -716 -902 -560 -622 -249 -436 -560 -436 -467 -902 -965 -1587 -1805 -1400 -1027 -965
786.5475806829e91j56l1o2j87p78L74O22j87J25r4L1R4r4J56%K80k80R3k80i96
$$ -591 -747 -778 -840 -1027 -1805 -1431 -809 -996 -871 -965 -934 -840 -934 -778 -778 -498 -778 -685 -965 -996
783.6584806829a369M98j25%J56J24l73k18M05M04l11%Ur3l12K18L1n29k49a618
$$ -1369 -871 -996 -996 -840 -716 -1089 -1307 -902 -498 -809 -809 -809 -809 -902 -1214 -996 -965 -1494 -1743 -1618
780.7694806829a369j87l1l11M04O3L1R3l11O2k49k18N92J55N91k49K18j24a120
$$ -1369 -1556 -1587 -1898 -1494 -1431 -1400 -1307 -1618 -1556 -1805 -2023 -1431 -1276 -685 -934 -716 -840 -1120
778.15556797a400J86L2M04l42o2L1Tj56K80%M36J24O3j56Tn29O3J86K49a431
$$ -1400 -1214 -1182 -778 -1120 -1182 -1151 -1120 -1276 -996 -996 -560 -436 -373 -529 -685 -1214 -1151 -965 -716 -1431
775.2665806829a680r4M36K49K80m67k80M36R3k18r3k49L42k49L1L43k49j56a463
$$ -1680 -1774 -1338 -1089 -809 -1276 -1556 -1120 -1027 -1245 -1338 -1587 -1245 -1494 -1463 -1120 -1369 -1525 -1463
772.6526188218a369l74L43Q09%R3l11m05n29M05L42O2o2J87m05l1L1J56r3a120
$$ -1369 -1743 -1400 -591 -591 -498 -809 -1214 -1743 -1338 -996 -934 -996 -809 -1214 -1245 -1214 -1058 -1151 -1120
769.9012061088a463j55%M04r3L1j87M36R3J56R3L2k81l42j87N92L1m67o2%a151
$$ -1463 -1618 -1618 -1214 -1307 -1276 -1463 -1027 -934 -778 -685 -653 -934 -1276 -1463 -871 -840 -1307 -1369 -1369 -1151
767.0121061088a618J24Q72l43l73K80k49k80K80k49O2J87K49r3K17k80UN29i34
$$ -1618 -1494 -622 -965 -1338 -1058 -1307 -1587 -1307 -1556 -1494 -1307 -1058 -1151 -934 -1214 -1494 -1774 -1245 -934
764.2606933959a151%O2l1r4R4K18m05j87k17M04M67k80p16J87O2M36o3k49a307
$$ -1151 -1151 -1089 -1120 -1214 -1120 -902 -1307 -1494 -1711 -1307 -840 -1120 -1836 -1649 -1587 -1151 -1214 -1463 -1307
761.5092806829i02J55k49r3o2j87R3M36j87m67J87L11K80k17r4j86k18j87a431
$$ -902 -747 -996 -1089 -1151 -1338 -1245 -809 -996 -1463 -1276 -965 -685 -902 -996 -1182 -1400 -1587 -1431
758.8953061088a120O2%j56j24O53l1o2l1L73m04o2J24l11l1L73l11o2J86K18h09
$$ -1120 -1058 -1058 -1214 -1338 -685 -716 -778 -809 -436 -840 -902 -778 -1089 -1120 -747 -1058 -1120 -934 -716 -809
756.00626797f85l42O2l73K49L42r3k80O2L73R4J24k49Tj86j87K18O2R3j24i65
$$ -685 -1027 -965 -1338 -1089 -747 -840 -1120 -1058 -685 -591 -467 -716 -965 -1151 -1338 -1120 -1058 -965 -1089 -965
753.1172806829i34M98m35O2J87k49o85O2%K80J25J87l2R4l11l1M35J25j25i65
$$ -934 -436 -871 -809 -622 -871 -1556 -1494 -1494 -1214 -1089 -902 -934 -840 -1151 -1182 -747 -622 -747 -965
750.36576797g78K49K18O22r64J24TM36k49J87m98l73j87L1o2m98%P47%J24g78
$$ -778 -529 -311 311 -653 -529 -405 31 -218 -31 -529 -902 -1089 -1058 -1120 -1618 -1618 -871 -871 -747 -778
747.47676797g16J87L42q09K49%j55O2To2%l42L11J86k17o23M36K49m36j55a058
$$ -716 -529 -187 -996 -747 -747 -902 -840 -778 -840 -840 -1182 -871 -685 -902 -1525 -1089 -840 -1276 -1431 -1058
744.5876806829a027j24j25o2%N60j87M98J25k80l43O85J24k17m98L1k49K18a214
$$ -1027 -1151 -1276 -1338 -1338 -778 -965 -467 -342 -622 -965 -280 -156 -373 -871 -840 -1089 -871 -1214
741.9738061088a307n60O53j55J55L74K49m05j86%k18l11K48L12l1l74M67k80a463
$$ -1307 -1867 -1214 -1369 -1214 -840 -591 -996 -1182 -1182 -1400 -1711 -1463 -1151 -1182 -1556 -1089 -1369 -1463
739.3599806829a774K80M98r3k49P47r4J87K18L1m98r3l11K80%l1o3L1L2R3i34
$$ -1774 -1494 -996 -1089 -1338 -591 -685 -498 -280 -249 -747 -840 -1151 -871 -871 -902 -965 -934 -902 -809 -934
736.4708806829e91J55L1m66l43o84M35N29M67l73r4j55r3K17l1k49L74J86a089
$$ -591 -436 -405 -871 -1214 -1898 -1463 -934 -467 -840 -934 -1089 -1182 -965 -996 -1245 -871 -685 -1089
733.85706797a805O2O3M98j56J56L11J55J87K18r4O3l11j56l1O53J56q09i65
$$ -1805 -1743 -1680 -1182 -1338 -1182 -871 -716 -529 -311 -405 -342 -653 -809 -840 -187 -31 -840 -965
731.2431061088a120m98N60K49O2K18L11l42k49j25L12m98J55l11L1%L43r4a058
$$ -1120 -1618 -1058 -809 -747 -529 -218 -560 -809 -934 -622 -1120 -965 -1276 -1245 -1245 -902 -996 -1058
728.6291806829i96j24j87J56R3L11l73l11L1L42J24O3l43L74L73k49%R4%l1i02
$$ -996 -1120 -1307 -1151 -1058 -747 -1120 -1431 -1400 -1058 -934 -871 -1214 -840 -467 -716 -716 -622 -622 -653 -902
725.7401806829h40j25o2R3%j55J24k49K18TR3o2N29R4o3m04R3l73r4L1l1m35a151
$$ -840 -965 -1027 -934 -934 -1089 -965 -1214 -996 -778 -685 -747 -218 -124 -187 -591 -498 -871 -965 -934 -965 -1400 -1151
722.57596797g78M67q09o2L11k18m36M98r3k49L73K18k18L1J25o2R3m36k49a151
$$ -778 -311 -1120 -1182 -871 -1089 -1525 -1027 -1120 -1369 -996 -778 -996 -965 -840 -902 -809 -1245 -1494 -1151
719.8245061088f53M04l42R3j24l43k49l1TM67R3K18n60J24%R4p78M04K80J56i34
$$ -653 -249 -591 -498 -622 -965 -1214 -1245 -1276 -809 -716 -498 -1058 -934 -934 -840 -1618 -1214 -934 -778 -934
716.9355061088i65L74L1O2K80o2m05m04O2%L1TL74l11L1k80M98L1j25k18J56i65
$$ -965 -591 -560 -498 -218 -280 -685 -1089 -1027 -1027 -996 -965 -591 -902 -871 -1151 -653 -622 -747 -965 -809 -965
713.90886797h71R3L11J87Tl74J87o22K17L12K17r3J25L1J86m04l74k80Tj86e91
$$ -871 -778 -467 -280 -93 -467 -280 -902 -685 -373 -156 -249 -124 -93 93 -311 -685 -965 -1245 -1431 -591
711.0198806829a151J55K18m04K80Tr4r3O2M05L11o54j86J24m35L42L11M05e29
$$ -1151 -996 -778 -1182 -902 -622 -716 -809 -747 -342 -31 -685 -871 -747 -1182 -840 -529 -124 -529
708.40596797f85J56k18n29L74R3Tj24O2L11J25L11P47l1o3l11l1R3K18m98a24
$$ -685 -529 -747 -1276 -902 -809 -716 -840 -778 -467 -342 -31 716 685 622 311 280 373 591 93 -124
705.51696797I3%To2o84L42l11k18k49M04m66M04r3J87L73Tk49J56J87k49f53
$$ 93 93 93 31 -653 -311 -622 -840 -1089 -685 -1151 -747 -840 -653 -280 93 -156 0 187 -62 -653
702.62786797f85m66L42K18K49k80J24%TL1J56l11R3M36Q09J24Q40L12K80B489
$$ -685 -1151 -809 -591 -342 -622 -498 -498 -498 -467 -311 -622 -529 -93 716 840 1680 1992 2272 2489
699.87646797B583P15M67j55O2l11L1l74l11r3l11m98j25n60l11L1o2j25H09
$$ 2583 3298 3765 3610 3672 3361 3392 3018 2707 2614 2303 1805 1680 1120 809 840 778 653 809
697.2625061088E60K49l1J56o3r3L1k18J25J55j24k18l1K18j25j24L1m67q09g78
$$ 560 809 778 934 871 778 809 591 716 871 747 529 498 716 591 467 498 31 -778 -778
694.5110933959b18N60M36Tk18P15L74Q09O85J587J244K614N228Q744J2136D5930
$$ -218 342 778 1214 996 1711 2085 2894 3579 5166 6410 9024 14252 22996 35132 45930
692.3098806829E1158O316M824O53r64q41p188j4750j3194p655n009l050j649G593
$$ 51158 57474 62298 62951 61987 61146 53958 39208 26014 18359 13350 10300 8651 7593
690.3838061088F721p78o84k49r34k49l42K80M67J87o23J25n91l43o53R3K49B614
$$ 6721 5943 5259 5010 4076 3827 3485 3765 4232 4419 3796 3921 3330 2987 2334 2427 2676 2614
687.90756797B707%k80R4k81K49l73o85k49O23J55j24k18j55k49l2l42L42A525
$$ 2707 2707 2427 2521 2240 2489 2116 1431 1182 1805 1960 1836 1618 1463 1214 1182 840 1182 1525
685.2935933959A680L1l11K80M36K18j25q71m36l42R3l11L1l1J56m05o2j24A56
$$ 1680 1711 1400 1680 2116 2334 2209 1338 902 560 653 342 373 342 498 93 31 -93 156
682.67976797B18%k80J86k80l1j24j87l73K18O2J24j86L73%M04K81l2k80C1
$$ 218 218 -62 124 -156 -187 -311 -498 -871 -653 -591 -467 -653 -280 -280 124 405 373 93 31
679.92826797A24J87l11J56M97R4k18K49n91j25Q09o2k80M98j56j24j25L43G47
$$ 124 311 0 156 653 747 529 778 187 62 871 809 529 1027 871 747 622 965 747
677.3144061088E60l73m98o2j56k49O2r3J56k81R4k18L42r3J56j87j56l73M67g47
$$ 560 187 -311 -373 -529 -778 -716 -809 -653 -934 -840 -1058 -716 -809 -653 -840 -996 -1369 -902 -747
674.5628933959e91J86M67o2l42k49o2K48O23O2r3k18J24J25J87n92k18j24d05
$$ -591 -405 62 0 -342 -591 -653 -405 218 280 187 -31 93 218 405 -187 -405 -529 -405
671.94906797e91l1K80L73L11M36k80M67k18J24k18O3j87m36m98l42l11M98b49
$$ -591 -622 -342 31 342 778 498 965 747 871 653 716 529 93 -405 -747 -1058 -560 -249
669.3351061088i34p46O2M36l2k49r3M05J86r3o2J86l73K49o2l43L2L1M35r3e91
$$ -934 -1680 -1618 -1182 -1214 -1463 -1556 -1151 -965 -1058 -1120 -934 -1307 -1058 -1120 -1463 -1431 -1400 -965 -1058 -591
666.4461061088h71L42l1L73m04m36%O2m35J86J87L42l1M36K18J244K81m36A120
$$ -871 -529 -560 -187 -591 -1027 -1027 -965 -1400 -1214 -1027 -685 -716 -280 -62 1182 1463 1027 1120
663.8321806829A276l42l43k80m35l43J25R3J87j25O3M97O3l74M98K80l11m05B18
$$ 1276 934 591 311 -124 -467 -342 -249 -62 -187 -124 373 436 62 560 840 529 124 218
661.2183061088f2n29O2K80j24O22M36L42O22L11q40m67j24k49r3o3m35l1j56b80
$$ -62 -591 -529 -249 -373 249 685 1027 1649 1960 1120 653 529 280 187 124 -311 -342 -498 -280
658.4668061088c73R3M04K49R4O2L1J87L1K49k80N91M05j87r3L11l43r3k80I96
$$ -373 -280 124 373 467 529 560 747 778 1027 747 1338 1743 1556 1463 1774 1431 1338 1058 996
655.7154061088H71O3J86R4p47n60j87m05l1N92J86J25O2J24l1R4M35M36R3A245
$$ 871 934 1120 1214 467 -93 -280 -685 -716 -124 62 187 249 373 342 436 871 1307 1400 1245
652.9638933959H71L11O3J24k18O3N29R33O85N60J774K364J681R33J743K209A6461
$$ 871 1182 1245 1369 1151 1214 1743 2676 3361 3921 5695 8059 9740 10673 12416 14625 16461
650.6252061088A8048k49k551l454l361j120L1J24m04j463o22r65n91n60r4B707
$$ 18048 17799 15248 11794 8433 7313 7344 7468 7064 5601 4979 4014 3423 2863 2769 2707
648.4239933959B801J55K18n60o85%K18L42Q09L2R3L73k80M05K49l11l43k80C672
$$ 2801 2956 3174 2614 1929 1929 2147 2489 3298 3330 3423 3796 3516 3921 4170 3859 3516 3236 3672
645.81016797D108R02J87j56%n91q09j56r02l11m36l73k49k18J24O85P16C890
$$ 4108 5010 5197 5041 5041 4450 3641 3485 2583 2272 1836 1463 1214 996 1120 1805 2521 3890
643.3337933959D637J338M97J56j87L12k49K80j25j120j743j089o2N91P47J307E259
$$ 4637 5975 6472 6628 6441 6753 6504 6784 6659 5539 3796 2707 2645 3236 3983 5290 5259
640.9950933959E103k49M98O85Q09k49p78K18J151R34J556N91r03o53m05J25A0611
$$ 5103 4854 5352 6037 6846 6597 5819 6037 7188 8122 9678 10269 9366 8713 8308 8433 10611
638.6562933959A3287J650K209L610K831O566R180J1669J4563K5828M7579R4971C99459
$$ 13287 14937 17146 20756 23587 30153 39333 51002 65565 91393 138972 233943 399459
636.8678061088F24720J26743N7785J12086O9548M886k8691j2633j88574l03180B91698
$$ 624720 751463 809248 921334 990882 995768 967077 954444 765870 462690 291698
635.3545933959B07493m3627l0278j8421j4128q308q215o037m139k178l205F9019
$$ 207493 163866 133588 115167 101039 92731 84516 78479 74340 72162 68957 69019
633.7036933959F8117l050m574k396l516k552l143k987m761l859l516j027K18C2923
$$ 68117 65067 60493 58097 54581 52029 48886 45899 41138 37279 33763 32736 32954 32923
631.7776188218C1522r02j743j556L2O53p16j86k80n30r02j24j090k17k49N60B5423
$$ 31522 30620 28877 27321 27353 28006 27290 27104 26824 26294 25392 25268 24178 23961 23712 24272 25423
629.43896797B8224L423M232J587j649l019k334k520j774j960k054k303j649A6275
$$ 28224 31647 35879 37466 35817 32798 30464 27944 26170 24210 22156 19853 18204 16275
627.5128806829A4532j556o22q72k17k49%n92l1n29L12l2o2n91j214p15J55G655
$$ 14532 12976 12354 11482 11265 11016 11016 10424 10393 9864 10176 10144 10082 9491 8277 7562 7717 7655
625.0365061088G779l1J25o2r4n60j24p47l1m98j56L42j24J24J961K707L174A6741
$$ 7779 7748 7873 7811 7717 7157 7033 6286 6255 5757 5601 5943 5819 5943 7904 10611 13785 16741
622.56026797B0258K582J587L43Q09k116l454k179j835k583Tj276j556j680E259
$$ 20258 22840 24427 24770 25579 23463 20009 17830 15995 13412 10829 9553 7997 6317 5259
620.4966933959D325j86l74l42j87j24m98p16L1L43l2J87k18l1o53R3O2M98B396
$$ 4325 4139 3765 3423 3236 3112 2614 1898 1929 2272 2240 2427 2209 2178 1525 1618 1680 2178 2396
617.88276797A992r65J87o3J87m36l73j24o3o84l74n60m04r4R65l1m05k49a027
$$ 1992 1027 1214 1151 1338 902 529 405 342 -342 -716 -1276 -1680 -1774 -809 -840 -1245 -1494 -1027
615.2688061088a400M35K49M36j56r3TJ24R3m97j56j24R3N29m05j86m67l74b583
$$ -1400 -965 -716 -280 -436 -529 -622 -498 -405 -902 -1058 -1182 -1089 -560 -965 -1151 -1618 -1992 -2583
612.6549933959b147j25K80L2k49J24N29K80l73K80M98k80o23k49O3l2J56l42b334
$$ -2147 -2272 -1992 -1960 -2209 -2085 -1556 -1276 -1649 -1369 -871 -1151 -1774 -2023 -1960 -1992 -1836 -2178 -2334
610.04106797a960N91O84O3O2K18o3K81q10m66m05o84q41J25N60J151M36e91
$$ -1960 -1369 -685 -622 -560 -342 -405 -124 -934 -1400 -1805 -2489 -3330 -3205 -2645 -1494 -1058 -591
607.5647933959a56k17M66l73m67o22n29L11%K80O2l11k18J25o85L1K49J25a618
$$ -156 -373 93 -280 -747 -1369 -1898 -1587 -1587 -1307 -1245 -1556 -1774 -1649 -2334 -2303 -2054 -1929 -1618
604.95086797a276R4l43k49O23%m05l1M05R3TO2l1j24J87m98l43K49M36k18a369
$$ -1276 -1182 -1525 -1774 -1151 -1151 -1556 -1587 -1182 -1089 -996 -934 -965 -1089 -902 -1400 -1743 -1494 -1058 -1276 -1369
602.06186797a649r4n91K18M05J24o2L73r3L1k49r3n92O3o3L12K17%R4K49a898
$$ -1649 -1743 -2334 -2116 -1711 -1587 -1649 -1276 -1369 -1338 -1587 -1680 -2272 -2209 -2272 -1960 -1743 -1743 -1649 -1400 -1898
599.17286797a992l1L74k18K49k18j24K80J86k49l11L1o2K18R65k49L1j25a338
$$ -1992 -2023 -1649 -1867 -1618 -1836 -1960 -1680 -1494 -1743 -2054 -2023 -2085 -1867 -902 -1151 -1120 -1245 -1338
596.5588933959a525L11L74l1j87O53n29TK18l1o22J87o3L1j55k18m67J25J24b023
$$ -1525 -1214 -840 -871 -1058 -405 -934 -1463 -1245 -1276 -1898 -1711 -1774 -1743 -1898 -2116 -2583 -2458 -2334 -2023
593.8073933959b116l1l11J55K18K49k80M05j87r4N61K17j24L1r02o3L43L11a805
$$ -2116 -2147 -2458 -2303 -2085 -1836 -2116 -1711 -1898 -1992 -1431 -1214 -1338 -1307 -2209 -2272 -1929 -1618 -1805
591.1935806829b147j25M98J56L42R4m05TM05%j24L11L42k80l11R3o2k49L11a929
$$ -2147 -2272 -1774 -1618 -1276 -1182 -1587 -1992 -1587 -1587 -1711 -1400 -1058 -1338 -1649 -1556 -1618 -1867 -1556 -1929
588.44206797a929J86L43n29J55O3J55J56k49k18m05j55M35l11K49k18j24b427
$$ -1929 -1743 -1400 -1929 -1774 -1711 -1556 -1400 -1649 -1867 -2272 -2427 -1992 -2303 -2054 -2272 -2396 -2427
585.9657933959b116O2M67K18K49k80m98l74O85M98J87l74j55l43m66r4%j55b272
$$ -2116 -2054 -1587 -1369 -1120 -1400 -1898 -2272 -1587 -1089 -902 -1276 -1431 -1774 -2240 -2334 -2334 -2489 -2272
583.35186797b303%j86M04k18L1K49L12J24K49l11R3L1M05%Tp47r3K17l1a992
$$ -2303 -2303 -2489 -2085 -2303 -2272 -2023 -1711 -1587 -1338 -1649 -1556 -1525 -1120 -1120 -1120 -1867 -1960 -1743 -1774 -1992
580.46286797a680J55N29l11L1l73k80J55J87j87j24J24L11M67K18l42k49a649
$$ -1680 -1525 -996 -1307 -1276 -1649 -1929 -1774 -1587 -1774 -1898 -1774 -1463 -996 -778 -1120 -1369 -1649
577.9864806829a245m35L1j87L73m04J24J25J87%J24m36k49L2l2m66M04L1L12a836
$$ -1245 -1680 -1649 -1836 -1463 -1867 -1743 -1618 -1431 -1431 -1307 -1743 -1992 -1960 -1992 -2458 -2054 -2023 -1711 -1836
575.23506797a369m05k18L43R3j87R4m36N29K49j87r3M05%TQ71J87l43P47I96
$$ -1369 -1774 -1992 -1649 -1556 -1743 -1649 -2085 -1556 -1307 -1494 -1587 -1182 -1182 -1182 -311 -124 -467 280 996
572.48356797A058l1M36L11O2l11j25o2j87r64k18J55j089k80l73l74r3m04b240
$$ 1058 1027 1463 1774 1836 1525 1400 1338 1151 187 -31 124 -965 -1245 -1618 -1992 -2085 -2489 -2240
569.8697061088b272J87k49R4L11l1%O2M04J25k80l1O2J24o2R3l11k49R4k80b521
$$ -2272 -2085 -2334 -2240 -1929 -1960 -1960 -1898 -1494 -1369 -1649 -1680 -1618 -1494 -1556 -1463 -1774 -2023 -1929 -2209 -2521
566.9806188218b023R4j25R4O84J87R3j55r4%K49m67n29m04L11J56R3L11J56a649
$$ -2023 -1929 -2054 -1960 -1276 -1089 -996 -1151 -1245 -1245 -996 -1463 -1992 -2396 -2085 -1929 -1836 -1525 -1369 -1649
564.2292061088a929j56K49o2J87n29L42j56o2k80R3O3K17k17K48k80R4L1K49a867
$$ -1929 -2085 -1836 -1898 -1711 -2240 -1898 -2054 -2116 -2396 -2303 -2240 -2023 -2240 -1992 -2272 -2178 -2147 -1898 -1867
561.4776933959a836l11L1O2o2k80j56j24M04l42J56O2N29L11L42%k49J56%a369
$$ -1836 -2147 -2116 -2054 -2116 -2396 -2552 -2676 -2272 -2614 -2458 -2396 -1867 -1556 -1214 -1214 -1463 -1307 -1307 -1369
558.7262933959a618k80L1l1N60%O2j87m04j25M98%J56l73o3k80J87j25%J25a743
$$ -1618 -1898 -1867 -1898 -1338 -1338 -1276 -1463 -1867 -1992 -1494 -1494 -1338 -1711 -1774 -2054 -1867 -1992 -1992 -1867 -1743
555.8372061088b303o2J25M97j24l1j25L12j87l74K18L11m04J55m04K49K18a867
$$ -2303 -2365 -2240 -1743 -1867 -1898 -2023 -1711 -1898 -2272 -2054 -1743 -2147 -1992 -2396 -2147 -1929 -1867
553.36096797b085L1k80%J87M67j87o54O3M35j24o2%P15l1O2k17k80l2N29a307
$$ -2085 -2054 -2334 -2334 -2147 -1680 -1867 -2521 -2458 -2023 -2147 -2209 -2209 -1494 -1525 -1463 -1680 -1960 -1992 -1463 -1307
550.47186797a307k80j56j24o2K49M66r3O2o22o2J24J25j25L42o2j55m36b023
$$ -1307 -1587 -1743 -1867 -1929 -1680 -1214 -1307 -1245 -1867 -1929 -1805 -1680 -1805 -1463 -1525 -1680 -2116 -2023
547.8579933959b178j56J25l1l2J56O2J25n60r4O2l11r3P47O2r3L1%J55Q72a058
$$ -2178 -2334 -2209 -2240 -2272 -2116 -2054 -1929 -2489 -2583 -2521 -2832 -2925 -2178 -2116 -2209 -2178 -2178 -2023 -1151 -1058
544.9688933959a182l2j55k18j56k49m97O2J87J55k80%M67m67L11%R4l2K81b147
$$ -1182 -1214 -1369 -1587 -1743 -1992 -2489 -2427 -2240 -2085 -2365 -2365 -1898 -2365 -2054 -2054 -1960 -1992 -1711 -2147
542.2174806829b085O2N92j56J87l11J55L1j24k18L11l1M98o2l1k18m98n91b427
$$ -2085 -2023 -1431 -1587 -1400 -1711 -1556 -1525 -1649 -1867 -1556 -1587 -1089 -1151 -1182 -1400 -1898 -2489 -2427
539.60356797a960J55n29r3R3J87TK49o3J56j25j55l11J24K80M36k49r3j87a774
$$ -1960 -1805 -2334 -2427 -2334 -2147 -1960 -1711 -1774 -1618 -1743 -1898 -2209 -2085 -1805 -1369 -1618 -1711 -1898 -1774
536.85216797a618J87k18%K80l1k18r3j87N29%k18k49K18m36R4j56N60j55a805
$$ -1618 -1431 -1649 -1649 -1369 -1400 -1618 -1711 -1898 -1369 -1369 -1587 -1836 -1618 -2054 -1960 -2116 -1556 -1711 -1805
534.1006188218a587j24l12K18l1k18l73o2J86N60o2k18K80M05l11%l43k17b272
$$ -1587 -1711 -2023 -1805 -1836 -2054 -2427 -2489 -2303 -1743 -1805 -2023 -1743 -1338 -1649 -1649 -1992 -2209 -2272
531.4867933959a805J56K18l43O3l74r3j87J87k49L11K18N29k49r3k18K18r4a525
$$ -1805 -1649 -1431 -1774 -1711 -2085 -2178 -2365 -2178 -2427 -2116 -1898 -1369 -1618 -1711 -1929 -1711 -1805 -1525
528.87286797a774K18O2%l42M05j56k18r3j87j24O2K49L73K49K18n91o2j25b054
$$ -1774 -1556 -1494 -1494 -1836 -1431 -1587 -1805 -1898 -2085 -2209 -2147 -1898 -1525 -1276 -1058 -1649 -1711 -1836 -2054
526.1214061088a649M04R4k49n92%k80j55j87P47L42K49m35j25K80K49r3K49a618
$$ -1649 -1245 -1151 -1400 -1992 -1992 -2272 -2427 -2614 -1867 -1525 -1276 -1711 -1836 -1556 -1307 -1400 -1151 -1618
523.5074806829a898j25j24K18K49R3K49O2R4m36L1r3J86l42O2O3M04O2r3k18a338
$$ -1898 -2023 -2147 -1929 -1680 -1587 -1338 -1276 -1182 -1618 -1587 -1680 -1494 -1836 -1774 -1711 -1307 -1245 -1338 -1556 -1338
520.6184806829a276m04j56K18r3K48J56R3m97J86K49r3j25L12L11k18m67k80b147
$$ -1276 -1680 -1836 -1618 -1711 -1463 -1307 -1214 -1711 -1525 -1276 -1369 -1494 -1182 -871 -1089 -1556 -1836 -2147
518.00456797b365J56M35k80K18%J56l1o3r3L73j24n29K18Q71k49J56j25a369
$$ -2365 -2209 -1774 -2054 -1836 -1836 -1680 -1711 -1774 -1867 -1494 -1618 -2147 -1929 -1058 -1307 -1151 -1276 -1369
515.3907061088a556j24%K17j55k18r3K80o2K48j24o2j87K18Tk49j87M98L11i65
$$ -1556 -1680 -1680 -1463 -1618 -1836 -1929 -1649 -1711 -1463 -1587 -1649 -1836 -1618 -1400 -1649 -1836 -1338 -1027 -965
512.6392061088a338k80l11J86%L2j87K18l1l2m04l42J86O23l43r3j87M05R3a556
$$ -1338 -1618 -1929 -1743 -1743 -1711 -1898 -1680 -1711 -1743 -2147 -2489 -2303 -1680 -2023 -2116 -2303 -1898 -1805 -1556
509.8877933959a805J56m05L1M67O2j24R3k18k80O3r4l1J25K49l43%K49j87b023
$$ -1805 -1649 -2054 -2023 -1556 -1494 -1618 -1525 -1743 -2023 -1960 -2054 -2085 -1960 -1711 -2054 -2054 -1805 -1992 -2023
507.1362806829a898L42K80J87n60l1TL1L73J25k81k80r3Tl1J86J25J24L1r3a805
$$ -1898 -1556 -1276 -1089 -1649 -1680 -1711 -1680 -1307 -1182 -1463 -1743 -1836 -1929 -1960 -1774 -1649 -1525 -1494 -1587 -1805
504.2472806829a463O3L1o2%R3J56n29k49K17k80K18M98k80j56k49K18L11J25a400
$$ -1463 -1400 -1369 -1431 -1431 -1338 -1182 -1711 -1960 -1743 -2023 -1805 -1307 -1587 -1743 -1992 -1774 -1463 -1338 -1400
501.49576797a214k17m05r3O2J87N60O2l11l74o2K49J87l1J24l1%l1j87L1i96
$$ -1214 -1431 -1836 -1929 -1867 -1680 -1120 -1058 -1369 -1743 -1805 -1556 -1369 -1400 -1276 -1307 -1307 -1338 -1525 -1494 -996
498.60676797a307L1Tj86l12j86J86N61m36K80o2o3j86o2%K17l11J56K18a245
$$ -1307 -1276 -1245 -1431 -1743 -1929 -1743 -1182 -1618 -1338 -1400 -1463 -1649 -1711 -1711 -1494 -1805 -1649 -1431 -1245
495.85526797a711L11j56r3j87K80o2Tk18%Un29K49L42j87k17%L1K80N29a494
$$ -1711 -1400 -1556 -1649 -1836 -1556 -1618 -1680 -1898 -1898 -1898 -1898 -2427 -2178 -1836 -2023 -2240 -2240 -2209 -1929 -1400 -1494
492.8286933959a556N29o2K18j25m67o53j24R3N91J25L42l42J55j87j55j87a245
$$ -1556 -1027 -1089 -871 -996 -1463 -2116 -2240 -2147 -1556 -1431 -1089 -1431 -1276 -1463 -1618 -1805 -1245
490.3523061088a494M67l1l73j25M67%m05l73r3M97K49l73j87o2R3m66k49J86a898
$$ -1494 -1027 -1058 -1431 -1556 -1089 -1089 -1494 -1867 -1960 -1463 -1214 -1587 -1774 -1836 -1743 -2209 -2458 -2272 -1898
487.6008933959a929Q09M98j87k18m98j24k18j56M36j24l2L2M66l73%l1L73a276
$$ -1929 -1120 -622 -809 -1027 -1525 -1649 -1867 -2023 -1587 -1711 -1743 -1711 -1245 -1618 -1618 -1649 -1276 -1276
484.9869806829a058k49L1l11Tj87K49l11m05l1O85K49j87k18M98l1Tk18O2a400
$$ -1058 -1307 -1276 -1587 -1898 -2085 -1836 -2147 -2552 -2583 -1898 -1649 -1836 -2054 -1556 -1587 -1618 -1836 -1774 -1400
482.23556797h71l43k80m35L1o2O2o2R3j56M36o2M35l11M05J86l11m66M04a214
$$ -871 -1214 -1494 -1929 -1898 -1960 -1898 -1960 -1867 -2023 -1587 -1649 -1214 -1525 -1120 -934 -1245 -1711 -1307 -1214
479.4841061088a058k49k18r3K49M04l11l42L42L1l42l1L42J56j87k49L11O3a276
$$ -1058 -1307 -1525 -1618 -1369 -965 -1276 -1618 -1276 -1245 -1587 -1618 -1276 -1120 -1307 -1556 -1245 -1182 -1276
476.8701806829a805M67r3%k49%L1O2m36R4M66j24Tj87O2l11L1N60l42k18o2b178
$$ -1805 -1338 -1431 -1431 -1680 -1680 -1649 -1587 -2023 -1929 -1463 -1587 -1711 -1898 -1836 -2147 -2116 -1556 -1898 -2116 -2178 -2178
473.8435061088a960K80J55M98j55J24r65l1N91R4k80r4r3K49K18O2j56K18a276
$$ -1960 -1680 -1525 -1027 -1182 -1058 -2023 -2054 -1463 -1369 -1649 -1743 -1836 -1587 -1369 -1307 -1463 -1245 -1276
471.2296933959a431l2J56l73J86n29L12%R3%K18k49J24l1J87j87l1L1R3m66a369
$$ -1431 -1463 -1307 -1680 -1494 -2023 -1711 -1711 -1618 -1618 -1400 -1649 -1525 -1556 -1369 -1556 -1587 -1556 -1463 -1929 -1369
468.3405933959a494l1m35J24J25J86m04j25O2K49R4J86J56TK17J25j25O3m05a774
$$ -1494 -1525 -1960 -1836 -1711 -1525 -1929 -2054 -1992 -1743 -1649 -1463 -1307 -1151 -934 -809 -934 -871 -1276 -1774
465.5891806829b116j24l2M05K18O2k49N60R4J55l73j56%O2O3M35O2l42l11a618
$$ -2116 -2240 -2272 -1867 -1649 -1587 -1836 -1276 -1182 -1027 -1400 -1556 -1556 -1494 -1431 -996 -934 -1276 -1587 -1618
462.8376806829a898M35%l1k80N92R3M36j25l1Tr4l42L42j86j25k18L12K17a151
$$ -1898 -1463 -1463 -1494 -1774 -1182 -1089 -653 -778 -809 -840 -934 -1276 -934 -1120 -1245 -1463 -1151 -934 -1151
460.08626797a649J86L74N29k18o2j25J87j24m98l74l1J25l12o2L11l1j24a649
$$ -1649 -1463 -1089 -560 -778 -840 -965 -778 -902 -1400 -1774 -1805 -1680 -1992 -2054 -1743 -1774 -1898 -1649
457.4723933959a182L1m67j25L12k80l12N92r4K18L11n91K49K18N60p78L1r3a649
$$ -1182 -1151 -1618 -1743 -1431 -1711 -2023 -1431 -1525 -1307 -996 -1587 -1338 -1120 -560 -1338 -1307 -1400 -1649
454.85846797a307J87J55J56o2j56j55R3m05o2j24K49K17J87n60L11%l11a743
$$ -1307 -1120 -965 -809 -871 -1027 -1182 -1089 -1494 -1556 -1680 -1431 -1214 -1027 -1587 -1276 -1276 -1587 -1743
452.2445061088a867m05K80J87k18l73Q09N29l11J87K48%k17r4m66j25J87k80a556
$$ -1867 -2272 -1992 -1805 -2023 -2396 -1587 -1058 -1369 -1182 -934 -934 -1151 -1245 -1711 -1836 -1649 -1929 -1556
449.6306933959a711k18R3O54K80m98l74L74L42r3l74K80J25L42o2P16J55o53a120
$$ -1711 -1929 -1836 -1182 -902 -1400 -1774 -1400 -1058 -1151 -1525 -1245 -1120 -778 -840 -124 31 -622 -1120
447.01676797f85l73l1k80l1j56M36O2l1j56o2J56K49k80k81R4K80R3n91a805
$$ -685 -1058 -1089 -1369 -1400 -1556 -1120 -1058 -1089 -1245 -1307 -1151 -902 -1182 -1463 -1369 -1089 -996 -1587 -1805
444.2653061088a338j87K18R3%o2R4J24K80l1M36k18K49j25l11k49k18R4k18a805
$$ -1338 -1525 -1307 -1214 -1214 -1276 -1182 -1058 -778 -809 -373 -591 -342 -467 -778 -1027 -1245 -1151 -1369 -1805
441.5138061088a307O2j86m36J56M35l11o2M67L11N60j56J87L1k49Tr3l11M35g16
$$ -1307 -1245 -1431 -1867 -1711 -1276 -1587 -1649 -1182 -871 -311 -467 -280 -249 -498 -747 -840 -1151 -716 -716
438.7623933959h40n91L11M04o2j24M04n91k18%M36O2l42l74R4L1K80j25J56g78
$$ -840 -1431 -1120 -716 -778 -902 -498 -1089 -1307 -1307 -871 -809 -1151 -1525 -1431 -1400 -1120 -1245 -1089 -778
436.0109806829a089l11L1J87M97J25k18j24m67n60O22l42M98j25o2K18K49h09
$$ -1089 -1400 -1369 -1182 -685 -560 -778 -902 -1369 -1929 -1307 -1649 -1151 -1276 -1338 -1120 -871 -809
433.5345933959i65l42J25L1R3M98M67n29j25r3L73K49o2o54J56J25O22o54a120
$$ -965 -1307 -1182 -1151 -1058 -560 -93 -622 -747 -840 -467 -218 -280 -934 -778 -653 -31 -685 -1120
430.9206806829i34J25j25%k80J87r3N60j87k18o22j56K49O85L73j86j25m98a400
$$ -934 -809 -934 -934 -1214 -1027 -1120 -560 -747 -965 -1587 -1743 -1494 -809 -436 -622 -747 -1245 -1400
428.30686797h40l42K80j56o2m36O2K18M98K18k18j87J87k80o53m67N29P15i65
$$ -840 -1182 -902 -1058 -1120 -1556 -1494 -1276 -778 -560 -778 -965 -778 -1058 -1711 -2178 -1649 -934 -965
425.6928933959a618J55L43O2l73%r4L1J25O2k80N60m36l42j87K81%L42O2j24a400
$$ -1618 -1463 -1120 -1058 -1431 -1431 -1525 -1494 -1369 -1307 -1587 -1027 -1463 -1805 -1992 -1711 -1711 -1369 -1307 -1431 -1400
422.8038933959a182R3k18j87m66k49L42l73M66L74M04O2L2%J24j24l2o2l42a836
$$ -1182 -1089 -1307 -1494 -1960 -2209 -1867 -2240 -1774 -1400 -996 -934 -902 -902 -778 -902 -934 -996 -1338 -1836
420.0523933959a400J24J25L73j24k18%k49O2m04R3J87L73o2O2r3O2k80r4R4a182
$$ -1400 -1276 -1151 -778 -902 -1120 -1120 -1369 -1307 -1711 -1618 -1431 -1058 -1120 -1058 -1151 -1089 -1369 -1463 -1369 -1182
417.1634061088a338M36j56K49j25%r3J87j87p47L74L73o2k49R3L74l43k17i65
$$ -1338 -902 -1058 -809 -934 -934 -1027 -840 -1027 -1774 -1400 -1027 -1089 -1338 -1245 -871 -1214 -1431 -965
414.5494806829i02R3l11l1m36l42M98k18%R3J25K17M67j24r4l11J25r4%l1a151
$$ -902 -809 -1120 -1151 -1587 -1929 -1431 -1649 -1649 -1556 -1431 -1214 -747 -871 -965 -1276 -1151 -1245 -1245 -1276 -1151
411.6604806829a525r3l1N60L73O3j25O2o22O2l1k49l11L42k18k80M36K80m67a774
$$ -1525 -1618 -1649 -1089 -716 -653 -778 -716 -1338 -1276 -1307 -1556 -1867 -1525 -1743 -2023 -1587 -1307 -1774 -1774
408.9089806829a618M98%O2j24l74R3M67k49J56o2j87r3L1j56O54%m36j87J87a369
$$ -1618 -1120 -1120 -1058 -1182 -1556 -1463 -996 -1245 -1089 -1151 -1338 -1431 -1400 -1556 -902 -902 -1338 -1525 -1338 -1369
406.0199806829a027m04k49K49J86k49O85l42k18L1k49O2Tj55L42O54j87l73a214
$$ -1027 -1431 -1680 -1431 -1245 -1494 -809 -1151 -1369 -1338 -1587 -1525 -1463 -1618 -1276 -622 -809 -1182 -1214
403.4060061088a369k18l73K17J25L42L1l1L1TO3M35k80L1j86j25L1M98j24g78
$$ -1369 -1587 -1960 -1743 -1618 -1276 -1245 -1276 -1245 -1214 -1151 -716 -996 -965 -1151 -1276 -1245 -747 -871 -778
400.6545933959a058k49J56L42k18j87n60L11j55j56L11K81k49L11R3K49l42a089
$$ -1058 -1307 -1151 -809 -1027 -1214 -1774 -1463 -1618 -1774 -1463 -1182 -1431 -1120 -1027 -778 -1120 -1089
398.17826797a587L1J87R3K18k80k18M05k18O2j56j86J86O3j25j55l1O2M35i65
$$ -1587 -1556 -1369 -1276 -1058 -1338 -1556 -1151 -1369 -1307 -1463 -1649 -1463 -1400 -1525 -1680 -1711 -1649 -1214 -965
395.42686797i02l2l11L11R4j87l11r3m36J87L1M98o3o2l11j24m98N91L42a058
$$ -902 -934 -1245 -934 -840 -1027 -1338 -1431 -1867 -1680 -1649 -1151 -1214 -1276 -1587 -1711 -2209 -1618 -1276 -1058
392.6753061088a307j87%j55J24o2m36K49L43M97j86k80J86J87%R3O3J24J56c11
$$ -1307 -1494 -1494 -1649 -1525 -1587 -2023 -1774 -1431 -934 -1120 -1400 -1214 -1027 -1027 -934 -871 -747 -591 -311
389.9238933959i65k80TK49j87J25%n29l1M04o2l1o2O2k18K80l42K18L73k18a618
$$ -965 -1245 -1525 -1276 -1463 -1338 -1338 -1867 -1898 -1494 -1556 -1587 -1649 -1587 -1805 -1525 -1867 -1649 -1276 -1494 -1618
387.0348061088a431j87j25L43O2j25j55o2N29r4R4l43o2J56j25j55L73j24a307
$$ -1431 -1618 -1743 -1400 -1338 -1463 -1618 -1680 -1151 -1245 -1151 -1494 -1556 -1400 -1525 -1680 -1307 -1431 -1307
384.4209806829a556k49J56N91l1r3l43m04k80K80L11K49o2R3k80r3l74k49b334
$$ -1556 -1805 -1649 -1058 -1089 -1182 -1525 -1929 -2209 -1929 -1618 -1369 -1431 -1338 -1618 -1711 -2085 -2334 -2334
381.8070061088b178J86o2L43J55K49j24O2J87k81l1L43j56n60L1j24J24k49b023
$$ -2178 -1992 -2054 -1711 -1556 -1307 -1431 -1369 -1182 -1463 -1494 -1151 -1307 -1867 -1836 -1960 -1836 -2085 -2023
379.1931806829b116M05J24o2j56L1K80k17l2L43J55l1j87r3o2j56j55M66N29f53
$$ -2116 -1711 -1587 -1649 -1805 -1774 -1494 -1711 -1743 -1400 -1245 -1276 -1463 -1556 -1618 -1774 -1929 -1463 -934 -653
376.4416806829a089K49m05l73n29k49P16P15j86M66p78k80l1M36J24J25j87a089
$$ -1089 -840 -1245 -1618 -2147 -2396 -1680 -965 -1151 -685 -1463 -1743 -1774 -1338 -1214 -1089 -1276 -1089
373.9654061088i96j24k18J87J55R4r4m04j56J87L1k80m36K80K49L74r4j24a587
$$ -996 -1120 -1338 -1151 -996 -902 -996 -1400 -1556 -1369 -1338 -1618 -2054 -1774 -1525 -1151 -1245 -1369 -1587
371.3514806829a431k18O2N91L1n60J56J87L11k49J55l42O2l1R4O2o2j87L1a463
$$ -1431 -1649 -1587 -996 -965 -1525 -1369 -1182 -871 -1120 -965 -1307 -1245 -1276 -1182 -1120 -1182 -1369 -1338 -1463
368.60006797i34R4L11m05j86%J55%r3TK49L1n92m04O2K49l1j24K17K18O54c42
$$ -934 -840 -529 -934 -1120 -1120 -965 -965 -1058 -1151 -902 -871 -1463 -1867 -1805 -1556 -1587 -1711 -1494 -1276 -622 -342
365.5733933959I3l42L1k80J25l2j24Tr4o2Tl74j86J55%r3J55L12r4j86J55a027
$$ 93 -249 -218 -498 -373 -405 -529 -653 -747 -809 -871 -1245 -1431 -1276 -1276 -1369 -1214 -902 -996 -1182 -1027 -1027
362.5468061088a214r3J87L11j25k48M97%K18n29j24%k80j56Q09M05R3j87K18d67
$$ -1214 -1307 -1120 -809 -934 -1182 -685 -685 -467 -996 -1120 -1120 -1400 -1556 -747 -342 -249 -436 -218 -467
359.7953933959a027J25j25j55K48J87O54M98k81K18L11j24L42l1Tn29m04L1c1
$$ -1027 -902 -1027 -1182 -934 -747 -93 405 124 342 653 529 871 840 809 280 -124 -93 -31
357.18146797a24j87O2R3j55l11l12O23M98j56l1L73K18N29J56R3k18O85B272
$$ -124 -311 -249 -156 -311 -622 -934 -311 187 31 0 373 591 1120 1276 1369 1151 1836 2272
354.5675061088B272M66O3m36l73L73M04r3m04k80K48%j55n91r4o53O2l42l1E29
$$ 2272 2738 2801 2365 1992 2365 2769 2676 2272 1992 2240 2240 2085 1494 1400 747 809 467 436 529
351.8161061088G16k49%R3o2l11K80p16k80o2k49j25L12L1l12l73K80k49o2h40
$$ 716 467 467 560 498 187 467 -249 -529 -591 -840 -965 -653 -622 -934 -1307 -1027 -1276 -1338 -840
349.0645933959d05k80L12k18r4J56l1o54R4r4k80K80j55r4M36O2k49l73K18a400
$$ -405 -685 -373 -591 -685 -529 -560 -1214 -1120 -1214 -1494 -1214 -1369 -1463 -1027 -965 -1214 -1587 -1369 -1400
346.3131806829a089l74l1N92M04k18j24j87l42l11L1j56L74J86J87K49L1UJ25f53
$$ -1089 -1463 -1494 -902 -498 -716 -840 -1027 -1369 -1680 -1649 -1805 -1431 -1245 -1058 -809 -778 -747 -716 -591 -653
343.4240933959f53J24l11k18o85K18J87K49j56O3j56L1K18J24l42J56J86o2i02
$$ -653 -529 -840 -1058 -1743 -1525 -1338 -1089 -1245 -1182 -1338 -1307 -1089 -965 -1307 -1151 -965 -1027 -902
340.81026797a027j24N29L11l74n29j86K80O2j87l42k49N29o2K80o2L1%R3a369
$$ -1027 -1151 -622 -311 -685 -1214 -1400 -1120 -1058 -1245 -1587 -1836 -1307 -1369 -1089 -1151 -1120 -1120 -1027 -1369
338.0588061088a494L43M66O3j56r3j56l11J24l1r3k80o2k80k49j56M36L73a494
$$ -1494 -1151 -685 -622 -778 -871 -1027 -1338 -1214 -1245 -1338 -1618 -1680 -1960 -2209 -2365 -1929 -1556 -1494
335.4448806829a525j24k18O2o2K18j87J25j56M36M35k49n60J56R3r3%k18R3a556
$$ -1525 -1649 -1867 -1805 -1867 -1649 -1836 -1711 -1867 -1431 -996 -1245 -1805 -1649 -1556 -1649 -1649 -1867 -1774 -1556
332.6934806829a400K80l11J55%O2O3%l12l73l1K18l11K80%TR3k18l1L11o2a774
$$ -1400 -1120 -1431 -1276 -1276 -1214 -1151 -1151 -1463 -1836 -1867 -1649 -1960 -1680 -1680 -1680 -1587 -1805 -1836 -1525 -1587 -1774
329.6668061088a525l1K18L42l11l1K49J24m35k80TL73J56R3k49r3R3J56o3a463
$$ -1525 -1556 -1338 -996 -1307 -1338 -1089 -965 -1400 -1680 -1960 -1587 -1431 -1338 -1587 -1680 -1587 -1431 -1494 -1463
326.9153933959a805L11R4k18J24Q41j25m36n60j55M04L43o3J25o2l43J56L42a307
$$ -1805 -1494 -1400 -1618 -1494 -653 -778 -1214 -1774 -1929 -1525 -1182 -1245 -1120 -1182 -1525 -1369 -1027 -1307
324.30146797a058l11J24o2l1k49l11N60%j25j86m36M36K18J86O3R3n91J24a960
$$ -1058 -1369 -1245 -1307 -1338 -1587 -1898 -1338 -1338 -1463 -1649 -2085 -1649 -1431 -1245 -1182 -1089 -1680 -1556 -1960
321.54996797b116m98P47L73r3o2%j56N91l73k18K80R4j56K80k80l11j25a618
$$ -2116 -2614 -1867 -1494 -1587 -1649 -1649 -1805 -1214 -1587 -1805 -1525 -1431 -1587 -1307 -1587 -1898 -2023 -1618
318.9360933959a463K18O3R3O2k18m35l1o3K49r3K80L11r3o23L74p47K49O22a089
$$ -1463 -1245 -1182 -1089 -1027 -1245 -1680 -1711 -1774 -1525 -1618 -1338 -1027 -1120 -1743 -1369 -2116 -1867 -1245 -1089
316.1846806829a960L73P16K18l12m66j87j25k49J25O2R4R3J87L1R3n60J56a743
$$ -1960 -1587 -871 -653 -965 -1431 -1618 -1743 -1992 -1867 -1805 -1711 -1618 -1431 -1400 -1307 -1867 -1711 -1743
313.5707061088i34l11j55j87Tr3M04R4J24J25j87l42M98r4k80R4L73J24k17a463
$$ -934 -1245 -1400 -1587 -1774 -1867 -1463 -1369 -1245 -1120 -1307 -1649 -1151 -1245 -1525 -1431 -1058 -934 -1151 -1463
310.8193061088a743K18L1m35M35L12n29j25Q09O2m04r4k17J24J25m67L1k49a960
$$ -1743 -1525 -1494 -1929 -1494 -1182 -1711 -1836 -1027 -965 -1369 -1463 -1680 -1556 -1431 -1898 -1867 -2116 -1960
308.2053933959a680J86j24%o2K80m98o2J86L1l11L1o2K18j56l1K80L74L1K80a494
$$ -1680 -1494 -1618 -1618 -1680 -1400 -1898 -1960 -1774 -1743 -2054 -2023 -2085 -1867 -2023 -2054 -1774 -1400 -1369 -1089 -1494
305.3163933959a805j87O54L1K18L11o2n60K18k49j56l73l2l73j56r3O54L73a494
$$ -1805 -1992 -1338 -1307 -1089 -778 -840 -1400 -1182 -1431 -1587 -1960 -1992 -2365 -2521 -2614 -1960 -1587 -1494
302.70246797a711K80R3K80k18J56J55l73k49l1k80R3%o2M04K49m66j87TO2a867
$$ -1711 -1431 -1338 -1058 -1276 -1120 -965 -1338 -1587 -1618 -1898 -1805 -1805 -1867 -1463 -1214 -1680 -1867 -2054 -1992 -1867
299.8133806829a867m05m66k18O22K80N91k17O2R3r3l11l74m66N91M04%l73b272
$$ -1867 -2272 -2738 -2956 -2334 -2054 -1463 -1680 -1618 -1525 -1618 -1929 -2303 -2769 -2178 -1774 -1774 -2147 -2272
297.1995061088b272M05O85L11l43k80j55l1o54K49J089J805j369j400n61k80c081
$$ -2272 -1867 -1182 -871 -1214 -1494 -1649 -1680 -2334 -2085 -996 809 -560 -1960 -2521 -2801 -3081
294.8608061088a743l73r02R64l11p16J25J182J56j25L43k80k18L1J56K80M35a711
$$ -1743 -2116 -3018 -2054 -2365 -3081 -2956 -1774 -1618 -1743 -1400 -1680 -1898 -1867 -1711 -1431 -996 -1711
292.38446797b116o2r4K18O85R3n29k18J56r3K80r4o2L1O2k17J86J25M67e91
$$ -2116 -2178 -2272 -2054 -1369 -1276 -1805 -2023 -1867 -1960 -1680 -1774 -1836 -1805 -1743 -1960 -1774 -1649 -1182 -591
289.63306797h71l11L73n91m36j56j24l42O84R4J86k80o2l11%k80M04M98a525
$$ -871 -1182 -809 -1400 -1836 -1992 -2116 -2458 -1774 -1680 -1494 -1774 -1836 -2147 -2147 -2427 -2023 -1525 -1525
287.0191061088a774%K49L74j25m04m67l42K80N29l74N60K49o2k80J24o2TM98a151
$$ -1774 -1774 -1525 -1151 -1276 -1680 -2147 -2489 -2209 -1680 -2054 -1494 -1245 -1307 -1587 -1463 -1525 -1587 -1089 -1151
284.2675933959a058j24%o3m66M04%L1K80J25L1k18p78o2n29l1o3r3J25P15a400
$$ -1058 -1182 -1182 -1245 -1711 -1307 -1307 -1276 -996 -871 -840 -1058 -1836 -1898 -2427 -2458 -2521 -2614 -2489 -1774 -1400
281.3785933959a307o2K49T%m36m04R3%m05K18J87O2k18TL2Q09k18L1K80m05a556
$$ -1307 -1369 -1120 -871 -871 -1307 -1711 -1618 -1618 -2023 -1805 -1618 -1556 -1774 -1992 -1960 -1151 -1369 -1338 -1058 -1463 -1556
278.35206797a556m04l2K49O23L1m36m67o2m35J55o2%M04r3o2M67J86O3l2a556
$$ -1556 -1960 -1992 -1743 -1120 -1089 -1525 -1992 -2054 -2489 -2334 -2396 -2396 -1992 -2085 -2147 -1680 -1494 -1431 -1463 -1556
275.4629806829a711J24j87l1J25R3o2O2k18l42k18O54K48j55l1l11k49J24a836
$$ -1711 -1587 -1774 -1805 -1680 -1587 -1649 -1587 -1805 -2147 -2365 -1711 -1463 -1618 -1649 -1960 -2209 -2085 -1836
272.8490061088a649k49o2K49L42l1%n29J24l1m98L42L12K49l74J25J55m98a960
$$ -1649 -1898 -1960 -1711 -1369 -1400 -1400 -1929 -1805 -1836 -2334 -1992 -1680 -1431 -1805 -1680 -1525 -2023 -1960
270.2351806829a867M36R3m05j24j25j24%O2R4L11R3k18J56O2n60l11M67N29b116
$$ -1867 -1431 -1338 -1743 -1867 -1992 -2116 -2116 -2054 -1960 -1649 -1556 -1774 -1618 -1556 -2116 -2427 -1960 -1431 -2116
267.4836806829b396N29J24l1J25O2j24l12J87M36k18o2L1o2L73k49p47J25a743
$$ -2396 -1867 -1743 -1774 -1649 -1587 -1711 -2023 -1836 -1400 -1618 -1680 -1649 -1711 -1338 -1587 -2334 -2209 -1743
264.8698061088a649m05K49r3k18J24J87TO2k49o2L1j24l2O3l74K49TL42l73a867
$$ -1649 -2054 -1805 -1898 -2116 -1992 -1805 -1618 -1556 -1805 -1867 -1836 -1960 -1992 -1929 -2303 -2054 -1805 -1463 -1836 -1867
261.9808061088b272k80M05N60K80k80k49L11l11k18j24M35j24K18k49%R3R4a556
$$ -2272 -2552 -2147 -1587 -1307 -1587 -1836 -1525 -1836 -2054 -2178 -1743 -1867 -1649 -1898 -1898 -1805 -1711 -1556
259.3668806829a836k18M05K49N29j56m04o85k49%J25O2L42l11J24O3J55L11a369
$$ -1836 -2054 -1649 -1400 -871 -1027 -1431 -2116 -2365 -2365 -2240 -2178 -1836 -2147 -2023 -1960 -1805 -1494 -1369
256.75306797a618r3r4J25j25K80l1r3l11J55K80L1l1J87j25k48K17j86n60a836
$$ -1618 -1711 -1805 -1680 -1805 -1525 -1556 -1649 -1960 -1805 -1525 -1494 -1525 -1338 -1463 -1711 -1494 -1680 -2240 -1836
254.00136797a338%J24J56k18k49%L11l1J56m05%TL1J56j56M05j56n60o2b023
$$ -1338 -1338 -1214 -1058 -1276 -1525 -1525 -1214 -1245 -1089 -1494 -1494 -1494 -1463 -1307 -1463 -1058 -1214 -1774 -1836 -2023
251.11196797a929J24K80k80j24L1M35L43k49l1K49m36m05k17J86K80K18a805
$$ -1929 -1805 -1525 -1805 -1929 -1898 -1463 -1120 -1369 -1400 -1151 -1587 -1992 -2209 -2023 -1743 -1525 -1805
248.6353806829b240J55M98k18j55l2R4j25K80j86l43r3P16J55R4n60J55O2a649
$$ -2240 -2085 -1587 -1805 -1960 -1992 -1898 -2023 -1743 -1929 -2272 -2365 -1649 -1494 -1400 -1960 -1805 -1743 -1649
246.0212061088b054J56%M98K49TJ55j55m36l11o2J24o2l11k18J86j55L42J56a711
$$ -2054 -1898 -1898 -1400 -1151 -902 -747 -902 -1338 -1649 -1711 -1587 -1649 -1960 -2178 -1992 -2147 -1805 -1649 -1711
243.2693806829a680j56l73L42K49L1k80l1R3P78o2K49%l74O3K49m36L1m36a711
$$ -1680 -1836 -2209 -1867 -1618 -1587 -1867 -1898 -1805 -1027 -1089 -840 -840 -1214 -1151 -902 -1338 -1307 -1743 -1711
240.5176188218b054L74J86K49k49K49J56%k80O2k80j24k49r4l73j25J87R3b334
$$ -2054 -1680 -1494 -1245 -1494 -1245 -1089 -1089 -1369 -1307 -1587 -1711 -1960 -2054 -2427 -2552 -2365 -2272 -2334
237.9034806829b116J56j25m67R4K49M98K17K18p47O3P78O2n29o2M04L1%O2a338
$$ -2116 -1960 -2085 -2552 -2458 -2209 -1711 -1494 -1276 -2023 -1960 -1182 -1120 -1649 -1711 -1307 -1276 -1276 -1214 -1338
235.15166797a151K80m98l11M04r3j25j24j56j86J86L1M98N92l74m04J86a431
$$ -1151 -871 -1369 -1680 -1276 -1369 -1494 -1618 -1774 -1960 -1774 -1743 -1245 -653 -1027 -1431 -1245 -1431
232.6750806829a680k18L1TM05Q09L42o22k49m05%K80K18m36r3l11J87l43N29a058
$$ -1680 -1898 -1867 -1836 -1431 -622 -280 -902 -1151 -1556 -1556 -1276 -1058 -1494 -1587 -1898 -1711 -2054 -1525 -1058
229.92336797a120k80k49K80J24m66K17J87m98J25M04j87L2k49r4l42J24a805
$$ -1120 -1400 -1649 -1369 -1245 -1711 -1494 -1307 -1805 -1680 -1276 -1463 -1431 -1680 -1774 -2116 -1992 -1805
227.4467806829a618m36J87L1%M36L73j87k17l74%N29l1l73J24%K49r3j25m98a618
$$ -1618 -2054 -1867 -1836 -1836 -1400 -1027 -1214 -1431 -1805 -1805 -1276 -1307 -1680 -1556 -1556 -1307 -1400 -1525 -2023 -1618
224.5573806829a400k80l43j24j87J25R3L73j86M66K49k80r3J87R3%J87L1j25a151
$$ -1400 -1680 -2023 -2147 -2334 -2209 -2116 -1743 -1929 -1463 -1214 -1494 -1587 -1400 -1307 -1307 -1120 -1089 -1214 -1151
221.8056188218a618K18j87k49R3j55l11O2%M98k49k18L1K18l42J55j55M35a182
$$ -1618 -1400 -1587 -1836 -1743 -1898 -2209 -2147 -2147 -1649 -1898 -2116 -2085 -1867 -2209 -2054 -2209 -1774 -1182
219.1914806829a214L43k18o2J86n91j24j87l1K49k18j56M05j25l1o2R3j24a805
$$ -1214 -871 -1089 -1151 -965 -1556 -1680 -1867 -1898 -1649 -1867 -2023 -1618 -1743 -1774 -1836 -1743 -1867 -1805
216.5773061088a929j87k80K49J24K49o2j24j87J55J87L1l73j56L1K49%l1J56a867
$$ -1929 -2116 -2396 -2147 -2023 -1774 -1836 -1960 -2147 -1992 -1805 -1774 -2147 -2303 -2272 -2023 -2023 -2054 -1898 -1867
213.8254806829b676%J55R34O2K49R4k18q72K80J56L42r3Tr4l42k80K18j87b614
$$ -2676 -2676 -2521 -1587 -1525 -1276 -1182 -1400 -2272 -1992 -1836 -1494 -1587 -1680 -1774 -2116 -2396 -2178 -2365 -2614
211.07366797b521k17J55N29M05n60j56M36l1N91J87j87l74j55o2O2o2L11a711
$$ -2521 -2738 -2583 -2054 -1649 -2209 -2365 -1929 -1960 -1369 -1182 -1369 -1743 -1898 -1960 -1898 -1960 -1649 -1711
208.4594933959a431l12k49k80J87o2K49%r4%N61J24O2k80o2k80o2k49TJ24b458
$$ -1431 -1743 -1992 -2272 -2085 -2147 -1898 -1898 -1992 -1992 -1431 -1307 -1245 -1525 -1587 -1867 -1929 -2178 -2427 -2303 -2458
205.5701933959b614N60K18L11J25j87l42R3J87l1k80J24%M05R3k80m98j24b334
$$ -2614 -2054 -1836 -1525 -1400 -1587 -1929 -1836 -1649 -1680 -1960 -1836 -1836 -1431 -1338 -1618 -2116 -2240 -2334
202.95596797b240L42K49L73n60k49L1O2M67l1l11l73K48%o2r3M98m67j87b303
$$ -2240 -1898 -1649 -1276 -1836 -2085 -2054 -1992 -1525 -1556 -1867 -2240 -1992 -1992 -2054 -2147 -1649 -2116 -2303 -2303
200.2042061088b178j56K80%j86J55M05%o3%L43O2%j56K18l42k18j87J56j56a743
$$ -2178 -2334 -2054 -2054 -2240 -2085 -1680 -1680 -1743 -1743 -1400 -1338 -1338 -1494 -1276 -1618 -1836 -2023 -1867 -2023 -1743
197.3148933959a307l11n91l12j86R3L11L1m66P15J87K80l73j87%R3j86k49b365
$$ -1307 -1618 -2209 -2521 -2707 -2614 -2303 -2272 -2738 -2023 -1836 -1556 -1929 -2116 -2116 -2023 -2209 -2458 -2365
194.70066797b272m04r3O84J25n29J55J87O2J87TO2K80k18%n91o2j56K49a929
$$ -2272 -2676 -2769 -2085 -1960 -2489 -2334 -2147 -2085 -1898 -1711 -1649 -1369 -1587 -1587 -2178 -2240 -2396 -2147 -1929
191.9489061088b489l43M98N60J56m67M67J55k48j56K49L42o2l1k18TJ25l12a929
$$ -2489 -2832 -2334 -1774 -1618 -2085 -1618 -1463 -1711 -1867 -1618 -1276 -1338 -1369 -1587 -1805 -1680 -1992 -1929
189.3347806829b085L1r3N29o2k80j56R3o2R3R4L11r3K49o54l11K18J24k80b178
$$ -2085 -2054 -2147 -1618 -1680 -1960 -2116 -2023 -2085 -1992 -1898 -1587 -1680 -1431 -2085 -2396 -2178 -2054 -2334 -2178
186.58296797b334K49m67J87K80K49k18L43o3R4j25k18k49M67O2m97j87j56b209
$$ -2334 -2085 -2552 -2365 -2085 -1836 -2054 -1711 -1774 -1680 -1805 -2023 -2272 -1805 -1743 -2240 -2427 -2583 -2209
183.9687933959a680%j56r3J86O3K17m66o3l1O85j25n60R4R95k17n29l74R4b303
$$ -1680 -1680 -1836 -1929 -1743 -1680 -1463 -1929 -1992 -2023 -1338 -1463 -2023 -1929 -934 -1151 -1680 -2054 -1960 -2303
181.21696797a929L1j87j24M66k49l11j24K18K17j24j56L74M04n60o2k80b738
$$ -1929 -1898 -2085 -2209 -1743 -1992 -2303 -2427 -2209 -1992 -2116 -2272 -1898 -1494 -2054 -2116 -2396 -2738
178.7403806829b489N91K49j56j55K17L2R3j87o2O2j87%j24o2J24L74k18%j87b085
$$ -2489 -1898 -1649 -1805 -1960 -1743 -1711 -1618 -1805 -1867 -1805 -1992 -1992 -2116 -2178 -2054 -1680 -1898 -1898 -2085 -2085
175.85106797a680J55l11R3K18r3Tl2m35N60j87l73k49l1M98K80m05j87o2b521
$$ -1680 -1525 -1836 -1743 -1525 -1618 -1711 -1743 -2178 -1618 -1805 -2178 -2427 -2458 -1960 -1680 -2085 -2272 -2334 -2521
173.0993061088b085K49k80%j56J25L73L11l73L1J56%l74o2%M67J24k49o2Ul1b085
$$ -2085 -1836 -2116 -2116 -2272 -2147 -1774 -1463 -1836 -1805 -1649 -1649 -2023 -2085 -2085 -1618 -1494 -1743 -1805 -1867 -1929 -1960 -2085
169.9347806829b365j87r3O2M67L1K80k18K49R4J24j55m05L1N60K80p47l42b054
$$ -2365 -2552 -2645 -2583 -2116 -2085 -1805 -2023 -1774 -1680 -1556 -1711 -2116 -2085 -1525 -1245 -1992 -2334 -2054
167.3206061088b427j56M05J55k80K49K80J25m67k80k49L1M05M66N92r4m98a711
$$ -2427 -2583 -2178 -2023 -2303 -2054 -1774 -1649 -2116 -2396 -2645 -2614 -2209 -1743 -1151 -1245 -1743 -1711
164.84396797a992r3L11r3m36M05K49l74%L12J24m05%L2K17J56J24o2m04a898
$$ -1992 -2085 -1774 -1867 -2303 -1898 -1649 -2023 -2023 -1711 -1587 -1992 -1992 -1960 -1743 -1587 -1463 -1525 -1929 -1898
162.0922061088a774K18j55K80n29J24l1K49%l42o3O85k80r3l12J87J25J55a556
$$ -1774 -1556 -1711 -1431 -1960 -1836 -1867 -1618 -1618 -1960 -2023 -1338 -1618 -1711 -2023 -1836 -1711 -1556 -1556
159.47806797a307L1j24o23%j24L73j55r4l11J56j87L11M98m04o23Q72j56b147
$$ -1307 -1276 -1400 -2023 -2023 -2147 -1774 -1929 -2023 -2334 -2178 -2365 -2054 -1556 -1960 -2583 -1711 -1867 -2147
156.8638933959b116O2M67M05m98r96J87J24J87j25o2M98l11L42j87L74L1k49b147
$$ -2116 -2054 -1587 -1182 -1680 -2676 -2489 -2365 -2178 -2303 -2365 -1867 -2178 -1836 -2023 -1649 -1618 -1867 -2147
154.2496188218b147j87J56L42J56k80l74J25O2J87O84o2l1o23K18O3l74k18b272
$$ -2147 -2334 -2178 -1836 -1680 -1960 -2334 -2209 -2147 -1960 -1276 -1338 -1369 -1992 -1774 -1711 -2085 -2303 -2272
151.6354806829b863J25r4L74R3TK18L11o2m98J56K80l11j87o2M04L1L43L1b272
$$ -2863 -2738 -2832 -2458 -2365 -2272 -2054 -1743 -1805 -2303 -2147 -1867 -2178 -2365 -2427 -2023 -1992 -1649 -1618 -2272
148.88366797b147O84l42T%R3K18%l11%J55o2M05K18n92m35M04L1n60l11b303
$$ -2147 -1463 -1805 -2147 -2147 -2054 -1836 -1836 -2147 -2147 -1992 -2054 -1649 -1431 -2023 -2458 -2054 -2023 -2583 -2894 -2303
145.99436797b054L1K18l73J55J87L1k49l73R3r3r4J25M67J55r3m36O3m05b521
$$ -2054 -2023 -1805 -2178 -2023 -1836 -1805 -2054 -2427 -2334 -2427 -2521 -2396 -1929 -1774 -1867 -2303 -2240 -2645 -2521
143.2426061088a867m05R4m36L1J56J55k49M98K80l73o85k17L73Tj55j56M36a743
$$ -1867 -2272 -2178 -2614 -2583 -2427 -2272 -2521 -2023 -1743 -2116 -2801 -3018 -2645 -2272 -2427 -2583 -2147 -1743
140.6283806829b209K80j56J25J24j24j56R3l1N60j86j25r3n60j87K18R3M36a992
$$ -2209 -1929 -2085 -1960 -1836 -1960 -2116 -2023 -2054 -1494 -1680 -1805 -1898 -2458 -2645 -2427 -2334 -1898 -1992
138.0142061088b209j25L42L74j87l42%L42K80r3j56k18K49l1o84j25K49R4a898
$$ -2209 -2334 -1992 -1618 -1805 -2147 -2147 -1805 -1525 -1618 -1774 -1992 -1743 -1774 -2458 -2583 -2334 -2240 -1898
135.40006797a836L1j24j25L1O3j56%l1J87l2L2l43%k49J87Q09K49r3k49a649
$$ -1836 -1805 -1929 -2054 -2023 -1960 -2116 -2116 -2147 -1960 -1992 -1960 -2303 -2303 -2552 -2365 -1556 -1307 -1400 -1649 -1649
132.51066797a276l73L1j87n29j87R4L1K49k49k18l1L73M67k80o84K48K49b116
$$ -1276 -1649 -1618 -1805 -2334 -2521 -2427 -2396 -2147 -2396 -2614 -2645 -2272 -1805 -2085 -2769 -2521 -2272 -2116
129.8964933959b521J87TO2L42J56O53O3k18m67m04%J24j24n29J55K18l1K49a992
$$ -2521 -2334 -2147 -2085 -1743 -1587 -934 -871 -1089 -1556 -1960 -1960 -1836 -1960 -2489 -2334 -2116 -2147 -1898 -1992
127.1446806829a867l1m67L73K49K18k18p15L1L42O2N29j86K80O2o54j55K49b178
$$ -1867 -1898 -2365 -1992 -1743 -1525 -1743 -2458 -2427 -2085 -2023 -1494 -1680 -1400 -1338 -1992 -2147 -1898 -2178
124.5305061088b178l43J56r3o3l1J25K18O2K18P15L2l12L1K81o23j24J55l73a805
$$ -2178 -2521 -2365 -2458 -2521 -2552 -2427 -2209 -2147 -1929 -1214 -1182 -1494 -1463 -1182 -1805 -1929 -1774 -2147 -1805
121.7787806829a431k49L1l11r4r3l1o2o3r3J56L42j25O3k18J24N91o22j55b334
$$ -1431 -1680 -1649 -1960 -2054 -2147 -2178 -2240 -2303 -2396 -2240 -1898 -2023 -1960 -2178 -2054 -1463 -2085 -2240 -2334
119.02696797b272K18L74p78L1M98J55j24k18J24J56k80J56K80j87o2l1m67b147
$$ -2272 -2054 -1680 -2458 -2427 -1929 -1774 -1898 -2116 -1992 -1836 -2116 -1960 -1680 -1867 -1929 -1960 -2427 -2147
116.4127933959b272K18R4L73n29r3j56L1J25j56J25N91J86J25o85m35O2J56b147
$$ -2272 -2054 -1960 -1587 -2116 -2209 -2365 -2334 -2209 -2365 -2240 -1649 -1463 -1338 -2023 -2458 -2396 -2240 -2147
113.7986188218b085k49r3L1J87J24L74J24r3R3%K18R3m35%K17L1j24n29l73a867
$$ -2085 -2334 -2427 -2396 -2209 -2085 -1711 -1587 -1680 -1587 -1587 -1369 -1276 -1711 -1711 -1494 -1463 -1587 -2116 -2489 -1867
110.9093061088a680O2k80j25l1k49j55K49o3L2K48L43O2J56k49m67%L11J56b116
$$ -1680 -1618 -1898 -2023 -2054 -2303 -2458 -2209 -2272 -2240 -1992 -1649 -1587 -1431 -1680 -2147 -2147 -1836 -1680 -2116
108.1574933959b489O2L42j24k80L42K49r4J87l11o2j25o2K49l73R3O2K49o84b863
$$ -2489 -2427 -2085 -2209 -2489 -2147 -1898 -1992 -1805 -2116 -2178 -2303 -2365 -2116 -2489 -2396 -2334 -2085 -2769 -2863
105.4057806829b303L74R3l1l73K17J25L1r3m36J24r3K18L42r3L42l42O2r3a898
$$ -2303 -1929 -1836 -1867 -2240 -2023 -1898 -1867 -1960 -2396 -2272 -2365 -2147 -1805 -1898 -1556 -1898 -1836 -1929 -1898
102.65396797a992L74l1L11l11k49J24K18J87k80l43L12l12%o2K18k80o2a649
$$ -1992 -1618 -1649 -1338 -1649 -1898 -1774 -1556 -1369 -1649 -1992 -1680 -1992 -1992 -2054 -1836 -2116 -2178 -1649
100.0397933959a027j24m36o2j25n91J56M98r4n60j24M04M05j25n91j56K49a992
$$ -1027 -1151 -1587 -1649 -1774 -2365 -2209 -1711 -1805 -2365 -2489 -2085 -1680 -1805 -2396 -2552 -2303 -1992
97.5632061088a680o3%k80m98R4L1j87J25o3O3K80L73r3K80k18m04J86N29a649
$$ -1680 -1743 -1743 -2023 -2521 -2427 -2396 -2583 -2458 -2521 -2458 -2178 -1805 -1898 -1618 -1836 -2240 -2054 -1525 -1649
94.8114806829a898l42K17k49j24L1O2R4J86m66o3R4o3k17N29M35o84l74n29c081
$$ -1898 -2240 -2023 -2272 -2396 -2365 -2303 -2209 -2023 -2489 -2552 -2458 -2521 -2738 -2209 -1774 -2458 -2832 -3361 -3081
92.0596188218b209N29J86J25j25k17l74o2Tk49J55L1M05r3M35L43j87l42a743
$$ -2209 -1680 -1494 -1369 -1494 -1711 -2085 -2147 -2209 -2458 -2303 -2272 -1867 -1960 -1525 -1182 -1369 -1711 -1743
89.4454806829b240m98J24K80TN29o2m05k48l2K18%r3K80l11m05j86M35O2a400
$$ -2240 -2738 -2614 -2334 -2054 -1525 -1587 -1992 -2240 -2272 -2054 -2054 -2147 -1867 -2178 -2583 -2769 -2334 -2272 -1400
86.69366797a182m05m67m35K49K80k18r4l1k18J25M67L1J55K18J25n60k18a960
$$ -1182 -1587 -2054 -2489 -2240 -1960 -2178 -2272 -2303 -2521 -2396 -1929 -1898 -1743 -1525 -1400 -1960 -2178 -1960
84.0794933959b085m67K18L42L74j56j24M04m98j55o2M35M36m98M36J86n29a867
$$ -2085 -2552 -2334 -1992 -1618 -1774 -1898 -1494 -1992 -2147 -2209 -1774 -1338 -1836 -1400 -1214 -1743 -1867
81.6029061088a680j25L11%m66J24j24l12o2L74%l43K80M05j87l42K80o2l1a960
$$ -1680 -1805 -1494 -1494 -1960 -1836 -1960 -2272 -2334 -1960 -1960 -2303 -2023 -1618 -1805 -2147 -1867 -1929 -1960 -1960
78.8511933959a556o2l1k18j56J87j24l2m04J56M35K80l11r3L1j25k49%L43b023
$$ -1556 -1618 -1649 -1867 -2023 -1836 -1960 -1992 -2396 -2240 -1805 -1525 -1836 -1929 -1898 -2023 -2272 -2272 -1929 -2023
76.0993806829a960J24m04j56o2J55J56m05L43K17M05%L1m98j55K17R4o2L1a992
$$ -1960 -1836 -2240 -2396 -2458 -2303 -2147 -2552 -2209 -1992 -1587 -1587 -1556 -2054 -2209 -1992 -1898 -1960 -1929 -1992
73.3476188218b116%k49j87M98L1M67m98j24R3k80r3L42O2K18O2L74J24m35a680
$$ -2116 -2116 -2365 -2552 -2054 -2023 -1556 -2054 -2178 -2085 -2365 -2458 -2116 -2054 -1836 -1774 -1400 -1276 -1711 -1680
70.5958933959a805o2J24r3L73l42k80K18r3J55L42L12O2k80o2j56M36k80b116
$$ -1805 -1867 -1743 -1836 -1463 -1805 -2085 -1867 -1960 -1805 -1463 -1151 -1089 -1369 -1431 -1587 -1151 -1431 -2116
67.98166797b458r4M36K18l11J55J56l11K80O2J24j86r4o2TJ24R4J55%L1b209
$$ -2458 -2552 -2116 -1898 -2209 -2054 -1898 -2209 -1929 -1867 -1743 -1929 -2023 -2085 -2147 -2023 -1929 -1774 -1774 -1743 -2209
65.09226797b303L1L43%R3k18J56K18o3j55l42%l2O3N91L73J25n29l1%o3a743
$$ -2303 -2272 -1929 -1929 -1836 -2054 -1898 -1680 -1743 -1898 -2240 -2240 -2272 -2209 -1618 -1245 -1120 -1649 -1680 -1680 -1743 -1743
62.06536797a743m04J87r4r3J87N60L73j24r4J25m36l73l74j24%M35l1%a587
$$ -1743 -2147 -1960 -2054 -2147 -1960 -1400 -1027 -1151 -1245 -1120 -1556 -1929 -2303 -2427 -2427 -1992 -2023 -2023 -1587
59.3136061088a711o3L11J25l11l43k17j25L11j24M67j87l11j25J87l1L42a836
$$ -1711 -1774 -1463 -1338 -1649 -1992 -2209 -2334 -2023 -2147 -1680 -1867 -2178 -2303 -2116 -2147 -1805 -1836
56.83696797a711L42%L1J24o2m35l12l11j55P46K49J56r3r4k80R4r4j87b085
$$ -1711 -1369 -1369 -1338 -1214 -1276 -1711 -2023 -2334 -2489 -1743 -1494 -1338 -1431 -1525 -1805 -1711 -1805 -1992 -2085
54.0852061088a805R4o3J87j24R3L1TJ56n60n61%M36m98K18L1K80J87l1O2a556
$$ -1805 -1711 -1774 -1587 -1711 -1618 -1587 -1556 -1400 -1960 -2521 -2521 -2085 -2583 -2365 -2334 -2054 -1867 -1898 -1836 -1556
51.1958933959a867L42R4j56m05J25J24j86o23J56L42R4J86N29j24l42m67b303
$$ -1867 -1525 -1431 -1587 -1992 -1867 -1743 -1929 -2552 -2396 -2054 -1960 -1774 -1245 -1369 -1711 -2178 -2303
48.7193061088b178L42R3%m04j56j55O2k18O2R4L11R3m35j25N29J56l43o2b085
$$ -2178 -1836 -1743 -1743 -2147 -2303 -2458 -2396 -2614 -2552 -2458 -2147 -2054 -2489 -2614 -2085 -1929 -2272 -2334 -2085
45.9674933959a805R4j25J25j56j87K80m35l1O84L74%n29J86m04O2K49TO2a587
$$ -1805 -1711 -1836 -1711 -1867 -2054 -1774 -2209 -2240 -1556 -1182 -1182 -1711 -1525 -1929 -1867 -1618 -1369 -1307 -1587
43.2157806829a618K18J24m35k49L1T%TJ87N91l43r3j24L1L42J56l74j24o2b303
$$ -1618 -1400 -1276 -1711 -1960 -1929 -1898 -1898 -1898 -1711 -1120 -1463 -1556 -1680 -1649 -1307 -1151 -1525 -1649 -1711 -2303
40.3263806829b085J87L1M98r4m04L1j24l43J87L11l1J25l2r3R3k17K17L2a805
$$ -2085 -1898 -1867 -1369 -1463 -1867 -1836 -1960 -2303 -2116 -1805 -1836 -1711 -1743 -1836 -1743 -1960 -1743 -1711 -1805
37.5746188218b054k49L11j55o2j56%K49J87k18l1K18R3l1j87r3J24n60M36a400
$$ -2054 -2303 -1992 -2147 -2209 -2365 -2365 -2116 -1929 -2147 -2178 -1960 -1867 -1898 -2085 -2178 -2054 -2614 -2178 -1400
34.8228933959a369k18J24J56k18m35j25k18j24l42K80r4M36R3o2J87L42k80b178
$$ -1369 -1587 -1463 -1307 -1525 -1960 -2085 -2303 -2427 -2769 -2489 -2583 -2147 -2054 -2116 -1929 -1587 -1867 -2178
32.2086188218a805L11l42k49L1k80O2R4l1L11K49k18k49r3M04j24n29K18b116
$$ -1805 -1494 -1836 -2085 -2054 -2334 -2272 -2178 -2209 -1898 -1649 -1867 -2116 -2209 -1805 -1929 -2458 -2240 -2116
29.5944933959b147O2m04l12J25K80o2l43R4K49%n60J55K18%L73L2O2r4j55b396
$$ -2147 -2085 -2489 -2801 -2676 -2396 -2458 -2801 -2707 -2458 -2458 -3018 -2863 -2645 -2645 -2272 -2240 -2178 -2272 -2427 -2396
26.7051933959b240K17M36r3n60J24r3K17M67j86m36J24l42K49L73R4m67l1a929
$$ -2240 -2023 -1587 -1680 -2240 -2116 -2209 -1992 -1525 -1711 -2147 -2023 -2365 -2116 -1743 -1649 -2116 -2147 -1929
24.09106797b023o2M67%k49l11L1k18TM98O2j86J55L1Tl1J25N60m05k49b303
$$ -2023 -2085 -1618 -1618 -1867 -2178 -2147 -2365 -2583 -2085 -2023 -2209 -2054 -2023 -1992 -2023 -1898 -1338 -1743 -1992 -2303
21.20176797b396L73l11J56r4K49J56O2j87J87J25%j25r3l42o3N29l42l11b178
$$ -2396 -2023 -2334 -2178 -2272 -2023 -1867 -1805 -1992 -1805 -1680 -1680 -1805 -1898 -2240 -2303 -1774 -2116 -2427 -2178
18.44996797b303L43r4m67K18Tk80K18r3l2m97M97J87K18L73M67l73l74a992
$$ -2303 -1960 -2054 -2521 -2303 -2085 -2365 -2147 -2240 -2272 -2769 -2272 -2085 -1867 -1494 -1027 -1400 -1774 -1992
15.8358933959b054l1K18r3J24J56L1J55k80m04J55L43k80M66K49%l1o22j25a400
$$ -2054 -2085 -1867 -1960 -1836 -1680 -1649 -1494 -1774 -2178 -2023 -1680 -1960 -1494 -1245 -1245 -1276 -1898 -2023 -1400
13.0840806829a369k80l43j55R3J25r4j86K80L73M67m36k80n29k80r3M04L11a369
$$ -1369 -1649 -1992 -2147 -2054 -1929 -2023 -2209 -1929 -1556 -1089 -1525 -1805 -2334 -2614 -2707 -2303 -1992 -1369
10.4699061088a338l42M35j24O2l1o2j87o53l12M36J87R3K49J56k18j87l42a898
$$ -1338 -1680 -1245 -1369 -1307 -1338 -1400 -1587 -2240 -2552 -2116 -1929 -1836 -1587 -1431 -1649 -1836 -2178 -1898
7.8557806829a960J55N60l73O2K18K49n60o85o2O53L12k18O2Tl73o2k80L11a556
$$ -1960 -1805 -1245 -1618 -1556 -1338 -1089 -1649 -2334 -2396 -1743 -1431 -1649 -1587 -1525 -1898 -1960 -2240 -1929 -1556
5.10406797a649o23n91K18P47J87J55l42J55L2m98K80j25L1K80j55%J87a618
$$ -1649 -2272 -2863 -2645 -1898 -1711 -1556 -1898 -1743 -1711 -2209 -1929 -2054 -2023 -1743 -1898 -1898 -1711 -1618
2.4898933959a151r4%O3J55R3j55o2r4L43J55M36k18l11J87O22L1M67R64A992
$$ -1151 -1245 -1245 -1182 -1027 -934 -1089 -1151 -1245 -902 -747 -311 -529 -840 -653 -31 0 467 1431 1992
-0.2618193171B489J712J182J027L43R3O2m98To84j152j400j089l73j090o22h71
$$ 2489 4201 5383 6410 6753 6846 6908 6410 5912 5228 4076 2676 1587 1214 124 -498 -871
-2.6008066041h40L42j87j55O2k49k80j87J56L1m67l1O54o3j24j56O3j56o2a774
$$ -840 -498 -685 -840 -778 -1027 -1307 -1494 -1338 -1307 -1774 -1805 -1151 -1214 -1338 -1494 -1431 -1587 -1649 -1774
-5.3526193171a431o23O2N61O2m36J25N29K49l43k18m97R3K80J56l43J87k80a960
$$ -1431 -2054 -1992 -1431 -1369 -1805 -1680 -1151 -902 -1245 -1463 -1960 -1867 -1587 -1431 -1774 -1587 -1867 -1960
-7.9667938912b054K18M05J24J25m05O2L74L1k18k80M67m67l11j56l11J87a774
$$ -2054 -1836 -1431 -1307 -1182 -1587 -1525 -1151 -1120 -1338 -1618 -1151 -1618 -1929 -2085 -2396 -2209 -1774
-10.44333203a805j55L42k80j25j86O2K49O2J25l74K49m67j55M35K80J56a214
$$ -1805 -1960 -1618 -1898 -2023 -2209 -2147 -1898 -1836 -1711 -2085 -1836 -2303 -2458 -2023 -1743 -1587 -1214
-12.9199193171a307n91k80M35j55k18k49o2K80J87l2k80j24N91k80R3M36K80a245
$$ -1307 -1898 -2178 -1743 -1898 -2116 -2365 -2427 -2147 -1960 -1992 -2272 -2396 -1805 -2085 -1992 -1556 -1276 -1245
-15.5340938912a245o2l1L1l1l11K18J24k18%j86l2L12l74m35m05K49K18R3a960
$$ -1245 -1307 -1338 -1307 -1338 -1649 -1431 -1307 -1525 -1525 -1711 -1743 -1431 -1805 -2240 -2645 -2396 -2178 -2085 -1960
-18.2858066041a836l11J55k17M66L74j87%L1n60j24j25O2L12k80r4K49O2%a649
$$ -1836 -2147 -1992 -2209 -1743 -1369 -1556 -1556 -1525 -2085 -2209 -2334 -2272 -1960 -2240 -2334 -2085 -2023 -2023 -1649
-21.0375193171a680k49j56m67n29K49K18o2TO22J87l74K49Q09k80l73l11m98b676
$$ -1680 -1929 -2085 -2552 -3081 -2832 -2614 -2676 -2738 -2116 -1929 -2303 -2054 -1245 -1525 -1898 -2209 -2707 -2676
-23.6516938912b832K80O23K80j87k49l73j25%l1N91O3l74%N29O2l11O2M67a805
$$ -2832 -2552 -1929 -1649 -1836 -2085 -2458 -2583 -2583 -2614 -2023 -1960 -2334 -2334 -1805 -1743 -2054 -1992 -1525 -1805
-26.4033938912b054K49k80l42j87N29k80j56L74J55J25k80R3J56m67J25k49b521
$$ -2054 -1805 -2085 -2427 -2614 -2085 -2365 -2521 -2147 -1992 -1867 -2147 -2054 -1898 -2365 -2240 -2489 -2521
-28.87993203b023R4R3j56l73l1r3L42%K49L73j86m98k80J24b116
$$ -2023 -1929 -1836 -1992 -2365 -2396 -2489 -2147 -2147 -1898 -1525 -1711 -2209 -2489 -2365 -2116
-31.0813811782b521  $$checkpoint
##END= $$ end of H NMR
##TITLE= Aspirin, 2-(acetyloxy) benzoic acid
##JCAMP-DX= 5.01
##DATA TYPE= NMR SPECTRUM
##DATA CLASS= XYDATA
##ORIGIN= Dept of Chemistry, UWI, Mona, JAMAICA
##OWNER= public domain
##BLOCK ID=2
##LONGDATE= 2002/05/22 13:35:02
##SPECTROMETERDATASYSTEM= BRUKER AVANCE 500 MHz
##$MODELS=
<Models>
<ModelData id="aspirin" type="MOL">
aspirin (2-(acetoxyl)benzoic acid)
RLACD/Labs0520021140  
http://wwwchem.uwimona.edu.jm/spectra
 21 21  0  0  0  0  0  0  0  0  0 V2000
   -0.8665    0.8024    0.0000 C   0  0  0  0  0  0  0  0  0  0  0  0
    0.4499    0.2908    0.0000 C   0  0  0  0  0  0  0  0  0  0  0  0
    1.5489    1.1509    0.0000 C   0  0  0  0  0  0  0  0  0  0  0  0
    1.3462    2.5308    0.0000 C   0  0  0  0  0  0  0  0  0  0  0  0
    0.0581    3.0583    0.0000 C   0  0  0  0  0  0  0  0  0  0  0  0
   -1.0298    2.1931    0.0000 C   0  0  0  0  0  0  0  0  0  0  0  0
   -2.1591    0.0020    0.0000 C   0  0  0  0  0  0  0  0  0  0  0  0
    1.5412   -2.0441    0.0000 C   0  0  0  0  0  0  0  0  0  0  0  0
    2.9836   -1.6136    0.0000 C   0  0  0  0  0  0  0  0  0  0  0  0
    0.5219   -1.1013    0.0000 O   0  0  0  0  0  0  0  0  0  0  0  0
   -3.2313    0.5672    0.0000 O   0  0  0  0  0  0  0  0  0  0  0  0
   -2.0988   -1.3365    0.0000 O   0  0  0  0  0  0  0  0  0  0  0  0
    1.1799   -3.1900    0.0000 O   0  0  0  0  0  0  0  0  0  0  0  0
    2.5593    0.7752    0.0000 H   0  0  0  0  0  0  0  0  0  0  0  0
    2.2106    3.1880    0.0000 H   0  0  0  0  0  0  0  0  0  0  0  0
   -0.0976    4.1321    0.0000 H   0  0  0  0  0  0  0  0  0  0  0  0
   -2.0482    2.5645    0.0000 H   0  0  0  0  0  0  0  0  0  0  0  0
   -1.1721   -1.6380    0.0000 H   0  0  0  0  0  0  0  0  0  0  0  0
    3.5898   -2.5187    0.0000 H   0  0  0  0  0  0  0  0  0  0  0  0
    3.2178   -1.0204   -0.8881 H   0  0  0  0  0  0  0  0  0  0  0  0
    3.2178   -1.0204    0.8881 H   0  0  0  0  0  0  0  0  0  0  0  0
  1  2  4  0  0  0  0
  1  6  4  0  0  0  0
  1  7  1  0  0  0  0
  2 10  1  0  0  0  0
  2  3  4  0  0  0  0
  3 14  1  0  0  0  0
  3  4  4  0  0  0  0
  4 15  1  0  0  0  0
  4  5  4  0  0  0  0
  5  6  4  0  0  0  0
  5 16  1  0  0  0  0
  6 17  1  0  0  0  0
  7 12  4  0  0  0  0
  7 11  4  0  0  0  0
  8  9  1  0  0  0  0
  8 10  1  0  0  0  0
  8 13  2  0  0  0  0
  9 21  1  0  0  0  0
  9 20  1  0  0  0  0
  9 19  1  0  0  0  0
 12 18  1  0  0  0  0
M  END
</ModelData>
</Models>
##$PEAKS=
<Peaks type="13CNMR" xUnits="ppm" yUnits="arbitrary units" >
<PeakData id="1" title="C at 21" peakShape="singlet" model="aspirin" atoms="9"  xMax="23" xMin="19"  yMax="10000" yMin="0" />
<PeakData id="2" title="C ~124" peakShape="singlet" model="aspirin" atoms="1"  xMax="124.9" xMin="124"  yMax="10000" yMin="0" />
<PeakData id="3" title="C ~125" peakShape="singlet" model="aspirin" atoms="3"  xMax="125.9" xMin="125"  yMax="10000" yMin="0" />
<PeakData id="4" title="C ~127" peakShape="singlet" model="aspirin" atoms="5"  xMax="128" xMin="126.1"  yMax="10000" yMin="0" />
<PeakData id="5" title="C ~132" peakShape="singlet" model="aspirin" atoms="6"  xMax="133.5" xMin="130"  yMax="10000" yMin="0" />
<PeakData id="6" title="C ~134" peakShape="singlet" model="aspirin" atoms="4"  xMax="136" xMin="134"  yMax="10000" yMin="0" />
<PeakData id="7" title="C ~152" peakShape="singlet" model="aspirin" atoms="2"  xMax="153" xMin="151"  yMax="10000" yMin="0" />
<PeakData id="8" title="C ~167" peakShape="singlet" model="aspirin" atoms="8"  xMax="169" xMin="166"  yMax="10000" yMin="0" />
<PeakData id="9" title="C ~171" peakShape="singlet" model="aspirin" atoms="7"  xMax="173" xMin="170"  yMax="10000" yMin="0" />
</Peaks>
##.OBSERVEFREQUENCY= 125.758
##.OBSERVENUCLEUS= ^13C
##.ACQUISITIONTIME= 1.003
##.ACQUISITIONMODE= SIMULTANEOUS
##XUNITS= HZ
##YUNITS= ARBITRARY UNITS
##XFACTOR= 2.67965053E-2
##YFACTOR= 5.52154309E-2
##FIRSTX= -66.68135811
##FIRSTY= -149.76300085449
##LASTX= 26729.82396815
##NPOINTS= 26863
##XYDATA= (X++(Y..Y))
-2488b712k469o40O156M480n18p62N151m724j1398P01O278R569j2038R234k346b499
$$ -2712 -5181 -5821 335 4815 4297 3535 8686 3962 -7436 -6735 -457 9112 -2926 6308 3962 -2499
-1857d145J951p01J52Q625P162j1094J0423q472p192J615%N242J1672k591r660I387
$$ -4145 -2194 -2895 -2743 5882 13044 1950 12373 3901 -3291 -1676 -1676 3566 15238 12647 2987 9387
-1222a036m084Q381j890r935J0301J707N303m998j0637J860j738O339l779j2099d968
$$ -1036 -5120 3261 1371 -8564 1737 3444 8747 3749 -6888 -5028 -6766 -427 -4206 -16305 -4968
-626a83Q533m967J402r76j6182O674J0606j3562Q045n942P31J53q84Q015K13a432
$$ -183 8350 3383 4785 3809 -12373 -5699 4907 -8655 -610 -6552 -5821 -5668 -6552 1463 1676 -1432
5b255k316L291J981K072J341q381p61m846J3104o09l05p01L871k774m083d876
$$ -2255 -4571 -1280 701 2773 4114 -4267 -5028 -9874 3230 2621 2316 1615 5486 2712 -1371 -4876
637h076l505L1Q716l901J1459j0606l96j22N669j250o583K926k773m358Q441g710
$$ -8076 -11581 -11550 -2834 -6735 4724 -5882 -6278 -6400 -731 -1981 -8564 -5638 -8411 -12769 -4328 -7710
1269a310M144L66K74l35p01n668J432M236J097L657R15m968r905J2465o705B408
$$ -1310 2834 3200 3474 3139 2438 -3230 -1798 2438 3535 7192 8107 3139 -6766 5699 -1006 2408
1905C505M26q83K133l840k682P497k011K712l718p497L322j433L932r75J158I387
$$ 3505 3931 3048 5181 1341 -1341 6156 4145 6857 3139 -4358 -1036 -2469 1463 488 1646 9387
2536D389p345p589N090o40j981j341Q960j402J920J097j067M663R2j0454j188A829
$$ 4389 -2956 -10545 -5455 -6095 -8076 -9417 -457 -1859 61 1158 91 4754 4846 -5608 -6796 1829
3169C444o095j494M328k712J615J0331n638o217K377j798P01n943J1490J1336D724
$$ 3444 -2651 -4145 183 -2529 -914 9417 3779 -2438 -61 -1859 -1158 -7101 4389 15725 4724
3764A889J707k164j158M054N546r904J3287q137k316l414O157r631M328J066E394
$$ 1889 3596 1432 274 4328 9874 -30 13257 5120 2804 -610 5547 -4084 244 1310 5394
4359F10m511j889O247k651j920k44J22l474K834n181N455J53J249J0514L139C627
$$ 610 -3901 -5790 457 -2194 -4114 -4358 -4236 -7710 -4876 -10057 -4602 -4449 -3200 7314 10453 3627
4990D084q808R600j310R478m58o186p589j0422L687J067K377o1L170m602l566c596
$$ 4084 -4724 4876 3566 13044 12586 6400 -1189 -11611 -7924 -6857 -4480 -4541 -1371 -5973 -9539 -3596
5625e608j554J737P436Q290p650q53j2282L688l05Q533N699n79r752J0971R76A371
$$ -5608 -7162 -5425 2011 10301 2651 1798 -10484 -6796 -7101 1432 7131 6552 -3200 7771 8747 1371
6257G92K012N150j1002l504k012Q351p954q077J7615l718o186L413O248M205C535
$$ 792 2804 7954 -3048 -6552 -8564 -213 -8167 -16244 1371 -2347 -8533 -5120 1128 5333 3535
6852G741k194l200n059p406J8438k13k012j2464N881q83J1245n760L749q960a0240
$$ 7741 5547 2347 -2712 -10118 8320 8107 6095 -6369 -488 -1371 9874 4114 7863 -1097 -10240
7450e790J066l901l443O186P558m419j2678Q503M480J310N913j341L718J341A4141
$$ -5790 -4724 -8625 -12068 -5882 1676 -2743 -15421 -6918 -2438 -1128 4785 3444 7162 8503 14141
8046C809J311o004j2800q22Q777O247K926n638L200m145m023n851N882K072i326
$$ 3809 5120 -884 -13684 -14506 -5729 518 3444 -2194 1006 -3139 -7162 -13013 -7131 -5059 -9326
8640c505R2J402R44O857N79J372j5695R021N089r75M358q411L352M785N272A3013
$$ -3505 -3413 -2011 -1067 5790 6369 7741 -7954 1067 6156 5181 9539 1128 4480 9265 14537 13013
9271A3897r539n821L596k13L66l444k408n394K469j829P92k925K011L322q259h259
$$ 13897 4358 -1463 2133 1920 2286 -1158 -3566 -8960 -6491 -8320 -7528 -10453 -8442 -5120 -13379 -8259
9906C809r264n669O004l383Q381L261j2404M907R691q990j951l35L535R478D693
$$ 3809 -5455 -11124 -5120 -8503 -122 3139 -9265 -4358 5333 -3657 -5608 -5943 -2408 7070 4693
10502C749m724M419O643n820l292P741k225n424j798q137P497k865j432P984e912
$$ 3749 -975 3444 10087 4267 975 8716 6491 1067 -731 -8868 -1371 -4236 -5668 2316 -5912
11096b347k925M571l840o034j036L65P863N486L413M084R417p650q319r052M785c566
$$ -2347 -5272 -701 -4541 -10575 -11611 -11246 -3383 2103 5516 9600 19017 11367 3048 -6004 -1219 -3566
11728a2312M419Q411Q899p406J3867q259M88m663j0514M723J2526K74q442j889D846
$$ -12312 -7893 518 9417 2011 15878 7619 8107 3444 -7070 -2347 10179 10453 2011 122 4846
12323C870K957m115O857O400o430r112j524k591j52R295m541P162r082j188j83A006
$$ 3870 6827 2712 9569 15969 9539 427 -1097 -3688 -3840 5455 914 8076 -1006 -2194 -2377 1006
12958A2373o705m815n668M571Q23m267j52R905m145L962o949n912J0514M175A128
$$ 12373 5668 853 -4815 -244 579 -3688 -3840 6065 1920 5882 -1067 -6979 3535 7710 1128
13553G741k103l109R387l566j7036J5238P01j493j1185O644K743m846n18j0240c566
$$ 7741 5638 2529 11916 8350 -8686 6552 7253 5760 -5425 1219 3962 -884 -1402 -11642 -3566
14148f888P071p192J0361J1033j7524r45J341J158K895J951k591j3622N668l047F10
$$ -6888 183 -7009 3352 14385 -3139 -4084 -2743 -1585 1310 3261 670 -12952 -7284 -10331 610
14742a310m267R478j2617N49Q045J0209M724n546p894O918j0026O887N760n48a950
$$ -1310 -5577 3901 -8716 -8167 -122 10087 14811 9265 1371 8289 -1737 5150 10910 10362 -1950
15338F613J0332o522K13k13j1246q23j7249J7493M27q930J4141N029l688o583A5634
$$ 6613 16945 10423 10636 10423 -823 -1646 -18895 -1402 -975 -9905 4236 9265 5577 -1006 15634
15936H899j1764n638j798l840J0484J2251j3379N455m022l444P070K591p93n18c931
$$ 8899 -2865 -8503 -10301 -14141 -3657 8594 -4785 670 -3352 -6796 274 2865 2072 1554 -3931
16530F1k225R692J127l444l565j280k591p923j2861l1J3501J0453N029l414K042H23
$$ 61 -2164 7528 8655 5211 1646 366 -2225 -10148 -23009 -23040 -9539 914 5943 2529 4571 823
17163d449j951l0J1611o065N486j646m845k44o004O095M27R874l992m846m267a5085
$$ -4449 -6400 -6430 5181 -884 4602 2956 -1889 -2133 -8137 -2042 -1615 8259 4267 -579 -4846 -15085
17795a1367K316O400N48J8590L779j9748O71O70j920J890J1641j7859K14K956A798
$$ -11367 -9051 -2651 -2103 16487 20266 518 1189 1859 -61 1829 13470 -4389 -4175 -1219 1798
18393C230k407Q015p588q595P833l597j127P223N638m267j1154J036l108j280a7371
$$ 3230 823 8838 1250 -7345 488 -3109 -4236 2987 8625 4358 -6796 -5760 -8868 -10148 -17371
18988a371o309P040L962J585L0n943J798k255N516N49O430q015L474K012j83G802
$$ -1371 -7680 -640 3322 4907 4937 -1006 792 -1463 4053 4602 11032 3017 6491 8503 8320 7802
19619H228O339n729n211N272K529q899K499k407K011N486K44m389o339k407o735E455
$$ 8228 14567 8838 3627 8899 11428 2529 5028 2621 4632 10118 10362 5973 -366 -2773 -9508 5455
20251F705o065j0301K74k133N730O521j3836J311J1154J768j3867P223m389R539a981
$$ 6705 640 -9661 -9387 -11520 -5790 731 -13105 -11794 -640 1128 -12739 -5516 -9905 -366 -1981
20846H594r965n821Q167O065N425P862L261r143q167N638j0484j798k44P528b804
$$ 8594 -1371 -7192 975 7040 12465 20327 23588 14445 6278 11916 1432 -366 -610 6918 -2804
21444B865N394m267J585o796K44j646k651N516N668O339j2739J494K316n791D023
$$ 2865 8259 3992 5577 -1219 -975 -2621 -5272 244 5912 12251 -488 1006 3322 -2469 4023
22039A0270p436p131Q746j3287R539O613o583j706q84n120J0484m450L05o400C779
$$ 10270 2834 -4297 4449 -8838 701 7314 731 -975 -1859 -6979 3505 -945 -640 -7040 3779
22634c870L96M876M815j0118J615N943N912l017o369m57Q441r691n79L139m510B072
$$ -3870 -3474 1402 6217 -3901 -2286 3657 9569 6552 183 -274 8167 -1524 -2103 1036 -3474 2072
23266F308J0667l96p924m419O217j9443r600J7523N151J0148m297n120O1j950b316
$$ 6308 16975 16579 8655 4236 10453 -8990 -18590 -1067 4084 14232 9935 4815 4876 2926 -2316
23861D57J3318o004n942j159k925K011p619k072M145M754K377j2068L992N577d754
$$ 457 13775 7771 1829 670 -2255 -244 -7863 -9935 -5790 -1036 1341 -10727 -6735 -1158 -4754
24456H23q107P558l200J737m26O735o888M663q84k895l96j920p497P558J0727H625
$$ 823 -7284 274 -2926 -1189 -1615 5120 -1768 2895 2011 -884 -1280 -3200 -10697 -3139 7588 8625
25091C840K194L901L444M967j249j463r905r447K44j3958R569M450N455o796i14
$$ 3840 6034 9935 13379 18346 17097 15634 5729 -3718 -3474 -17432 -7863 -3413 2042 -4754 -914
25686f126o1N699j2769O034J3288m572P589r966O034n973o40J1642K865m450A1032
$$ -6126 -6187 -488 -13257 -7223 6065 1493 9082 -884 5150 -823 -1463 10179 13044 8594 11032
26281D114q716m114L230J0911J889l992k438J0057m693p467k072J005P436N029H838
$$ 4114 -4602 -8716 -5486 5425 7314 3322 884 10941 6248 -1219 -3291 -2286 5150 10179 8838
26878B194J067k286L566O70j0422J2403k925J249O217n973n18J493p436o644a128
$$ 2194 3261 975 4541 5211 -5211 7192 4267 5516 11733 5760 5242 6735 -701 -7345 -1128
27474c261J1428%L66j0453m449Q411m998o949M968p01M754O10L504M084j2038C230
$$ -3261 8167 8167 8533 -1920 -6369 2042 -2956 -9905 -4937 -5638 -884 -274 3230 7314 -4724 3230
28106B1455m236j3196o004q84O888R75q198L657k286L36p528J0789r753N059c535
$$ 21455 17219 4023 -1981 -2865 4023 4998 -3200 457 -1829 -1493 -9021 1768 -7985 -2926 -3535
28700d88J890N577P832q929n49J22o247L504L36k591k13n18J341j981l688O004A006
$$ -488 1402 6979 14811 5882 5333 5455 -792 2712 3048 457 244 -274 1067 -914 -4602 1402 1006
29370h777n638p649R051J2099M784N242j0331j0727M754Q045j310M023N150j615A646
$$ -8777 -14415 -22064 -13013 -914 3870 9112 -1219 -11946 -7192 853 -457 3566 8716 7101 1646
29964C413K377l840j3256J919Q84Q259J0941p070J158k103j006n638J707j737b316
$$ 3413 5790 1950 -11306 -9387 -8503 -244 10697 3627 4785 2682 1676 -3962 -2255 -3992 -2316
30562g436j341P802O003q472J0423m541j219J615J676J2282j0697q350Q53J1215A1124
$$ -7436 -8777 -975 5028 -3444 6979 2438 1219 2834 4510 16792 6095 -2255 -1402 9813 11124
31158C05K956P741j1916R813j2922N973O492q442R813p832l810J677O613r295D541
$$ 305 3261 11002 -914 8899 -4023 1950 8442 0 9813 1981 -1829 -152 6461 -2834 4541
31752E272j0453l992O095m57O40l840K529N090l353O797l1n394N699M510l748c05
$$ 5272 -5181 -9173 -3078 -3535 -2895 -6735 -4206 884 -2469 4328 4297 -1097 4602 9112 5364 -305
32384H716M27q54q716J341l443l414M023N150L139o460n49m57o400j524L810d175
$$ 8716 9143 8289 -427 914 -2529 -5943 -1920 3230 6369 -91 -640 -1097 -7497 -9021 -5211 -4175
33016B042j158P649q655m145p436K713O918K74j859M267Q258L1m968j036r904e028
$$ 2042 884 8533 -122 -4267 -11703 -8990 -2072 -1798 -3657 610 8868 8899 3931 2895 -7009 -5028
33652h076L718k072K925n181J1612N120r875O248j859O70L597k621p193R45P01A158
$$ -8076 -4358 -6430 -3505 -8686 2926 8046 -1829 4419 2560 3230 6827 4206 -2987 -2042 -1341 1158
34284f187p222R874J1550J463k651K895q290L97j707j2495J8560J158R14p649D57
$$ -6187 -13409 -3535 8015 9478 6827 9722 1432 1829 122 -12373 6187 7345 8259 610 457
34879E181k956o40r75n19r173j615R143P984q289L230l200o40K682k864J2281f70
$$ 5181 2225 1585 610 91 -9082 -10697 -1554 6430 -1859 1371 -1829 -2469 213 -2651 9630 -670
35511G467j6061Q594L596j1459P741O309L352l170j1154M541o400j981J1094A615
$$ 7467 -8594 0 3596 -7863 -122 6187 9539 6369 -4785 -244 -6644 -8625 2469 1615
36069c35J219k286k164Q899m602o430P893P711j2252J616R599k986k133M57o644E333
$$ -335 884 -1402 -3566 5333 731 -5699 2194 9905 -2347 -731 8868 5882 3749 4206 -2438 5333
36700A585n303M937L66L687l657k438l413O674L383o400R45k134p954j371O552I752
$$ 1585 -3718 1219 1585 5272 1615 -823 -4236 2438 5821 -579 366 -1768 -9722 -11093 -4541 9752
37336a219P832o034L657k255J006K712o461l139M27J493K133N852m937j0393B712
$$ -1219 6613 579 4236 1981 2987 5699 -762 -3901 -3474 -1981 152 6004 1067 -9326 2712
37931c505N18R387P832o065m662j402M023l017k499J0057q54n211o583M053J097D114
$$ -3505 -2987 6400 14232 8167 3505 2103 6126 3109 610 10667 9813 4602 -1981 2072 3169 4114
38563C840P741j3806P467n943O034j0819K134L108o796J7341n638r14l414N638A6701
$$ 3840 11581 -2225 5242 -701 5333 -5486 -3352 -244 -7040 10301 4663 3749 335 5973 16701
39158B0754j7554n059j0484J189R021P314o431o0l871N211n942p32l596J0941G710
$$ 20754 3200 -1859 -12343 -11154 -2133 5181 -1250 -1310 -5181 30 -5912 -6644 -10240 701 7710
39752D937n089q015Q350J1459O003N517k0358k682J2373p101O674l931j1672B164
$$ 4937 -152 -8167 183 11642 17645 23162 2804 122 12495 5394 12068 8137 -3535 2164
40313a036J859j036l871j706M906q53j2526M023O187l962m328N395R112N150a219
$$ -1036 823 -213 -4084 -5790 -884 -1737 -14263 -10240 -4053 -8015 -12343 -6948 2164 7314 -1219
40909d998k347L139L66M876O126o400L291K530p528l35n912n699P344n973P528B956
$$ -4998 -7345 -4206 -3840 1036 7162 762 4053 6583 -945 -1280 -7192 -12891 -5547 -11520 -3992 2956
41540B956o918o430J3379J554K895L810o857k103M26m967J0971N364j768L109B987
$$ 2956 -3962 -10392 2987 4541 7436 11246 4389 2286 2712 -2255 8716 14080 12312 15421 2987
42134d114P92K469R935q351L779n241J3196M57O095j5573P923k74k773m754K102D785
$$ -4114 -3322 -853 9082 731 4510 -731 12465 12922 19017 3444 11367 11093 8320 3566 5668 4785
42767F339j3775J0605R753J249p588R813J828j1123J737l474o400J0362P131A1215
$$ 6339 -7436 3169 12922 14171 6583 16396 18224 7101 8838 5364 -1036 9326 16457 11215
43328F10J2738K377k407j3745J585j52k195k834J0697o796o186J219M449l840b44
$$ 610 13348 15725 13318 -427 1158 1006 -1189 -4023 6674 -122 -6308 -5089 -640 -4480 -244
43922I356j7767M602r296L97O948r813N760N303p040l383O278Q198J341K590H53
$$ 9356 -8411 -3809 -13105 -12708 -5760 -15573 -9813 -4510 -11550 -14933 -8655 -457 884 3474 853
44517B225m572M633L413o309j950J920k895j036J950p406J3318L353J737o918c291
$$ 2225 -2347 2286 5699 -610 -2560 -640 -3535 -4571 -2621 -10027 3291 6644 8381 1463 -3291
45115e486L017J5269j280j1794P009j097K621p162L231n181q54r630L96p588g436
$$ -5486 -2469 12800 11520 -274 6735 5638 8259 1097 4328 -853 -1707 -11337 -10941 -18529 -7436
45710c078J768P740r112N882n029M328J676n668l139L04L749Q686j4019N181B499
$$ -3078 -1310 6430 -2682 3200 -1829 2499 4175 -1493 -4632 -4328 -579 8107 -5912 -731 2499
46305D145K255j1154j676K834N028J1398p436K682o918R021j2038J402l078r570a067
$$ 4145 6400 -4754 -6430 -3596 1432 12830 5394 8076 1158 10179 -1859 -457 -3535 -13105 -1067
46899A1977R539r661j5878r386Q289K164o431Q107P375r508R661K011p070P710A3379
$$ 11977 21516 11855 -4023 -13409 -5120 -2956 -9387 -1280 6095 -3413 6248 8259 1189 8899 13379
47497I874j0727l749K987k225N608J859l05o034k408J1063r509k895k164Q168e394
$$ 9874 -853 -4602 -1615 -3840 1768 3627 3322 -2712 -5120 5943 -3566 -6461 -8625 -457 -5394
48093d907L200J2648P31j0636M084l840k408Q595l139Q716n699l139O339r387E699
$$ -4907 -1707 10941 11672 1036 5120 1280 -1128 7467 4328 13044 7345 4206 10545 1158 5699
48687H533l96j0301N059P01L718j0941p771k804J0697o552P040r2j127l657J3501b377
$$ 8533 8137 -2164 2895 3596 7314 -3627 -11398 -14202 -3505 -10057 -3017 -3109 -4236 -7893 5608 -2377
49318f552j646Q533O522m876l444K74R753n151L475k957j2038L66l047J5938B773
$$ -6552 -8198 335 6857 1981 -1463 -1189 8564 3413 6888 3931 -8107 -7741 -10788 5150 2773
49914G680n059p070j159q258k439J0941m57J0362L779M87o369k133q54q83p650f278
$$ 7680 2621 -4449 -5608 -13866 -16305 -5364 -5821 4541 8320 8807 2438 305 -549 -1432 -9082 -6278
50549b286l04j981R1N730R569j0910N302q868K316r1R44Q320q23m510o308L657c200
$$ -2286 -2590 -4571 -4480 1250 10819 -91 5211 -3657 -1341 -1432 -488 7832 7009 2499 -3809 -152 -3200
51218a798K987%P558p924l383p284L627J4019l718m175J2373j5756m846Q533b499
$$ -1798 1189 1189 8747 823 -2560 -9844 -6217 7802 4084 -91 12282 -3474 -8320 213 -2499
51813i387J799P61N517o40j128J524n181J5512n181j4902R081K44k347l0k164f583
$$ -9387 -7588 -6827 -1310 -1950 -3078 -1554 -6735 8777 3596 -11306 -2225 -1981 -4328 -4358 -6522 -6583
52445a1581M663K316L048o370Q991k560M845N547l901q564J524P497l596M328h960
$$ -11581 -6918 -4602 -1554 -7924 1067 -1493 3352 8899 4998 -3566 -2042 5455 1859 6187 -8960
53043a341o70m206j981J2099j493K468O1r173R386K103p466r76P833m084r082a524
$$ -1341 -2011 -6217 -8198 3901 2408 4876 4937 -4236 5150 7253 -213 -1189 6644 2560 -6522 -1524
53676C840p192M083M145p741m419o095Q533n059J3014M419p62N272r021k347g01
$$ 3840 -3352 731 4876 -2865 -7284 -13379 -4846 -9905 3109 7528 6766 12038 3017 670 -701
54270A7463j4324l749L231O09j6426m084J8103J341O583n334M419J494j0332a524
$$ 17463 3139 -610 2621 3230 -13196 -17280 823 2164 8747 3413 7832 9326 -1006 -1524
54828A219k956J767L932M27M693k499o400o278L413l047J5634k195j0940j219e089
$$ 1219 -1737 30 3962 4389 9082 6583 183 -6095 -2682 -5729 9905 7710 -3230 -4449 -5089
55422a0209Q289J981n882J1977R75r874l962O735Q84R661K347j5451q930Q594f583
$$ -10209 -1920 61 -5821 6156 7131 -2743 -6705 30 914 10575 12922 -2529 -11459 -2865 -6583
56020a310N485J5147j1612l474j2495l322j767k317P711P92M175Q198N181n699a859
$$ -1310 4175 19322 7710 4236 -8259 -11581 -13348 -15665 -7954 -7162 -2987 5211 10392 4693 -1859
56616A2830J219p497j584n760j5848J3867J859O582M785q716j158m57J0575p92H838
$$ 12830 14049 6552 4968 -792 -16640 -2773 -914 5668 10453 1737 579 122 10697 9905 8838
57210E79P92m480m205K103P009l261L078R844k804L66l109j5481J3470M023m663a463
$$ 579 1371 -3109 -7314 -5211 1798 -1463 1615 11459 8655 9021 5912 -9569 3901 7924 3261 -1463
57842e699j036o71j0544P649O126j615J6396n699m968J646N242J188p863m815f40
$$ -5699 -6735 -7406 -17950 -10301 -4175 -5790 10606 4907 -61 1585 6827 8015 152 -4663 -640
58437I204m846l931j616J1764j493k073p131o186N79J0087K469n821j0484J1032D480
$$ 9204 4358 427 -1189 10575 9082 7009 -122 -6308 -5729 4358 6827 1006 -9478 1554 4480
59035F735J920j1154O400P985J127o461l687q747O248m236Q898K195o187L66A067
$$ 6735 8655 -2499 3901 11886 13013 6552 2865 -5882 366 -3870 5028 7223 1036 1402 1067
59629D510J829L383p010R174q290K194m87M053L200l078j0941j646O065k407A036
$$ 4510 6339 9722 2712 11886 3596 5790 5303 9356 12556 9478 -1463 -3109 2956 549 1036
60225d023L840n272j372m26P344j401K407Q869l018j1641K804l018R996k895b225
$$ -4023 -183 -5455 -6827 -7253 91 -1310 1097 9966 6948 -4693 -1889 -4907 5089 2194 -2225
60819a1459J768R203L901Q076r020K742P193r265k895o40m572O979n790l261f735
$$ -11459 -9691 -488 3413 11489 2469 5211 12404 3139 244 -396 -4968 2011 -3779 -7040 -6735
61413C566o40j1733j189L718J585M26M88K44O004o614l291O247K75J432Q289A829
$$ 3566 2926 -8807 -9996 -6278 -4693 -4267 -3779 -3535 2469 -4145 -7436 -1189 -914 518 8807 1829
62046A128q442Q746Q808m053N79K803j82m480P954k1425p862J4750J920m053G31
$$ 1128 -7314 1432 10240 6187 6766 9569 9387 4907 12861 -8564 -16426 -1676 244 -3809 731
62644e943k164R936m27m846p62o1M694n913m601K986K712K560J7189j0179q076d480
$$ -5943 -8107 1829 1402 -3444 -4206 -4267 427 -5486 -10087 -7101 -4389 -1829 15360 5181 -2895 -4480
63275e242N181l200m358n790N18J0026J0697n455L749k621n212K14M114j615D053
$$ -5242 -61 -3261 -7619 -13409 -12891 -2865 7832 2377 6126 3505 -1707 -1493 2621 1006 4053
63871c413N150k44J2465K347k560m907o10k133l626o71L901j1246M541j889m572B225
$$ -3413 1737 1493 13958 16305 13745 8838 8228 6095 2469 1798 5699 -5547 -1006 -2895 -7467 2225
64506A097M876j2495M602M876K377j2708Q655Q076l931J493r935Q167L444j402f583
$$ 1097 5973 -6522 -1920 2956 5333 -7375 1280 9356 5425 6918 -3017 5150 8594 7192 -6583
65100G070j402p009J1276o948r2m053k926k194J097J341k072n455O308K194M602A2617
$$ 7070 5668 -1341 9935 2987 2895 -1158 -4084 -6278 -5181 -3840 -5912 -11367 -5059 -2865 1737 12617
65733A5665j220j4567K377l017P985J402J889k103j52N973o887m937O40m298d57
$$ 15665 14445 -122 2255 -762 7223 8625 10514 8411 8259 14232 7345 2408 3048 -1250 -457
66327I14J311l36O949j0148j494J0392o674j6761l1N364L200P771k011n425L66i417
$$ 914 2225 1889 8838 -1310 -2804 7588 914 -15847 -15878 -10514 -7314 457 -1554 -6979 -6613 -9417
66962g284M755l05O217P344o003q412L97J82p558J3928M846M510n669R76l718A2343
$$ -7284 -2529 -2834 3383 10727 4724 -3688 -3291 -3109 -10667 3261 8107 12617 6948 7924 4206 12343
67595E668j1794N334J889r874J1916l322l596M632K591q838j0453K2155l748A646
$$ 5668 -6126 -792 1097 -8777 3139 -183 -3779 853 3444 -5394 -15847 6308 2560 1646
68152A493N913k164n943q23l047N211O278j0545O71L505J798M327J341k773k164D236
$$ 1493 7406 5242 -701 -1524 -4571 640 6918 -3627 -2956 549 2347 6674 8015 5242 3078 4236
68783g192O40J219M053M907m877P711M632m297j3044p039J5481Q290o248O888A7371
$$ -7192 -6552 -5333 -1280 3627 -1250 6461 11093 6796 -6248 -13287 2194 10484 4236 11124 17371
69379A5847J372j0697j402n973N455j311j493m053j5878J3531K103l688J1429b834
$$ 15847 17219 6522 5120 -853 4602 3291 1798 -2255 -18133 -4602 -2499 -6187 5242 -2834
69940b560k834N729L810p193L475q381J1703j2983r2Q716M450K194j2342L382e272
$$ -2560 -5394 335 4145 -3048 427 -7954 3749 -9234 -9326 -610 3840 6034 -6308 -2926 -5272
70534c35j920q168l108J280J5085J890n181j158q533M662J1215l657j4232K438b011
$$ -335 -2255 -10423 -13531 -12251 2834 4724 -457 -1615 -10148 -5486 5729 2072 -12160 -9722 -2011
$$ [...]
997512E516  $$checkpoint
##END= $$ end of C NMR
##END= $$ end of file