##TITLE= hydroxyacetone - Gaussian simulations
##JCAMP-DX= 5.0
##DATA TYPE= LINK
##BLOCKS=2
##ORIGIN= Department of Chemistry, UWI, JAMAICA
##OWNER= public domain
##TITLE= hydroxyacetone
##JCAMP-DX= 5.01
##DATA TYPE= INFRARED SPECTRUM
##DATA CLASS= XYDATA
##ORIGIN= WebMO
##OWNER= public domain
##LONGDATE= 2012/03/31 19:30:56.0065 -0500 $$ export date from JSpecView
##SPECTROMETER/DATA SYSTEM= computed
##$MODELS=
<Models>
<ModelData id="hydroxyacetone" type="MOL">
hydroxyacetone (1-propanol-2-one)
RLDSViewer          3D                             0

 11 10  0  0  0  0  0  0  0  0999 V2000
    0.8580    1.3254    0.0115 C   0  0  0  0  0  0  0  0  0  1
    0.6078   -0.1802    0.0044 C   0  0  0  0  0  0  0  0  0  2
   -0.8334   -0.7048    0.0361 C   0  0  0  0  0  0  0  0  0  3
   -1.7944    0.3384   -0.0334 O   0  0  0  0  0  0  0  0  0  4
   -2.6587   -0.0470   -0.0300 H   0  0  0  0  0  0  0  0  0  5
   -0.9790   -1.2725    0.9562 H   0  0  0  0  0  0  0  0  0  6
   -0.9731   -1.3899   -0.7993 H   0  0  0  0  0  0  0  0  0  7
    1.5506   -0.9668   -0.0266 O   0  0  0  0  0  0  0  0  0  8
    0.7151    1.7246    1.0146 H   0  0  0  0  0  0  0  0  0  9
    0.1740    1.8340   -0.6675 H   0  0  0  0  0  0  0  0  0 10
    1.8777    1.5358   -0.3060 H   0  0  0  0  0  0  0  0  0 11
  1  9  1  0  0  0
  1  2  1  0  0  0
  1 10  1  0  0  0
  1 11  1  0  0  0
  2  3  1  0  0  0
  2  8  2  0  0  0
  3  6  1  0  0  0
  3  4  1  0  0  0
  3  7  1  0  0  0
  4  5  1  0  0  0
M  END
  </ModelData>
 <ModelData id="1" type="XYZVIB" baseModel="hydroxyacetone" vibrationScale=".1">
11
Model[1]: Convg=0.7762D-08;-V/T=2.0027;Energy=NaN;Range=M.O.s;E(RHF)=-266.801820718 A.U.;PATH=Calculation 1;Input
C     0.00000    0.00000    0.00000
C     0.00000    0.00000    1.52632
C     1.33627    0.00000    2.27987
O     2.45286    0.10300    1.40868
H     3.24219    0.11794    1.93047
H     1.41107   -0.92114    2.85952
H     1.33983    0.83255    2.98248
O    -1.05928    0.00022    2.14786
H     0.23275   -0.99565   -0.37493
H     0.73995    0.70051   -0.38646
H    -0.97947    0.29345   -0.37314
11
Model[2]: Convg=0.7762D-08;-V/T=2.0027;Energy=-266.80182;Range=M.O.s;E(RHF)=-266.801820718 A.U.;PATH=Calculation 1;Standard
C     0.85802    1.32543    0.01145
C     0.60784   -0.18023    0.00440
C    -0.83344   -0.70478    0.03613
O    -1.79437    0.33836   -0.03340
H    -2.65868   -0.04699   -0.02995
H    -0.97898   -1.27251    0.95623
H    -0.97313   -1.38991   -0.79928
O     1.55057   -0.96680   -0.02660
H     0.71508    1.72456    1.01461
H     0.17399    1.83404   -0.66753
H     1.87769    1.53575   -0.30598
11
Model[3]: IRIntensity=30.2931 KM/Mole;ReducedMass=2.5583 AMU;ForceConstant=0.0303 mDyne/A;Frequency=141.7684 cm^-1;FrequencyLabel=A;PATH=Calculation 1;FrequenciesFrequencies
C     0.85802    1.32543    0.01145    0.01000    0.00000    0.11000
C     0.60784   -0.18023    0.00440    0.00000    0.00000    0.00000
$$ [...]
O    -1.79437    0.33836   -0.03340   -0.06000   -0.02000    0.00000
H    -2.65868   -0.04699   -0.02995    0.92000    0.40000    0.00000
H    -0.97898   -1.27251    0.95623    0.00000    0.00000    0.00000
H    -0.97313   -1.38991   -0.79928    0.00000    0.00000    0.00000
O     1.55057   -0.96680   -0.02660    0.00000    0.00000    0.00000
H     0.71508    1.72456    1.01461    0.00000    0.00000    0.00000
H     0.17399    1.83404   -0.66753    0.00000    0.00000    0.00000
H     1.87769    1.53575   -0.30598    0.00000    0.00000    0.00000
  </ModelData>
</Models>
##$PEAKS=
<Peaks type="IR" xUnitsExpected="1/cm"  >
<PeakData id="1" title="O-H stretch (~4125 cm-1)" peakShape="broad" model="1.29" xMax="4150" xMin="4100"    />
<PeakData id="2" title="asymm stretch of methyl C-H group (~3246 cm-1)" peakShape="broad" model="1.27" xMax="3270" xMin="3230"    />
<PeakData id="3" title="asymm stretch of methylene C-H group (~3211 cm-1)" peakShape="broad" model="1.26" xMax="3228" xMin="3191"    />
<PeakData id="4" title="symm stretch of methyl C-H group (~3176 cm-1)" peakShape="broad" model="1.25" xMax="3186" xMin="3160"    />
<PeakData id="5" title="Carbonyl stretching band (~1808 cm-1)" peakShape="broad" model="1.23" xMax="1828" xMin="1788"      />
<PeakData id="6" title="asymm stretch of methyl group (~1606 cm-1)" peakShape="broad" model="1.20" xMax="1626" xMin="1586"    />
<PeakData id="7" title="symm stretch of methyl group (~1558 cm-1)" peakShape="broad" model="1.18" xMax="1578" xMin="1538"     />
<PeakData id="8" title="asymm stretch of methyl group (~1373 cm-1)" peakShape="broad" model="1.16" xMax="1393" xMin="1353"    />
<PeakData id="9" title=" (~1299 cm-1)" peakShape="broad" model="1.15" xMax="1319" xMin="1279"    />
<PeakData id="10" title="C-C of aromatic group (~1156 cm-1)" peakShape="broad" model="1.13" xMax="1176" xMin="1136"    />
<PeakData id="11" title="symm stretch of CH3 group (~1093 cm-1)" peakShape="broad" model="1.12" xMax="1113" xMin="1073"    />
<PeakData id="12" title="C-H twist of methyl group (~979 cm-1)" peakShape="broad" model="1.11" xMax="999" xMin="959"    />
<PeakData id="13" title="scissors of aromatic C-H groups (~788 cm-1)" peakShape="broad" model="1.10" xMax="808" xMin="768"    />
<PeakData id="14" title="scissors of CH group (~568 cm-1)" peakShape="broad" model="1.8" xMax="588" xMin="548"    />
<PeakData id="15" title="symm stretch of CH3 group (~295 cm-1)" peakShape="broad" model="1.6" xMax="315" xMin="275"    />
<PeakData id="16" title="symm stretch of CH group (~214 cm-1)" peakShape="broad" model="1.5" xMax="234" xMin="194"    />
<PeakData id="17" title="asymm bend of CH3 group (~143 cm-1)" peakShape="broad" model="1.3" xMax="163" xMin="123"    />
</Peaks>
##XUNITS= 1/CM
##YUNITS= TRANSMITTANCE
##XFACTOR= 1
##YFACTOR= 9.800000E-07
##FIRSTX= 4.326656E+03
##FIRSTY= 9.848000E-01
##LASTX= -5.823200E+01
##NPOINTS= 2001
##MINY= 2.000000E-02
##MAXY= 1
##XYDATA= (X++(Y..Y))
4326.656A004898m08l06m08l07m08Vn10m09n10Vn11o12Uo13p14o12q16I93061
$$ 1004898 1004490 1004184 1003776 1003469 1003061 1002653 1002245 1001837 1001327 1000918 1000408 999898 999388 998878 998367 997755 997143 996531 995918 995204 994592 993776 993061
4274.037I92245q16q17r18Tj021j020j123j122j123j224j327j428j429I76429
$$ 992245 991429 990612 989694 988776 987755 986735 985612 984490 983367 982143 980816 979388 977959 976429
4241.15I74898j735j734j939Tk143k245k347k551k653k857l061l163I43061
$$ 974898 973163 971429 969490 967551 965408 963163 960816 958265 955612 952755 949694 946531 943061
4210.456I39286l878m286m489m898n306n715o122o633p143p755q469H65306
$$ 939286 935408 931122 926633 921735 916429 910714 904592 897959 890816 883061 874592 865306
4181.955H55306j0918j2041j3061j4388j5714j7245j8980k0816k2857F84286
$$ 855306 844388 832347 819286 804898 789184 771939 752959 732143 709286 684286
4157.838F56939k9796l2245l4694l6837l8775m0000m0510l9694l7755B92347
$$ 656939 627143 594898 560204 523367 484592 444592 404082 364388 326633 292347
4133.721B63061k3265j6020q470m08P551J5204K2449K8776L3775L7449C99694
$$ 263061 239796 223776 215306 214898 222449 237653 260102 288878 322653 360102 399694
4107.411D40102M0102L8980L7143L4897L2449L0103K7551K5306K3061G50714
$$ 440102 480204 519184 556327 591224 623673 653776 681327 706633 729694 750714
4083.295G69898J7449J5918J4490J3265J2041J1123J0102R285Q572P857H97245
$$ 769898 787347 803265 817755 831020 843061 854184 864286 873571 882143 890000 897245
4056.985I03878O224N714N306M898M592M286L980L775L469L266L061I55306
$$ 903878 910102 915816 921122 926020 930612 934898 938878 942653 946122 949388 952449 955306
4028.483I57959K551K347K245K143K041J938J735TJ633J530J429J326I81939
$$ 957959 960510 962857 965102 967245 969286 971224 972959 974694 976327 977857 979286 980612 981939
3997.789I83163J225J122J123J020TR19R18Q17Q16TQ17P14TO12P15O12I97653
$$ 983163 984388 985510 986633 987653 988673 989592 990510 991327 992143 992959 993776 994490 995204 995816 996531 997143 997653
3958.325I98265O13N10UM08N11M08TN10L06M08M09M08L06TM08L06UK05A006633
$$ 998265 998878 999388 999898 1000408 1000816 1001327 1001735 1002143 1002653 1002959 1003367 1003776 1004184 1004490 1004796 1005204 1005510 1005816 1006122 1006327 1006633
3910.091A006939L06K04L06K04UL06K05K04WJ02K04UJ02K04J02K04J03A011531
$$ 1006939 1007245 1007449 1007755 1007959 1008163 1008367 1008673 1008878 1009082 1009286 1009490 1009694 1009898 1010000 1010204 1010408 1010612 1010714 1010918 1011020 1011224 1011327 1011531
3857.473A011633K04J02UK04J02VK04J02YJ03J02%J02W%J02U%J02U%A015102
$$ 1011633 1011837 1011939 1012041 1012143 1012347 1012449 1012551 1012653 1012755 1012959 1013061 1013163 1013265 1013367 1013469 1013571 1013673 1013776 1013878 1013878 1013980 1014082 1014184 1014286 1014388 1014388 1014490 1014592 1014694 1014694 1014796 1014898 1015000 1015000 1015102
3778.545A015204%J02%J02T%J02%J02%J02%J02T%J02%TJ02%J03%J02A016429
$$ 1015204 1015204 1015306 1015306 1015408 1015510 1015510 1015612 1015612 1015714 1015714 1015816 1015816 1015918 1016020 1016020 1016122 1016122 1016122 1016224 1016224 1016327 1016327 1016429 1016429
3723.734A020408%U1q16%Tj02o12j02%Wj03%Vj02%Uk142%j02%j03%j02A016122
$$ 1020408 1020408 1020408 1020408 1020408 1020408 1020408 1020408 1020408 1020408 1020408 1020408 1020408 1020408 1020408 1020408 1020408 1020408 1020408 1020408 1020408 1020408 1020408 1020408 1020408 1020408 1020408 1020408 1020408 1020408 1020408 1020408 1019592 1019592 1019592 1019490 1018878 1018776 1018776 1018776 1018776 1018776 1018776 1018673 1018673 1018673 1018673 1018673 1018571 1018571 1018571 1018571 1016429 1016429 1016327 1016327 1016224 1016224 1016122 1016122
3592.187A016020%j02T%j02%k04j02%k143%j02S4k04j02Uj03k04j02A010816
$$ 1016020 1016020 1015918 1015816 1015816 1015714 1015714 1015510 1015408 1015408 1013265 1013265 1013163 1013061 1012959 1012857 1012755 1012653 1012551 1012449 1012347 1012245 1012143 1012041 1011939 1011837 1011633 1011531 1011429 1011327 1011224 1011020 1010918 1010816
3517.644A010612j02k04j02k04j02k04j02k04Tj02k04k05k04Uj02l06A007449
$$ 1010612 1010510 1010306 1010204 1010000 1009898 1009694 1009592 1009388 1009184 1009082 1008878 1008673 1008469 1008265 1008061 1007959 1007653 1007449
3475.988A007245k04Tl06k04k05l06k04l06Uk04l06Tm09l06Tm08l06A001735
$$ 1007245 1007041 1006837 1006531 1006327 1006122 1005816 1005612 1005306 1005000 1004694 1004490 1004184 1003878 1003469 1003163 1002857 1002449 1002143 1001735
3432.139A001429m09m08Tn10m08n10m09n10Uo13n10o12Up15p14Tp15I90306
$$ 1001429 1001020 1000612 1000204 999694 999286 998776 998367 997857 997347 996837 996224 995714 995102 994490 993878 993163 992449 991735 991020 990306
3386.097I89490q17r18Tr19r18j122j021j122j225j224j225j428j429I73776
$$ 989490 988673 987755 986837 985918 985000 983878 982857 981735 980510 979286 978061 976633 975204 973776
3353.211I72143j633j734j837j939k041k245Tk449k653k755k959l061I41224
$$ 972143 970510 968776 966939 965000 962959 960714 958469 956020 953367 950612 947653 944592 941224
3322.517I37653l877m184m388m796n204n510o123o530p143p755q572H64286
$$ 937653 933776 929592 925204 920408 915204 909694 903571 897041 889898 882143 873571 864286
3294.015H54082j1225j2347j3571j4898j6531j8061j9898k1735k3571F76939
$$ 854082 842857 830510 816939 802041 785510 767449 747551 725816 702245 676939
3269.898F50204k7857k8163k7755k6123k3469k0000j5817j1428p143D59286
$$ 650204 622347 594184 566429 540306 516837 496837 481020 469592 462449 459286
3245.781D59082K040K960K653J122j530m796q572j2041j5306j7449j8367C71837
$$ 459082 461122 464082 466735 467857 466327 461531 452959 440918 425612 408163 389796 371837
3217.279C56122j2142p245j837L469Q164J1428J3163J3266J1836Q980D10510
$$ 356122 343980 336735 334898 338367 346531 357959 371122 384388 396224 405204 410510
3190.97D11735k857o429r082j0408j0204q163m592P14O735J3367J9694D25612
$$ 411735 408878 402449 393367 382959 372755 364592 360000 360714 367449 380816 400510 425612
3162.468D54898L2143L3571L3776L2959L1633K9693K7551K5511K3265G46327
$$ 454898 487041 520612 554388 587347 618980 648673 676224 701735 725000 746327
3138.351G65714J7653J6021J4592J3265J2041J1122J0102R184Q469P857H93163
$$ 765714 783367 799388 813980 827245 839286 850408 860510 869694 878163 886020 893163
3112.042H99796O122N715N204M898M592M183L980L673L470L265L061I50816
$$ 899796 905918 911633 916837 921735 926327 930510 934490 938163 941633 944898 947959 950816
3083.54I53469K551K449K245K143K041J837J836J735J633J632J429I76429
$$ 953469 956020 958469 960714 962857 964898 966735 968571 970306 971939 973571 975000 976429
3055.038I77755J327J224J123J122TJ021J020R19R18Q16Q17Q16TP15I92245
$$ 977755 979082 980306 981429 982551 983673 984694 985714 986633 987551 988367 989184 990000 990816 991531 992245
3019.959I92959O12P15O12N10O12N11O12N10TM08N11M08N10M08UM09A001939
$$ 992959 993571 994286 994898 995408 996020 996531 997143 997653 998163 998571 999082 999490 1000000 1000408 1000816 1001224 1001633 1001939
2978.303A002347L06M08L06TL07L06VK04L06K04L06K05L06K04sK05K04A009184
$$ 1002347 1002653 1003061 1003367 1003673 1003980 1004286 1004592 1004898 1005204 1005408 1005714 1005918 1006224 1006429 1006735 1006939 1007143 1007347 1007551 1007755 1007959 1008163 1008367 1008571 1008776 1008980 1009184
2916.915A009286K04TJ02K04J02K04J02TK04J02K04J02TJ03K04J02ZK04A012653
$$ 1009286 1009490 1009694 1009796 1010000 1010102 1010306 1010408 1010510 1010714 1010816 1011020 1011122 1011224 1011327 1011531 1011633 1011735 1011837 1011939 1012041 1012143 1012245 1012347 1012551 1012653
2859.911A012653J02TR19J02UP14J02%J02T%J02T%J02%J02T%J02%K143A017857
$$ 1012653 1012755 1012857 1013776 1013878 1013980 1014082 1014796 1014898 1014898 1015000 1015102 1015102 1015204 1015306 1015306 1015408 1015408 1015510 1015612 1015612 1015714 1015714 1017857 1017857
2805.1A017857J02%TJ02%UJ02%UJ02T%TK041%T56j0000j02Vk04j02A009592
2189.023A009490j02k04j02Tk04j03j02k04j02k04j02k04j02k04j02A007143
$$ 1009490 1009388 1009184 1009082 1008980 1008776 1008673 1008571 1008367 1008265 1008061 1007959 1007755 1007653 1007449 1007347 1007143
2151.752A007041k04Uj02k05k04S0l06k05k04l06k04l06k04l06Tk04A001224
$$ 1007041 1006837 1006633 1006429 1006327 1006122 1005918 1005714 1005510 1005306 1005102 1004898 1004694 1004490 1004286 1004082 1003776 1003571 1003367 1003061 1002857 1002551 1002347 1002041 1001735 1001531 1001224
2092.556A000918l06Wm08l07m08l06m08Tl06m08m09m08n10m08Tn10n11I92857
$$ 1000918 1000612 1000306 1000000 999694 999388 998980 998673 998265 997959 997551 997143 996837 996429 996020 995612 995102 994694 994286 993776 993265 992857
2044.322I92347n10r19n10o12Tr19o12p14o12p15p14Tp15p14q16q17I80306
$$ 992347 991837 990918 990408 989796 989184 988265 987653 986939 986327 985612 984898 984184 983469 982755 981939 981122 980306
2004.858I79388k143r18j021j020j021j020j123j122j224j225j429j326I63469
$$ 979388 977245 976327 975306 974286 973265 972245 971122 970000 968776 967551 966122 964796 963469
1974.164I62041j429j530j633Tj734j735j837j939k959k143k142k347I36633
$$ 962041 960612 959082 957449 955816 954082 952347 950510 948571 945612 943469 941327 938980 936633
1943.469I34082k551k755k858k959l163l265l470l571l776l979m184H93163
$$ 934082 931531 928776 925918 922959 919796 916531 913061 909490 905714 901735 897551 893163
1914.968H88469m898n204n408n816o123o530o837p245p755q265q674H06429
$$ 888469 883571 878367 872959 867143 861020 854490 847653 840408 832653 824388 815714 806429
1886.466G96531j0613j1224j2041j2959j3674j4796j5714j6939j8061F51122
$$ 796531 785918 774694 762653 749694 736020 721224 705510 688571 670510 651122
1862.349F30306k2143k3775k5408k7041k8776l0408l2143l3673l5102C35714
$$ 630306 608163 584388 558980 531939 503163 472755 440612 406939 371837 335714
1838.232B98878l7041l6633l5306l3265l0511k6836k2653j8368j4081C3878
$$ 298878 261837 225204 189898 156633 126122 99286 76633 58265 44184 33878
1814.115B6837m286k041j02J837L979O633R898J3572J7755K2142K6225A52245
$$ 26837 22551 20510 20408 22245 26224 32857 42755 56327 74082 96224 122449 152245
1785.614A85000L4898L6122L6531TL5714L2551L3061L1429K9796K8163E46122
$$ 185000 219898 256020 292551 329082 364796 397347 430408 461837 491633 519796 546122
1759.304E70714K3062K1428J9898J8469J7245J5919J4796J3775J2653G39694
$$ 570714 593776 615204 635102 653571 670816 686735 701531 715306 727959 739694
1735.187G50612J0102R286Q571P858P244O735O123N510N102M592M081H29388
$$ 750612 760714 770000 778571 786429 793673 800408 806531 812041 817143 821735 825816 829388
1706.686H32551K755K245J837J428o632M08j02n10j123j633k244k858H22551
$$ 832551 835306 837551 839388 840816 834184 834592 834490 833980 832857 831224 828980 826122 822551
1675.991H18265n204o020p041q163r388j0612j1939j3265j4694j5817F99388
$$ 818265 813061 807041 800000 791837 782449 771837 759898 746633 731939 716122 699388
1649.682F82041j7245j6633j5306j3673j1531r388p449n816m898m694E69898
$$ 682041 664796 648163 632857 619184 607653 598265 590816 585000 580102 575408 569898
1623.373E63061q775j0817j2551j3571j3367j1939q878m898J02N000D92755
$$ 563061 554286 543469 530918 517347 503980 492041 483163 478265 478367 483367 492755
1597.063E05306J4592J5102J4694J3367J1531R490P449N000K755K04E97143
$$ 505306 519898 535000 549694 563061 574592 584082 591531 596531 599286 599490 597143
1570.754E92347o633p857To735m081k04K551R489J3980J7653K0102K1429F65714
$$ 592347 585714 577857 570000 563265 559184 558980 561531 571020 585000 602653 622755 644184 665714
1540.06F86735J9898J8367J6735J5204J3469J2041J0714R388Q265P245H24388
$$ 686735 706633 725000 741735 756939 770408 782449 793163 802551 810816 818061 824388
1513.751H29796M796M081L470K857K449J939J530J123P14L06%q16o12H50612
$$ 829796 834592 838673 842143 845000 847449 849388 850918 852041 852755 853061 853061 852245 851633 850612
1480.864H49388j633j837k245k449k857l163l571l878m184m693n000H08367
$$ 849388 847755 845918 843673 841224 838367 835204 831633 827755 823571 818878 813878 808367
1452.362H02449o531o938p551q164q877r490j0408j1123j2143j3061F94082
$$ 802449 795918 788980 781429 773265 764388 754898 744490 733367 721224 708163 694082
1426.053F78673j6530j7959j9490k1021k2755k4489k6327k8163k5510D44286
$$ 678673 662143 644184 624694 603673 580918 556429 530102 501939 476429 444286
1401.936D10612l4898l5714l5918l5306l3878l1735k8673k4796k0408A13571
$$ 410612 375714 340000 304082 268776 234898 203163 174490 149694 129286 113571
1377.819A02857n816j123L572P959J2041J5918J8878K1020K1939K1837B39694
$$ 102857 97041 95918 99490 107449 119490 135408 154286 175306 197245 219082 239694
1351.51B58367J5919J2551R081N102J327k653o531j0102j3673j6837B33061
$$ 258367 274286 286837 295918 301020 302347 299694 293163 283061 269388 252551 233061
1325.2B11224k3469k4184k4285k3470k1530j9184j6122j2858r591B9694
$$ 211224 187755 163571 139286 115816 94286 75102 58980 46122 36531 29694
1301.083B5510k041J02K041M490P143J0408J4082J8061K2143K5714K8980A87959
$$ 25510 23469 23571 25612 30102 37245 47653 61735 79796 101939 127653 156633 187959
1272.582B20816L3776L3877L3470L2449L1326K9796K8061K6429K4694E17551
$$ 220816 254592 288469 321939 354388 385714 415510 443571 470000 494694 517551
1248.465E38571J9490J7755J6123J4898J3163J1735J0510R388P959O837F72143
$$ 538571 558061 575816 591939 606837 620000 631735 642245 651633 659592 666429 672143
1222.156F76735L673K653J633N10p14j939l367m796n510q062r898j1836F25204
$$ 676735 680408 683061 684694 685204 684490 682551 679184 674388 668878 660816 650918 639082 625204
1191.461F09082j8470k1020k3470k6020k8367l0613l2449l3367l3571C29286
$$ 609082 590612 569592 546122 520102 491735 461122 428673 395306 361735 329286
1167.344B99388k6123k0918j4592p551j02P653J4694K1224K6633L1021C65000
$$ 299388 273265 252347 237755 230204 230102 237755 252449 273673 300306 331327 365000
1141.035D00204L5408L4388L2857L0714K8266K5510K2857K0102J7347F62449
$$ 400204 435612 470000 502857 533571 561837 587347 610204 630306 647653 662449
1116.918F74592R592P143M693K449K04j632l163m082m184l367j429J327F86939
$$ 674592 684184 691327 696020 698469 698673 697041 693878 689796 685612 682245 680816 682143 686939
1086.224F95306J1633J4183J5817J6530J6633J5918J5204J3980J2857H39796
$$ 695306 706939 721122 736939 753469 770102 786020 801224 815204 828061 839796
1062.107H50408R592Q571P858P040O429N714N306M694M286L980L469I20612
$$ 850408 860000 868571 876429 883469 889898 895612 900918 905612 909898 913878 917347 920612
1033.605I23469K653K245K041J837J531J326J020P15N10J02j02n10r19I34694
$$ 923469 926122 928367 930408 932245 933776 935102 936122 936837 937347 937449 937347 936837 935918 934694
1000.719I32959k245k653l163l571m286l878l673l266k142q17P15K347I14796
$$ 932959 930714 928061 924898 921327 917041 913163 909490 906224 904082 903265 903980 906327 914796
970.024I19592N408N714N715N408N102M694K959L775L368L061K755I70000
$$ 919592 925000 930714 936429 941837 946939 951633 954592 958367 961735 964796 967551 970000
941.523I72143J939J836J633J429J428J225R18J020J021Q16TQ17P14I88367
$$ 972143 974082 975918 977551 978980 980408 981633 982551 983571 984592 985408 986224 987041 987755 988367
908.636I89082N10O12N10M08N11R285L06K05L06K04VJ02W%J02%Tj02A003061
$$ 989082 989592 990204 990714 991122 991633 1000918 1001224 1001429 1001735 1001939 1002143 1002347 1002551 1002653 1002755 1002857 1002959 1003061 1003061 1003163 1003163 1003163 1003061 1003061
853.825A002959j02k04j02k04l06Um09n10To12p15p14j020j021j224I93367
$$ 1002959 1002857 1002653 1002551 1002347 1002041 1001735 1001429 1001020 1000510 1000000 999388 998673 997959 996939 995918 994694 993367
814.361I91735j735k041k347k449k755k959k857Tk347j837j122j02I67245
$$ 991735 990000 987959 985612 983163 980408 977449 974592 971735 969388 967551 966429 966327 967245
783.667I68878K346K654K857K755K653K449K245J939J734J531J326I94490
$$ 968878 971224 973878 976735 979490 982143 984592 986837 988776 990510 992041 993367 994490
755.165I98776Q16P14N10N11L06UJ02U%Uj02k04j02k04l06k04l07m08A000408
$$ 998776 999592 1000306 1000816 1001327 1001633 1001939 1002245 1002347 1002449 1002551 1002551 1002551 1002551 1002449 1002245 1002143 1001939 1001633 1001429 1001122 1000714 1000408
704.739A000000m08n10n11j224o12o13p14j02q16q17r18Tj021j122I88571
$$ 1000000 999592 999082 998571 997347 996735 996122 995408 995306 994490 993673 992755 991837 990816 989694 988571
669.66I87347j327j530j531j632j735j939k143k245k449k653k857I62143
$$ 987347 986020 984490 982959 981327 979592 977653 975510 973265 970816 968163 965306 962143
641.158I58673l673m184m489n000n613o122o735p653q367r388j0408H75510
$$ 958673 955000 950816 946327 941327 935714 929592 922857 915204 906837 897449 887041 875510
612.656H61939k0306j5204j6327j7143j7449j7245j6122j4388j1939G06633
$$ 861939 841633 826429 810102 792959 775510 758265 742143 727755 715816 706633
588.539F99898n000m286m490n918p959j0408j3164j5510j7245j7857E80918
$$ 699898 694898 690612 686122 680204 672245 661837 648673 633163 615918 598061 580918
562.23E66224j0714n306R18P347J2960J7653K0510K2143K2245K0306F94286
$$ 566224 555510 550204 551122 558469 571429 589082 609592 631735 653980 674286 694286
535.921G12653J7041J5714J5000J4592J4388J4285J3878J3469J2858H55816
$$ 712653 729694 745408 760408 775000 789388 803673 817551 831020 843878 855816
511.804H66837J0102R183Q266P449O734O021N408M796M388L979L572I39898
$$ 866837 876939 886122 894388 901837 908571 914592 920000 924796 929184 933163 936735 939898
483.302I42755K653K347K143J939J734J531J429J224J123J020R18Q17I62347
$$ 942755 945408 947755 949898 951837 953571 955102 956531 957755 958878 959898 960816 961633 962347
452.608I62959N10M09M08L06K04T%J02j02Uk04l06Tm09m08n10To12I60816
$$ 962959 963469 963878 964286 964592 964796 965000 965000 965102 965000 964898 964796 964592 964286 963980 963571 963163 962653 962143 961531 960816
406.566I60102p14r19r18Tj021j122j225j224j327j428j531j633j734I42551
$$ 960102 959388 958469 957551 956633 955612 954490 953265 952041 950714 949286 947755 946122 944388 942551
373.68I40612k041k244k347k551k653k858l163l265l470l877m082I03673
$$ 940612 938571 936327 933980 931429 928776 925918 922755 919490 916020 912143 908061 903673
345.178H98878n102n613o122o633p347p959q673r694j0511j1632j2857G92857
$$ 898878 893776 888163 882041 875408 868061 860102 851429 841735 831224 819592 806735 792857
316.676G77653j6224j7143j7755j7858j7040j5409j2755r489n817k245F46837
$$ 777653 761429 744286 726531 708673 691633 676224 663469 653980 648163 645918 646837
290.367F49796L980M081L265J939J02j734l980o020q266j0306j2551F05612
$$ 649796 653776 657857 661122 663061 663163 661429 657449 651429 643163 632857 620306 605612
261.865E88776j9082k1225k3367k5612k7755k9898l1837l3673l5000C05204
$$ 588776 569694 548469 525102 499490 471735 441837 410000 376327 341327 305204
237.748B68776l6225l5204l3061l0102k6429k2245j7755j3367r490C8980
$$ 268776 232551 197347 164286 134184 107755 85510 67755 54388 44898 38980
213.631C6224J03K857O020R388J3265J7449K1429K5306K8265L0612B22959
$$ 36224 36327 39184 45204 54592 67857 85306 106735 132041 160306 190918 222959
187.322B55102L1633L0204K8265K5714K2858J9693J6225J2653Q877D56429
$$ 255102 286735 316939 345204 370918 393776 413469 429694 442347 451224 456429
163.205D57755k245n612q469r898j1531j1122r184n510o13N307J1530D27959
$$ 457755 455510 449898 441429 431531 420000 408878 399694 394184 393571 398878 410408 427959
134.703D50612K6531K8979L0205L0408K9592K8265K6530K4592K2857G19388
$$ 450612 477143 506122 536327 566735 596327 624592 651122 675714 698571 719388
110.587G38571J7551J5919J4592J3367J2245J1224J0307R489Q776Q061H67551
$$ 738571 756122 772041 786633 800000 812245 823469 833776 843265 852041 860102 867551
84.277H74592O428O021N612N204M898M592M388L979L878L571L470I29796
$$ 874592 881020 887041 892653 897857 902755 907347 911735 915714 919592 923163 926633 929796
55.775I32857K857K755K653K449K347K245K143K041J939J836J837I59694
$$ 932857 935714 938469 941122 943571 945918 948163 950306 952347 954286 956122 957959 959694
27.274I61327J530J531J428J327J326J327J224J225J122J123J020I76531
$$ 961327 962857 964388 965816 967143 968469 969796 971020 972245 973367 974490 975510 976531
-1.228I77551R18R19R18Q16R19Q16P14Q17P14TP15O12TP14O13N10I90204
$$ 977551 978469 979388 980306 981122 982041 982857 983571 984388 985102 985816 986531 987143 987755 988469 989082 989592 990204
-40.692I90714O13N10VM09I94286
$$ 990714 991327 991837 992347 992857 993367 993776 994286
-58.232I94694  $$checkpoint
##END= $$ end of IR
##TITLE= hydroxyacetone
##JCAMP-DX= 5.01
##DATA TYPE= RAMAN SPECTRUM
##DATA CLASS= XYDATA
##ORIGIN= WebMO
##OWNER= public domain
##LONGDATE= 2012/03/31 19:33:10.0997 -0500 $$ export date from JSpecView
##SPECTROMETER/DATA SYSTEM= computed
##$MODELS=
<Models>
<ModelData id="hydroxyacetone" type="MOL">
hydroxyacetone (1-propanol-2-one)
RLDSViewer          3D                             0

 11 10  0  0  0  0  0  0  0  0999 V2000
    0.8580    1.3254    0.0115 C   0  0  0  0  0  0  0  0  0  1
    0.6078   -0.1802    0.0044 C   0  0  0  0  0  0  0  0  0  2
   -0.8334   -0.7048    0.0361 C   0  0  0  0  0  0  0  0  0  3
   -1.7944    0.3384   -0.0334 O   0  0  0  0  0  0  0  0  0  4
   -2.6587   -0.0470   -0.0300 H   0  0  0  0  0  0  0  0  0  5
   -0.9790   -1.2725    0.9562 H   0  0  0  0  0  0  0  0  0  6
   -0.9731   -1.3899   -0.7993 H   0  0  0  0  0  0  0  0  0  7
    1.5506   -0.9668   -0.0266 O   0  0  0  0  0  0  0  0  0  8
    0.7151    1.7246    1.0146 H   0  0  0  0  0  0  0  0  0  9
    0.1740    1.8340   -0.6675 H   0  0  0  0  0  0  0  0  0 10
    1.8777    1.5358   -0.3060 H   0  0  0  0  0  0  0  0  0 11
  1  9  1  0  0  0
  1  2  1  0  0  0
  1 10  1  0  0  0
  1 11  1  0  0  0
  2  3  1  0  0  0
  2  8  2  0  0  0
  3  6  1  0  0  0
  3  4  1  0  0  0
  3  7  1  0  0  0
  4  5  1  0  0  0
M  END
  </ModelData>
 <ModelData id="2" type="XYZVIB" baseModel="hydroxyacetone" vibrationScale=".1">
11
Model[1]: Convg=0.7762D-08;-V/T=2.0027;Energy=NaN;Range=M.O.s;E(RHF)=-266.801820718 A.U.;PATH=Calculation 1;Input
C     0.00000    0.00000    0.00000
C     0.00000    0.00000    1.52632
C     1.33627    0.00000    2.27987
O     2.45286    0.10300    1.40868
H     3.24219    0.11794    1.93047
H     1.41107   -0.92114    2.85952
H     1.33983    0.83255    2.98248
O    -1.05928    0.00022    2.14786
H     0.23275   -0.99565   -0.37493
H     0.73995    0.70051   -0.38646
H    -0.97947    0.29345   -0.37314
11
Model[2]: Convg=0.7762D-08;-V/T=2.0027;Energy=-266.80182;Range=M.O.s;E(RHF)=-266.801820718 A.U.;PATH=Calculation 1;Standard
C     0.85802    1.32543    0.01145
C     0.60784   -0.18023    0.00440
C    -0.83344   -0.70478    0.03613
O    -1.79437    0.33836   -0.03340
H    -2.65868   -0.04699   -0.02995
H    -0.97898   -1.27251    0.95623
H    -0.97313   -1.38991   -0.79928
O     1.55057   -0.96680   -0.02660
H     0.71508    1.72456    1.01461
H     0.17399    1.83404   -0.66753
H     1.87769    1.53575   -0.30598
11
Model[3]: IRIntensity=30.2931 KM/Mole;ReducedMass=2.5583 AMU;ForceConstant=0.0303 mDyne/A;Frequency=141.7684 cm^-1;FrequencyLabel=A;PATH=Calculation 1;FrequenciesFrequencies
C     0.85802    1.32543    0.01145    0.01000    0.00000    0.11000
C     0.60784   -0.18023    0.00440    0.00000    0.00000    0.00000
C    -0.83344   -0.70478    0.03613    0.00000    0.01000    0.22000
O    -1.79437    0.33836   -0.03340   -0.01000   -0.02000   -0.20000
H    -2.65868   -0.04699   -0.02995    0.00000   -0.02000    0.06000
H    -0.97898   -1.27251    0.95623    0.02000    0.40000    0.46000
H    -0.97313   -1.38991   -0.79928   -0.01000   -0.34000    0.51000
O     1.55057   -0.96680   -0.02660   -0.01000    0.00000   -0.14000
H     0.71508    1.72456    1.01461    0.13000   -0.10000    0.17000
H     0.17399    1.83404   -0.66753   -0.05000    0.08000    0.23000
H     1.87769    1.53575   -0.30598   -0.02000    0.02000    0.02000
11
Model[4]: IRIntensity=127.2211 KM/Mole;ReducedMass=1.0744 AMU;ForceConstant=0.0283 mDyne/A;Frequency=211.5302 cm^-1;FrequencyLabel=A;PATH=Calculation 1;FrequenciesFrequencies
C     0.85802    1.32543    0.01145   -0.03000   -0.01000    0.01000
C     0.60784   -0.18023    0.00440    0.00000   -0.01000    0.00000
C    -0.83344   -0.70478    0.03613    0.00000   -0.01000   -0.03000
O    -1.79437    0.33836   -0.03340    0.02000    0.01000   -0.04000
H    -2.65868   -0.04699   -0.02995    0.00000    0.08000    0.92000
H    -0.97898   -1.27251    0.95623    0.00000    0.01000   -0.02000
H    -0.97313   -1.38991   -0.79928   -0.01000   -0.01000   -0.02000
O     1.55057   -0.96680   -0.02660    0.01000    0.00000    0.01000
H     0.71508    1.72456    1.01461   -0.25000    0.03000   -0.04000
H     0.17399    1.83404   -0.66753    0.08000   -0.05000   -0.14000
H     1.87769    1.53575   -0.30598    0.02000    0.01000    0.19000
11
Model[5]: IRIntensity=15.3270 KM/Mole;ReducedMass=1.1593 AMU;ForceConstant=0.0318 mDyne/A;Frequency=215.6549 cm^-1;FrequencyLabel=A;PATH=Calculation 1;FrequenciesFrequencies
C     0.85802    1.32543    0.01145   -0.05000   -0.01000    0.01000
C     0.60784   -0.18023    0.00440    0.00000   -0.02000    0.00000
C    -0.83344   -0.70478    0.03613    0.00000    0.00000    0.05000
O    -1.79437    0.33836   -0.03340    0.04000    0.03000    0.03000
H    -2.65868   -0.04699   -0.02995    0.03000    0.05000   -0.37000
H    -0.97898   -1.27251    0.95623    0.00000    0.03000    0.07000
H    -0.97313   -1.38991   -0.79928   -0.03000   -0.03000    0.07000
O     1.55057   -0.96680   -0.02660    0.01000   -0.01000   -0.05000
H     0.71508    1.72456    1.01461   -0.60000    0.10000   -0.12000
H     0.17399    1.83404   -0.66753    0.23000   -0.14000   -0.39000
H     1.87769    1.53575   -0.30598    0.08000    0.02000    0.47000
11
Model[6]: IRIntensity=11.4400 KM/Mole;ReducedMass=2.7587 AMU;ForceConstant=0.1444 mDyne/A;Frequency=298.0168 cm^-1;FrequencyLabel=A;PATH=Calculation 1;FrequenciesFrequencies
C     0.85802    1.32543    0.01145    0.25000    0.05000    0.01000
C     0.60784   -0.18023    0.00440    0.01000    0.09000    0.00000
C    -0.83344   -0.70478    0.03613    0.00000    0.05000    0.00000
O    -1.79437    0.33836   -0.03340   -0.20000   -0.13000    0.01000
H    -2.65868   -0.04699   -0.02995   -0.11000   -0.32000    0.11000
H    -0.97898   -1.27251    0.95623    0.09000    0.02000   -0.01000
H    -0.97313   -1.38991   -0.79928    0.10000    0.03000   -0.01000
O     1.55057   -0.96680   -0.02660   -0.06000    0.00000   -0.02000
H     0.71508    1.72456    1.01461   -0.02000    0.18000   -0.09000
H     0.17399    1.83404   -0.66753    0.56000    0.11000   -0.28000
H     1.87769    1.53575   -0.30598    0.39000   -0.16000    0.31000
11
Model[7]: IRIntensity=3.1458 KM/Mole;ReducedMass=6.1873 AMU;ForceConstant=1.0140 mDyne/A;Frequency=527.3939 cm^-1;FrequencyLabel=A;PATH=Calculation 1;FrequenciesFrequencies
C     0.85802    1.32543    0.01145    0.05000    0.16000    0.00000
C     0.60784   -0.18023    0.00440   -0.22000    0.12000    0.08000
C    -0.83344   -0.70478    0.03613    0.07000   -0.19000    0.01000
O    -1.79437    0.33836   -0.03340    0.34000   -0.12000   -0.01000
H    -2.65868   -0.04699   -0.02995    0.21000    0.20000   -0.01000
H    -0.97898   -1.27251    0.95623    0.05000   -0.29000   -0.05000
H    -0.97313   -1.38991   -0.79928    0.23000   -0.12000   -0.08000
O     1.55057   -0.96680   -0.02660   -0.34000    0.03000   -0.04000
H     0.71508    1.72456    1.01461    0.21000    0.36000   -0.06000
H     0.17399    1.83404   -0.66753    0.23000    0.29000   -0.09000
H     1.87769    1.53575   -0.30598    0.12000   -0.21000   -0.04000
11
Model[8]: IRIntensity=22.9570 KM/Mole;ReducedMass=3.4540 AMU;ForceConstant=0.6286 mDyne/A;Frequency=555.7874 cm^-1;FrequencyLabel=A;PATH=Calculation 1;FrequenciesFrequencies
C     0.85802    1.32543    0.01145    0.09000   -0.13000   -0.01000
C     0.60784   -0.18023    0.00440   -0.12000   -0.06000    0.03000
C    -0.83344   -0.70478    0.03613   -0.19000   -0.16000    0.02000
O    -1.79437    0.33836   -0.03340    0.02000    0.04000    0.00000
H    -2.65868   -0.04699   -0.02995   -0.09000    0.28000   -0.01000
H    -0.97898   -1.27251    0.95623   -0.30000   -0.15000    0.00000
H    -0.97313   -1.38991   -0.79928   -0.26000   -0.12000   -0.01000
O     1.55057   -0.96680   -0.02660    0.14000    0.25000   -0.02000
H     0.71508    1.72456    1.01461    0.24000   -0.02000   -0.03000
H     0.17399    1.83404   -0.66753    0.33000    0.09000   -0.07000
H     1.87769    1.53575   -0.30598    0.19000   -0.56000    0.02000
11
Model[9]: IRIntensity=9.3351 KM/Mole;ReducedMass=2.4107 AMU;ForceConstant=0.4990 mDyne/A;Frequency=592.7302 cm^-1;FrequencyLabel=A;PATH=Calculation 1;FrequenciesFrequencies
C     0.85802    1.32543    0.01145   -0.01000    0.00000   -0.01000
C     0.60784   -0.18023    0.00440    0.04000   -0.01000    0.30000
C    -0.83344   -0.70478    0.03613    0.00000    0.02000    0.03000
O    -1.79437    0.33836   -0.03340   -0.04000    0.01000   -0.05000
H    -2.65868   -0.04699   -0.02995   -0.02000   -0.03000    0.03000
H    -0.97898   -1.27251    0.95623   -0.31000   -0.25000   -0.19000
H    -0.97313   -1.38991   -0.79928    0.27000    0.27000   -0.22000
O     1.55057   -0.96680   -0.02660    0.03000   -0.02000   -0.13000
H     0.71508    1.72456    1.01461    0.09000    0.45000   -0.18000
H     0.17399    1.83404   -0.66753   -0.14000   -0.35000   -0.15000
H     1.87769    1.53575   -0.30598   -0.08000   -0.04000   -0.27000
11
Model[10]: IRIntensity=1.8242 KM/Mole;ReducedMass=3.5318 AMU;ForceConstant=1.2952 mDyne/A;Frequency=788.9515 cm^-1;FrequencyLabel=A;PATH=Calculation 1;FrequenciesFrequencies
C     0.85802    1.32543    0.01145    0.06000    0.32000    0.01000
C     0.60784   -0.18023    0.00440    0.09000   -0.07000   -0.03000
C    -0.83344   -0.70478    0.03613   -0.19000   -0.19000    0.00000
O    -1.79437    0.33836   -0.03340   -0.02000    0.02000    0.00000
H    -2.65868   -0.04699   -0.02995   -0.15000    0.30000   -0.02000
H    -0.97898   -1.27251    0.95623   -0.27000   -0.12000    0.04000
H    -0.97313   -1.38991   -0.79928   -0.34000   -0.20000    0.03000
O     1.55057   -0.96680   -0.02660    0.09000   -0.13000    0.00000
H     0.71508    1.72456    1.01461    0.01000    0.33000    0.00000
H     0.17399    1.83404   -0.66753    0.01000    0.25000    0.00000
H     1.87769    1.53575   -0.30598    0.03000    0.50000    0.00000
11
Model[11]: IRIntensity=3.3397 KM/Mole;ReducedMass=1.3218 AMU;ForceConstant=0.7455 mDyne/A;Frequency=978.3852 cm^-1;FrequencyLabel=A;PATH=Calculation 1;FrequenciesFrequencies
C     0.85802    1.32543    0.01145    0.01000    0.00000   -0.09000
C     0.60784   -0.18023    0.00440    0.01000    0.02000   -0.01000
C    -0.83344   -0.70478    0.03613   -0.01000   -0.01000    0.14000
O    -1.79437    0.33836   -0.03340    0.00000    0.00000   -0.03000
H    -2.65868   -0.04699   -0.02995   -0.01000    0.03000    0.02000
H    -0.97898   -1.27251    0.95623   -0.29000   -0.40000   -0.15000
H    -0.97313   -1.38991   -0.79928    0.27000    0.35000   -0.20000
O     1.55057   -0.96680   -0.02660    0.00000    0.00000    0.00000
H     0.71508    1.72456    1.01461   -0.12000   -0.52000    0.11000
H     0.17399    1.83404   -0.66753    0.02000    0.29000    0.14000
H     1.87769    1.53575   -0.30598    0.06000    0.18000    0.19000
11
Model[12]: IRIntensity=10.5624 KM/Mole;ReducedMass=1.6442 AMU;ForceConstant=1.1511 mDyne/A;Frequency=1090.0644 cm^-1;FrequencyLabel=A;PATH=Calculation 1;FrequenciesFrequencies
C     0.85802    1.32543    0.01145   -0.13000    0.09000    0.00000
C     0.60784   -0.18023    0.00440   -0.06000   -0.11000    0.00000
C    -0.83344   -0.70478    0.03613    0.06000    0.05000    0.02000
O    -1.79437    0.33836   -0.03340   -0.02000    0.02000   -0.01000
H    -2.65868   -0.04699   -0.02995    0.11000   -0.25000    0.02000
H    -0.97898   -1.27251    0.95623    0.00000   -0.01000   -0.03000
H    -0.97313   -1.38991   -0.79928    0.05000    0.11000   -0.02000
O     1.55057   -0.96680   -0.02660    0.06000   -0.05000    0.00000
H     0.71508    1.72456    1.01461    0.27000    0.15000    0.03000
H     0.17399    1.83404   -0.66753    0.30000    0.57000   -0.08000
H     1.87769    1.53575   -0.30598    0.03000   -0.57000    0.08000
11
Model[13]: IRIntensity=59.9849 KM/Mole;ReducedMass=4.7656 AMU;ForceConstant=3.7579 mDyne/A;Frequency=1156.8902 cm^-1;FrequencyLabel=A;PATH=Calculation 1;FrequenciesFrequencies
C     0.85802    1.32543    0.01145    0.03000    0.02000    0.00000
C     0.60784   -0.18023    0.00440   -0.04000   -0.07000    0.00000
C    -0.83344   -0.70478    0.03613   -0.28000    0.34000   -0.01000
O    -1.79437    0.33836   -0.03340    0.20000   -0.24000    0.01000
H    -2.65868   -0.04699   -0.02995    0.28000   -0.37000    0.02000
H    -0.97898   -1.27251    0.95623   -0.37000    0.26000   -0.05000
H    -0.97313   -1.38991   -0.79928   -0.37000    0.31000    0.00000
O     1.55057   -0.96680   -0.02660    0.06000    0.00000    0.00000
H     0.71508    1.72456    1.01461   -0.04000    0.04000   -0.01000
H     0.17399    1.83404   -0.66753   -0.03000   -0.02000    0.02000
H     1.87769    1.53575   -0.30598   -0.01000    0.20000   -0.02000
11
Model[14]: IRIntensity=0.3913 KM/Mole;ReducedMass=1.9321 AMU;ForceConstant=1.6976 mDyne/A;Frequency=1221.1745 cm^-1;FrequencyLabel=A;PATH=Calculation 1;FrequenciesFrequencies
C     0.85802    1.32543    0.01145    0.01000   -0.01000    0.13000
C     0.60784   -0.18023    0.00440   -0.01000    0.00000   -0.21000
C    -0.83344   -0.70478    0.03613    0.00000    0.01000    0.14000
O    -1.79437    0.33836   -0.03340    0.00000    0.00000   -0.04000
H    -2.65868   -0.04699   -0.02995    0.00000    0.00000    0.01000
H    -0.97898   -1.27251    0.95623    0.02000   -0.42000   -0.12000
H    -0.97313   -1.38991   -0.79928   -0.01000    0.39000   -0.18000
O     1.55057   -0.96680   -0.02660    0.00000    0.00000    0.04000
H     0.71508    1.72456    1.01461    0.06000    0.53000   -0.09000
H     0.17399    1.83404   -0.66753    0.00000   -0.38000   -0.15000
H     1.87769    1.53575   -0.30598   -0.09000   -0.11000   -0.25000
11
Model[15]: IRIntensity=156.7310 KM/Mole;ReducedMass=1.6999 AMU;ForceConstant=1.6848 mDyne/A;Frequency=1296.9924 cm^-1;FrequencyLabel=A;PATH=Calculation 1;FrequenciesFrequencies
C     0.85802    1.32543    0.01145   -0.09000   -0.03000    0.01000
C     0.60784   -0.18023    0.00440    0.11000    0.14000   -0.01000
C    -0.83344   -0.70478    0.03613   -0.07000    0.04000    0.00000
O    -1.79437    0.33836   -0.03340    0.01000   -0.09000    0.01000
H    -2.65868   -0.04699   -0.02995   -0.35000    0.74000   -0.04000
H    -0.97898   -1.27251    0.95623    0.13000    0.00000    0.01000
H    -0.97313   -1.38991   -0.79928    0.16000    0.00000    0.00000
O     1.55057   -0.96680   -0.02660    0.02000   -0.05000    0.00000
H     0.71508    1.72456    1.01461    0.15000   -0.03000    0.04000
H     0.17399    1.83404   -0.66753    0.09000    0.08000   -0.08000
H     1.87769    1.53575   -0.30598    0.00000   -0.42000    0.04000
11
Model[16]: IRIntensity=90.2193 KM/Mole;ReducedMass=1.6954 AMU;ForceConstant=1.8845 mDyne/A;Frequency=1373.5173 cm^-1;FrequencyLabel=A;PATH=Calculation 1;FrequenciesFrequencies
C     0.85802    1.32543    0.01145   -0.05000   -0.02000    0.01000
C     0.60784   -0.18023    0.00440    0.15000    0.16000   -0.01000
C    -0.83344   -0.70478    0.03613   -0.03000   -0.07000    0.00000
O    -1.79437    0.33836   -0.03340    0.02000    0.03000    0.00000
H    -2.65868   -0.04699   -0.02995    0.28000   -0.56000    0.03000
H    -0.97898   -1.27251    0.95623   -0.48000    0.02000   -0.01000
H    -0.97313   -1.38991   -0.79928   -0.44000   -0.02000    0.01000
O     1.55057   -0.96680   -0.02660   -0.04000   -0.02000    0.00000
H     0.71508    1.72456    1.01461    0.09000   -0.10000    0.05000
H     0.17399    1.83404   -0.66753    0.03000   -0.05000   -0.09000
H     1.87769    1.53575   -0.30598    0.01000   -0.31000    0.02000
11
Model[17]: IRIntensity=2.3550 KM/Mole;ReducedMass=1.1006 AMU;ForceConstant=1.2508 mDyne/A;Frequency=1388.8541 cm^-1;FrequencyLabel=A;PATH=Calculation 1;FrequenciesFrequencies
C     0.85802    1.32543    0.01145    0.00000    0.00000   -0.03000
C     0.60784   -0.18023    0.00440    0.01000    0.01000    0.07000
C    -0.83344   -0.70478    0.03613    0.00000    0.00000    0.03000
O    -1.79437    0.33836   -0.03340    0.00000    0.00000   -0.04000
H    -2.65868   -0.04699   -0.02995    0.00000    0.00000   -0.02000
H    -0.97898   -1.27251    0.95623    0.64000   -0.26000   -0.02000
H    -0.97313   -1.38991   -0.79928   -0.66000    0.24000   -0.06000
O     1.55057   -0.96680   -0.02660    0.00000    0.00000   -0.01000
H     0.71508    1.72456    1.01461    0.01000   -0.09000    0.01000
H     0.17399    1.83404   -0.66753   -0.02000    0.05000    0.03000
H     1.87769    1.53575   -0.30598    0.02000    0.01000    0.07000
11
Model[18]: IRIntensity=17.8692 KM/Mole;ReducedMass=1.2779 AMU;ForceConstant=1.8228 mDyne/A;Frequency=1555.9320 cm^-1;FrequencyLabel=A;PATH=Calculation 1;FrequenciesFrequencies
C     0.85802    1.32543    0.01145    0.04000    0.14000    0.01000
C     0.60784   -0.18023    0.00440   -0.04000   -0.02000    0.00000
C    -0.83344   -0.70478    0.03613    0.00000    0.01000    0.00000
O    -1.79437    0.33836   -0.03340    0.00000    0.00000    0.00000
H    -2.65868   -0.04699   -0.02995    0.00000   -0.01000    0.00000
H    -0.97898   -1.27251    0.95623    0.06000    0.00000    0.00000
H    -0.97313   -1.38991   -0.79928    0.05000    0.00000    0.00000
O     1.55057   -0.96680   -0.02660    0.01000    0.00000    0.00000
H     0.71508    1.72456    1.01461   -0.20000   -0.52000    0.23000
H     0.17399    1.83404   -0.66753   -0.21000   -0.48000   -0.20000
H     1.87769    1.53575   -0.30598    0.09000   -0.49000   -0.19000
11
Model[19]: IRIntensity=2.6238 KM/Mole;ReducedMass=1.4760 AMU;ForceConstant=2.1760 mDyne/A;Frequency=1581.8153 cm^-1;FrequencyLabel=A;PATH=Calculation 1;FrequenciesFrequencies
C     0.85802    1.32543    0.01145    0.02000    0.02000    0.00000
C     0.60784   -0.18023    0.00440   -0.01000   -0.05000    0.00000
C    -0.83344   -0.70478    0.03613    0.18000    0.02000    0.00000
O    -1.79437    0.33836   -0.03340   -0.02000   -0.06000    0.00000
H    -2.65868   -0.04699   -0.02995   -0.22000    0.41000   -0.02000
H    -0.97898   -1.27251    0.95623   -0.58000    0.15000   -0.05000
H    -0.97313   -1.38991   -0.79928   -0.58000    0.16000    0.03000
O     1.55057   -0.96680   -0.02660   -0.02000    0.02000    0.00000
H     0.71508    1.72456    1.01461   -0.09000    0.01000   -0.01000
H     0.17399    1.83404   -0.66753   -0.04000    0.01000    0.05000
H     1.87769    1.53575   -0.30598    0.02000   -0.04000   -0.03000
11
Model[20]: IRIntensity=22.6043 KM/Mole;ReducedMass=1.0753 AMU;ForceConstant=1.6303 mDyne/A;Frequency=1604.1954 cm^-1;FrequencyLabel=A;PATH=Calculation 1;FrequenciesFrequencies
C     0.85802    1.32543    0.01145   -0.05000    0.02000    0.00000
C     0.60784   -0.18023    0.00440    0.01000   -0.04000    0.00000
C    -0.83344   -0.70478    0.03613    0.01000    0.01000    0.00000
O    -1.79437    0.33836   -0.03340    0.00000    0.00000    0.00000
H    -2.65868   -0.04699   -0.02995   -0.02000    0.04000    0.00000
H    -0.97898   -1.27251    0.95623   -0.03000   -0.02000   -0.02000
H    -0.97313   -1.38991   -0.79928   -0.01000   -0.01000    0.02000
O     1.55057   -0.96680   -0.02660   -0.02000    0.02000    0.00000
H     0.71508    1.72456    1.01461    0.64000   -0.19000    0.18000
H     0.17399    1.83404   -0.66753    0.18000   -0.30000   -0.46000
H     1.87769    1.53575   -0.30598   -0.01000    0.33000    0.27000
11
Model[21]: IRIntensity=6.8437 KM/Mole;ReducedMass=1.0582 AMU;ForceConstant=1.6622 mDyne/A;Frequency=1632.7592 cm^-1;FrequencyLabel=A;PATH=Calculation 1;FrequenciesFrequencies
C     0.85802    1.32543    0.01145   -0.01000   -0.02000    0.05000
C     0.60784   -0.18023    0.00440    0.01000    0.00000    0.02000
C    -0.83344   -0.70478    0.03613    0.01000    0.02000   -0.01000
O    -1.79437    0.33836   -0.03340    0.00000    0.00000    0.00000
H    -2.65868   -0.04699   -0.02995   -0.01000    0.01000    0.00000
H    -0.97898   -1.27251    0.95623    0.00000   -0.16000   -0.11000
H    -0.97313   -1.38991   -0.79928   -0.05000   -0.15000    0.14000
O     1.55057   -0.96680   -0.02660   -0.01000    0.00000    0.00000
H     0.71508    1.72456    1.01461   -0.20000   -0.22000    0.09000
H     0.17399    1.83404   -0.66753    0.48000    0.21000   -0.29000
H     1.87769    1.53575   -0.30598   -0.24000    0.19000   -0.60000
11
Model[22]: IRIntensity=5.8440 KM/Mole;ReducedMass=1.0810 AMU;ForceConstant=1.7176 mDyne/A;Frequency=1642.2224 cm^-1;FrequencyLabel=A;PATH=Calculation 1;FrequenciesFrequencies
C     0.85802    1.32543    0.01145    0.00000    0.00000    0.02000
C     0.60784   -0.18023    0.00440    0.00000    0.00000    0.01000
C    -0.83344   -0.70478    0.03613   -0.01000   -0.08000    0.00000
O    -1.79437    0.33836   -0.03340    0.00000   -0.01000    0.00000
H    -2.65868   -0.04699   -0.02995    0.00000    0.00000    0.00000
H    -0.97898   -1.27251    0.95623    0.07000    0.55000    0.38000
H    -0.97313   -1.38991   -0.79928    0.05000    0.50000   -0.45000
O     1.55057   -0.96680   -0.02660    0.00000    0.00000    0.00000
H     0.71508    1.72456    1.01461   -0.03000   -0.08000    0.04000
H     0.17399    1.83404   -0.66753    0.15000    0.05000   -0.11000
H     1.87769    1.53575   -0.30598   -0.07000    0.07000   -0.17000
11
Model[23]: IRIntensity=169.8189 KM/Mole;ReducedMass=8.0502 AMU;ForceConstant=15.5257 mDyne/A;Frequency=1809.2427 cm^-1;FrequencyLabel=A;PATH=Calculation 1;FrequenciesFrequencies
C     0.85802    1.32543    0.01145   -0.02000    0.05000    0.00000
C     0.60784   -0.18023    0.00440    0.49000   -0.41000   -0.02000
C    -0.83344   -0.70478    0.03613   -0.09000    0.03000    0.00000
O    -1.79437    0.33836   -0.03340    0.00000    0.00000    0.00000
H    -2.65868   -0.04699   -0.02995   -0.01000    0.00000    0.00000
H    -0.97898   -1.27251    0.95623    0.24000    0.01000    0.06000
H    -0.97313   -1.38991   -0.79928    0.28000    0.01000   -0.06000
O     1.55057   -0.96680   -0.02660   -0.30000    0.25000    0.01000
H     0.71508    1.72456    1.01461   -0.18000    0.09000   -0.04000
H     0.17399    1.83404   -0.66753   -0.07000    0.20000    0.16000
H     1.87769    1.53575   -0.30598    0.07000   -0.38000   -0.06000
11
Model[24]: IRIntensity=33.9945 KM/Mole;ReducedMass=1.0595 AMU;ForceConstant=6.2808 mDyne/A;Frequency=3172.0153 cm^-1;FrequencyLabel=A;PATH=Calculation 1;FrequenciesFrequencies
C     0.85802    1.32543    0.01145    0.00000    0.01000    0.00000
C     0.60784   -0.18023    0.00440    0.00000    0.00000    0.00000
C    -0.83344   -0.70478    0.03613    0.02000    0.06000   -0.02000
O    -1.79437    0.33836   -0.03340    0.00000    0.00000    0.00000
H    -2.65868   -0.04699   -0.02995    0.00000    0.01000    0.00000
H    -0.97898   -1.27251    0.95623   -0.11000   -0.42000    0.71000
H    -0.97313   -1.38991   -0.79928   -0.06000   -0.32000   -0.42000
O     1.55057   -0.96680   -0.02660    0.00000    0.00000    0.00000
H     0.71508    1.72456    1.01461    0.01000   -0.03000   -0.08000
H     0.17399    1.83404   -0.66753    0.05000   -0.04000    0.05000
H     1.87769    1.53575   -0.30598   -0.07000   -0.01000    0.02000
11
Model[25]: IRIntensity=2.2133 KM/Mole;ReducedMass=1.0362 AMU;ForceConstant=6.1648 mDyne/A;Frequency=3177.7694 cm^-1;FrequencyLabel=A;PATH=Calculation 1;FrequenciesFrequencies
C     0.85802    1.32543    0.01145    0.00000   -0.05000    0.00000
C     0.60784   -0.18023    0.00440    0.00000    0.00000    0.00000
C    -0.83344   -0.70478    0.03613    0.00000    0.01000    0.00000
O    -1.79437    0.33836   -0.03340    0.00000    0.00000    0.00000
H    -2.65868   -0.04699   -0.02995    0.00000    0.00000    0.00000
H    -0.97898   -1.27251    0.95623   -0.02000   -0.06000    0.10000
H    -0.97313   -1.38991   -0.79928   -0.01000   -0.04000   -0.06000
O     1.55057   -0.96680   -0.02660    0.00000    0.00000    0.00000
H     0.71508    1.72456    1.01461   -0.08000    0.22000    0.56000
H     0.17399    1.83404   -0.66753   -0.38000    0.27000   -0.37000
H     1.87769    1.53575   -0.30598    0.47000    0.08000   -0.15000
11
Model[26]: IRIntensity=35.5291 KM/Mole;ReducedMass=1.1053 AMU;ForceConstant=6.7195 mDyne/A;Frequency=3212.2458 cm^-1;FrequencyLabel=A;PATH=Calculation 1;FrequenciesFrequencies
C     0.85802    1.32543    0.01145    0.00000    0.00000    0.00000
C     0.60784   -0.18023    0.00440    0.00000    0.00000    0.00000
C    -0.83344   -0.70478    0.03613    0.00000   -0.02000   -0.09000
O    -1.79437    0.33836   -0.03340    0.00000    0.00000    0.00000
H    -2.65868   -0.04699   -0.02995    0.00000    0.00000    0.00000
H    -0.97898   -1.27251    0.95623   -0.08000   -0.28000    0.44000
H    -0.97313   -1.38991   -0.79928    0.11000    0.53000    0.65000
O     1.55057   -0.96680   -0.02660    0.00000    0.00000    0.00000
H     0.71508    1.72456    1.01461    0.00000   -0.01000   -0.02000
H     0.17399    1.83404   -0.66753   -0.01000    0.01000   -0.01000
H     1.87769    1.53575   -0.30598    0.01000    0.00000    0.00000
11
Model[27]: IRIntensity=11.5745 KM/Mole;ReducedMass=1.1019 AMU;ForceConstant=6.8422 mDyne/A;Frequency=3246.3551 cm^-1;FrequencyLabel=A;PATH=Calculation 1;FrequenciesFrequencies
C     0.85802    1.32543    0.01145    0.04000   -0.01000    0.08000
C     0.60784   -0.18023    0.00440    0.00000    0.00000    0.00000
C    -0.83344   -0.70478    0.03613    0.00000    0.00000    0.00000
O    -1.79437    0.33836   -0.03340    0.00000    0.00000    0.00000
H    -2.65868   -0.04699   -0.02995    0.00000    0.00000    0.00000
H    -0.97898   -1.27251    0.95623    0.00000    0.01000   -0.02000
H    -0.97313   -1.38991   -0.79928    0.00000   -0.01000   -0.01000
O     1.55057   -0.96680   -0.02660    0.00000    0.00000    0.00000
H     0.71508    1.72456    1.01461    0.10000   -0.25000   -0.61000
H     0.17399    1.83404   -0.66753   -0.47000    0.35000   -0.45000
H     1.87769    1.53575   -0.30598   -0.07000   -0.01000    0.04000
11
Model[28]: IRIntensity=14.2616 KM/Mole;ReducedMass=1.1046 AMU;ForceConstant=6.9017 mDyne/A;Frequency=3256.4899 cm^-1;FrequencyLabel=A;PATH=Calculation 1;FrequenciesFrequencies
C     0.85802    1.32543    0.01145    0.09000   -0.01000   -0.04000
C     0.60784   -0.18023    0.00440    0.00000    0.00000    0.00000
C    -0.83344   -0.70478    0.03613    0.00000    0.00000    0.00000
O    -1.79437    0.33836   -0.03340    0.00000    0.00000    0.00000
H    -2.65868   -0.04699   -0.02995    0.00000    0.00000    0.00000
H    -0.97898   -1.27251    0.95623    0.00000    0.00000    0.00000
H    -0.97313   -1.38991   -0.79928    0.00000    0.01000    0.01000
O     1.55057   -0.96680   -0.02660    0.00000    0.00000    0.00000
H     0.71508    1.72456    1.01461   -0.04000    0.15000    0.38000
H     0.17399    1.83404   -0.66753   -0.17000    0.13000   -0.19000
H     1.87769    1.53575   -0.30598   -0.81000   -0.16000    0.25000
11
Model[29]: IRIntensity=67.8215 KM/Mole;ReducedMass=1.0672 AMU;ForceConstant=10.7074 mDyne/A;Frequency=4126.6558 cm^-1;FrequencyLabel=A;PATH=Calculation 1;FrequenciesFrequencies
C     0.85802    1.32543    0.01145    0.00000    0.00000    0.00000
C     0.60784   -0.18023    0.00440    0.00000    0.00000    0.00000
C    -0.83344   -0.70478    0.03613    0.00000    0.00000    0.00000
O    -1.79437    0.33836   -0.03340   -0.06000   -0.02000    0.00000
H    -2.65868   -0.04699   -0.02995    0.92000    0.40000    0.00000
H    -0.97898   -1.27251    0.95623    0.00000    0.00000    0.00000
H    -0.97313   -1.38991   -0.79928    0.00000    0.00000    0.00000
O     1.55057   -0.96680   -0.02660    0.00000    0.00000    0.00000
H     0.71508    1.72456    1.01461    0.00000    0.00000    0.00000
H     0.17399    1.83404   -0.66753    0.00000    0.00000    0.00000
H     1.87769    1.53575   -0.30598    0.00000    0.00000    0.00000
  </ModelData>
</Models>
##$PEAKS=
<Peaks type="RAMAN" xUnitsExpected="1/cm"  >
<PeakData id="1" title="O-H stretch (~4125 cm-1)" peakShape="broad" model="2.29" xMax="4150" xMin="4100"    />
<PeakData id="2" title="asymm stretch of methyl C-H group (~3246 cm-1)" peakShape="broad" model="2.27" xMax="3270" xMin="3230"    />
<PeakData id="3" title="asymm stretch of methylene C-H group (~3211 cm-1)" peakShape="broad" model="2.26" xMax="3228" xMin="3191"    />
<PeakData id="4" title="symm stretch of methyl C-H group (~3176 cm-1)" peakShape="broad" model="2.25" xMax="3186" xMin="3160"    />
<PeakData id="5" title="Carbonyl stretching band (~1808 cm-1)" peakShape="broad" model="2.23" xMax="1828" xMin="1788"      />
<PeakData id="6" title="asymm stretch of methyl group (~1606 cm-1)" peakShape="broad" model="2.20" xMax="1626" xMin="1586"    />
<PeakData id="7" title="symm stretch of methyl group (~1558 cm-1)" peakShape="broad" model="2.18" xMax="1578" xMin="1538"     />
<PeakData id="8" title="asymm stretch of methyl group (~1373 cm-1)" peakShape="broad" model="2.16" xMax="1393" xMin="1353"    />
<PeakData id="9" title=" (~1299 cm-1)" peakShape="broad" model="2.15" xMax="1319" xMin="1279"    />
<PeakData id="10" title="C-C of aromatic group (~1156 cm-1)" peakShape="broad" model="2.13" xMax="1176" xMin="1136"    />
<PeakData id="11" title="symm stretch of CH3 group (~1093 cm-1)" peakShape="broad" model="2.12" xMax="1113" xMin="1073"    />
<PeakData id="12" title="C-H twist of methyl group (~979 cm-1)" peakShape="broad" model="2.11" xMax="999" xMin="959"    />
<PeakData id="13" title="scissors of aromatic C-H groups (~788 cm-1)" peakShape="broad" model="2.10" xMax="808" xMin="768"    />
<PeakData id="14" title="scissors of CH group (~568 cm-1)" peakShape="broad" model="2.8" xMax="588" xMin="550"    />
<PeakData id="15" title="scissors of CH group (~529 cm-1)" peakShape="broad" model="2.7" xMax="548" xMin="509"    />
<PeakData id="16" title="symm stretch of CH3 group (~295 cm-1)" peakShape="broad" model="2.6" xMax="315" xMin="275"    />
<PeakData id="17" title="symm stretch of CH group (~214 cm-1)" peakShape="broad" model="2.5" xMax="234" xMin="194"    />
<PeakData id="18" title="asymm bend of CH3 group (~143 cm-1)" peakShape="broad" model="2.3" xMax="163" xMin="123"    />
</Peaks>
##XUNITS= 1/CM
##YUNITS= RAMAN INTENSITY
##XFACTOR= 1
##YFACTOR= 2.330600E-06
##FIRSTX= 4.326656E+03
##FIRSTY= 9.200000E-03
##LASTX= -5.823200E+01
##NPOINTS= 2001
##MINY= 0
##MAXY= 2.330600
##XYDATA= (X++(Y..Y))
4326.656C947Q6UJ29Q5Q6J29Q6J29J28J29TJ28J29TJ71J29J72J71J72F608
$$ 3947 4033 4119 4205 4334 4419 4505 4634 4720 4849 4977 5106 5235 5363 5492 5621 5792 5921 6093 6264 6436 6608
4278.422F779K15K14K15TK14K57K58K57L01L00TL44L43TL86L87M29TM72A3173
$$ 6779 6994 7208 7423 7638 7852 8109 8367 8624 8925 9225 9525 9869 10212 10555 10941 11328 11757 12186 12658 13173
4232.381A3687N58O01O44O86P30P72Q15Q58R44J030J073J158J287J331B7675
$$ 13687 14245 14846 15490 16176 16906 17678 18493 19351 20295 21325 22398 23556 24843 26174 27675
4197.302B9263J716J931K060K231K488K746L004L304L690M076M548N063G1827
$$ 29263 30979 32910 34970 37201 39689 42435 45439 48743 52433 56509 61057 66120 71827
4166.607G8220P252Q152R225J0512J1929J3558J5490J7506J9823K2184B38394
$$ 78220 85472 93624 102849 113361 125290 138848 154338 171844 191667 213851 238394
4140.298B65039K8147K8534K7203K3771J7892R869N15q882j7077k3256C24809
$$ 265039 293186 321720 348923 372694 390586 400455 400970 392088 375011 351755 324809
4113.989B96361k8276k6860k4800k2441k0080j7764j5661j3773j2100A03965
$$ 296361 268085 241225 216425 193984 173904 156140 140479 126706 114606 103965
4089.872I4568q281p294o479n793n149m591m119l733l347l046k746k489C5184
$$ 94568 86287 78993 72514 66721 61572 56981 52862 49129 45782 42736 39990 37501 35184
4059.178C3125j931j760j587j502j373j287j159j115r87Tq58q15p73A6262
$$ 33125 31194 29434 27847 26345 24972 23685 22526 21411 20424 19437 18579 17764 16991 16262
4026.291A5575o43o01n58Tm72m71m72m30l86Ul43l01l00Tl01k57k58G895
$$ 15575 14932 14331 13773 13215 12743 12272 11800 11370 10984 10598 10212 9869 9568 9268 8968 8667 8410 8152 7895
3982.442G680k57k15k14j72k14j72Tj71j29j72j28j72j29j28j29Tj28D763
$$ 7680 7423 7208 6994 6822 6608 6436 6264 6093 5964 5792 5664 5492 5363 5235 5106 4977 4849 4763
3940.786D634q6j29q5q6j29q6Tq5q6m3q6Um2q6m3q6m3q6m3m2q6m3Uq6B660
$$ 4634 4548 4419 4334 4248 4119 4033 3947 3862 3776 3733 3647 3561 3475 3433 3347 3304 3218 3175 3089 3046 3004 2918 2875 2832 2789 2703 2660
3879.397B617m3m2m3X%m3V%m2m3T%m3T%m3T%m3T%m3%m3%m2%m3%m3%m3A459
$$ 2617 2574 2532 2489 2446 2403 2360 2317 2274 2274 2231 2188 2145 2102 2102 2060 2017 1974 1974 1931 1888 1888 1845 1802 1802 1759 1716 1716 1673 1673 1630 1630 1588 1588 1545 1545 1502 1502 1459 1459
3791.7A416%Tm3%m3%Tm3%m3%Tm3%Tm3%Tm2%Um3%Tm3%Um3r87%U1P72G72
$$ 1416 1416 1416 1373 1373 1330 1330 1330 1287 1287 1244 1244 1244 1201 1201 1201 1158 1158 1158 1116 1116 1116 1116 1073 1073 1073 1030 1030 1030 1030 987 0 0 0 0 0 0 0 0 0 0 0 0 0 0 0 0 0 0 0 0 0 0 0 0 0 0 0 0 0 0 0 0 772 772
3649.191G72M3O44%TM3%M3%TM3%M2%M3%M3%P73M3%M2M3T%M3V%M3UJ501D505
$$ 772 815 1459 1459 1459 1502 1502 1545 1545 1545 1588 1588 1630 1630 1673 1673 1716 1716 2489 2532 2532 2574 2617 2660 2660 2703 2746 2789 2832 2832 2875 2918 2961 4462 4505
3572.455D591Q58Q6M3Q6TM2Q6VM3Q5Q6VJ28Q6UJ29Q5Q6J29Q6J29J28G852
$$ 4591 5449 5535 5578 5664 5750 5792 5878 5964 6050 6136 6179 6264 6350 6436 6522 6608 6736 6822 6908 6994 7123 7208 7294 7423 7509 7638 7766 7852
3508.874G981J28J29UJ28J29TJ71J29J72J29J71J72J29J71J72K14J72A0856
$$ 7981 8109 8238 8367 8496 8624 8753 8882 9053 9182 9354 9483 9654 9826 9955 10126 10298 10512 10684 10856
3465.025A1070J72K14K15K14K15K57K15K57K58K57K58K57L00L01L00A5060
$$ 11070 11242 11456 11671 11885 12100 12357 12572 12829 13087 13344 13602 13859 14159 14460 14760 15060
3427.754A5361L43TL44L86VM29TM72UN15TN58TO00O01O44O43P30P29B7032
$$ 15361 15704 16047 16391 16777 17163 17549 17935 18364 18793 19265 19737 20209 20724 21239 21797 22355 22955 23556 24200 24843 25573 26302 27032
3375.135B7847Q15Q58R44TR87J073J115J159J244J287J373J459J502D4238
$$ 27847 28662 29520 30464 31408 32395 33468 34583 35742 36986 38273 39646 41105 42607 44238
3342.249D5954J845J931K102K188K360K532K703K918L132L390L647L947H2940
$$ 45954 47799 49730 51832 54020 56380 58912 61615 64533 67665 71055 74702 78649 82940
3311.554H7617N063N578O093O693P380Q196R053J0041J1241J2572J4117A99519
$$ 87617 92680 98258 104351 111044 118424 126620 135673 145714 156955 169527 183644 199519
3283.053B17369K0123K2741K5573K8662L1881L5098L8016M0118M1063E40891
$$ 217369 237492 260233 285806 314468 346349 381447 419463 459581 500644 540891
3258.936E78091L1966K4672J6091O993j759r396j5190j8793j9952j8879E57882
$$ 578091 610057 634729 650820 657813 656054 646658 631468 612675 592723 573844 557882
3232.626E46211o565j115M291R225J3301J6004J7163J6434J4245J1156F48588
$$ 546211 539646 538531 542822 552047 565348 581352 598515 614949 629194 640350 648588
3206.317F55067O565Q753J2958J8708K5358L2224L8402M3036M4838M2822I65030
$$ 655067 661632 670385 683343 702051 727409 759633 798035 841071 885909 928731 965030
3180.008I90045R955p380k4843m0462n2776o0972o5047o5606o3374n9427E05621
$$ 990045 1000000 992620 967777 927315 874539 813567 748520 682914 619540 560113 505621
3153.698D56449m3937l9046l4497l0508k6946k3813k1111j8750j6691A86261
$$ 456449 412512 373466 338969 308461 281515 257702 236591 217841 201150 186261
3129.582A72874j1971j0813r740q882q023p338o650o136n621n192m762H3369
$$ 172874 160903 150090 140350 131468 123445 116107 109457 103321 97700 92508 87746 83369
3101.08G9293l776l518l304l047k832k660k488k360k189k059j931j845D5525
$$ 79293 75517 71999 68695 65648 62816 60156 57668 55308 53119 51060 49129 47284 45525
3070.386D3894j544j459j416j287j288j158j159j072j030r87r44r01B8791
$$ 43894 42350 40891 39475 38188 36900 35742 34583 33511 32481 31494 30550 29649 28791
3039.691B7976p73p29p30o86o87o43o01Tn57n15n58m72n15m72m29Vl86A6948
$$ 27976 27203 26474 25744 25058 24371 23728 23127 22526 21969 21454 20896 20424 19909 19437 19008 18579 18150 17721 17335 16948
2993.65A6605l43l86l01l43l00l01l00Tk58k57k58k57k58k57k14k15A1842
$$ 16605 16262 15876 15575 15232 14932 14631 14331 14031 13773 13516 13258 13001 12743 12486 12272 12057 11842
2954.186A1628k15k14j72k14j72k15j71j72j71j29j72j71j29j72j28H882
$$ 11628 11413 11199 11027 10813 10641 10426 10255 10083 9912 9783 9611 9440 9311 9139 9011 8882
2916.915H710j29j28j29Tj28q6j29Tq5j29Tq6Tj28q6Uj28q6Wq5q6m3E964
$$ 8710 8581 8453 8324 8195 8067 7981 7852 7723 7638 7509 7380 7294 7208 7080 6994 6908 6822 6694 6608 6522 6436 6350 6264 6179 6093 6050 5964
2855.526E878q15q6m3q5o87m3Uq6m2m3S0p72m3T%m3m2%m3T%m3T%m3%H15
$$ 5878 5063 4977 4934 4849 4162 4119 4076 4033 3947 3905 3862 3819 3776 3733 3690 3647 3604 3561 3518 3475 2703 2660 2617 2617 2574 2532 2532 2489 2446 2446 2403 2360 2360 2317 2317 815
2774.406H15%q15%T56Q6%S6M3%T5M3%S5M3%S1M2%VJ29%UJ72%M3%VM3F44
2011.435F44%M3%J71M3%M3%TM3%TM3T%M3%M2%M3%M3T%M3V%M3U%M2M3A716
$$ 644 644 687 687 858 901 901 944 944 944 987 987 987 1030 1073 1073 1116 1116 1158 1158 1201 1201 1244 1287 1287 1330 1373 1416 1459 1459 1502 1545 1588 1588 1630 1673 1716
1930.315A759M3TQ6M3UQ5M3Q6TM3Q6Q5Q6TJ29Q6J28J29TJ28J29J72J71D119
$$ 1759 1802 1845 1931 1974 2017 2060 2145 2188 2274 2360 2403 2489 2574 2660 2746 2875 2961 3089 3218 3347 3475 3604 3776 3947 4119
1873.311D334K14K58K57L00L01L43L86M29M72N15O01O86P30Q58R44J073A3945
$$ 4334 4548 4806 5063 5363 5664 6007 6393 6822 7294 7809 8410 9096 9826 10684 11628 12701 13945
1833.847A5318J588J759K016K189K360K531K532K445K103J630R44Q6C6772
$$ 15318 16906 18665 20681 22870 25230 27761 30293 32738 34841 36471 37415 37501 36772
1803.153C5356k017k274k446k403k274k102j802j674j458j288j115r87A2701
$$ 35356 33339 31065 28619 26216 23942 21840 20038 18364 16906 15618 14503 13516 12701
1772.459A1971o01n14m72l87l00k57k58j71j29q6T%m3M3TQ6TJ28J72I397
$$ 11971 11370 10856 10384 9997 9697 9440 9182 9011 8882 8796 8710 8710 8667 8710 8753 8839 8925 9053 9225 9397
1726.418I611K58K57L00L01L86TM72TN15O01O43P30P72Q58R44J073J158B0982
$$ 9611 9869 10126 10426 10727 11113 11499 11971 12443 12958 13559 14202 14932 15704 16562 17506 18579 19737 20982
1684.761B2441J587J759J974K231K532K789L218L604M076M634N192N793F8309
$$ 22441 24028 25787 27761 29992 32524 35313 38531 42135 46211 50845 56037 61830 68309
1654.067G5345P595P938Q024P809P165O093M763L132J459j72j544k446A22286
$$ 75345 82940 90878 98902 106711 113876 119969 124732 127864 129323 129151 127607 125161 122286
1623.373A19454k317j630q58j72K14K15k57j202k360l604m720n492n792H5600
$$ 119454 117137 115507 114649 114477 114691 114906 114649 113447 111087 107483 102763 97271 91479 85600
1590.486G9979n320m892m548m205l904l604l347k961k660k317k017j802C6772
$$ 79979 74659 69767 65219 61014 57110 53506 50159 47198 44538 42221 40204 38402 36772
1559.792C5227j502j544j674j759Uj674j587j502j373j202j115j030A4846
$$ 35227 33725 32181 30507 28748 26989 25230 23556 21969 20467 19094 17892 16777 15747 14846
1526.905A4031p30o86o01n15Tm29l86Tl43l01k57k58k14k15j71j72j29G595
$$ 14031 13301 12615 12014 11499 10984 10555 10169 9783 9440 9139 8882 8624 8410 8195 8024 7852 7723 7595
1485.249G509q6Tm3U%UM3Q6UJ29J28J72K14K15K57L44L43L86M72TO01A1928
$$ 7509 7423 7337 7294 7251 7208 7208 7208 7208 7251 7337 7423 7509 7638 7766 7938 8152 8367 8624 8968 9311 9697 10169 10641 11242 11928
1428.245A2658Q58R87J158J287J459J674J888K188K403K617K961L132C8488
$$ 12658 13516 14503 15661 16948 18407 20081 21969 24157 26560 29177 32138 35270 38488
1397.551D1620K789K274J502N58l43j159j845k274k532k660k746k660B9906
$$ 41620 44409 46683 48185 48743 48400 47241 45396 43122 40590 37930 35184 32524 29906
1366.857B7418k317k146j930j717j501j331j158j030q58p29o44n15m72A0727
$$ 27418 25101 22955 21025 19308 17807 16476 15318 14288 13430 12701 12057 11542 11070 10727
1333.97A0469j71j29%M3J29K14L01M29M72N57O01O44O00N58L86J72A5189
$$ 10469 10298 10169 10169 10212 10341 10555 10856 11285 11757 12314 12915 13559 14159 14717 15103 15275 15189
1294.506A4889n58o86p73q58p72p73o86o44n58m72l86l43l00k15j71F565
$$ 14889 14331 13645 12872 12014 11242 10469 9783 9139 8581 8109 7723 7380 7080 6865 6694 6565
1257.235F479m3%M3Q6J29J71K15J71L01L86TK57M30L86L00K15Q5%j28I697
$$ 6479 6436 6436 6479 6565 6694 6865 7080 7251 7552 7938 8324 8581 9011 9397 9697 9912 9997 9997 9869 9697
1211.193I483k15j72j28k58%Q6K15K57L43M72P30O86Q58R44J116J287A7163
$$ 9483 9268 9096 8968 8710 8710 8796 9011 9268 9611 10083 10813 11499 12357 13301 14417 15704 17163
1171.729A8751J673J716J674J458J073O44M3n58r87j373j588j673j630A7678
$$ 18751 20424 22140 23814 25272 26345 26989 27032 26474 25487 24114 22526 20853 19223 17678
1138.843A6262j244j073r44p29o44m72l86k15j29%Q6K15L43M29N58O44A3430
$$ 16262 15018 13945 13001 12272 11628 11156 10770 10555 10426 10426 10512 10727 11070 11499 12057 12701 13430
1099.379A4202P30O00M72K15j29l86o44q58r44r86r87r44q58p73o86G380
$$ 14202 14932 15532 16004 16219 16090 15704 15060 14202 13258 12272 11285 10341 9483 8710 8024 7380
1062.107F865m72m29l43l00l01k14k15j72j28j29q6Tm3m2m3M3%M2Q6D119
$$ 6865 6393 5964 5621 5321 5020 4806 4591 4419 4291 4162 4076 3990 3947 3905 3862 3905 3905 3947 4033 4119
1016.066D205J72J71K15K57L01L43L86M72N15N58O43P30N57O87N58M29A1456
$$ 4205 4377 4548 4763 5020 5321 5664 6050 6522 7037 7595 8238 8968 9525 10212 10770 11199 11456
976.602A1456k57m29o01o44p29o87o86o01n58m72m29l86l43k57k58C905
$$ 11456 11199 10770 10169 9525 8796 8109 7423 6822 6264 5792 5363 4977 4634 4377 4119 3905
939.33C690j29j71q6j29q6m3m2m3U%m3%UM3%M3T%M3Q5M3Q6UQ5J29C690
$$ 3690 3561 3390 3304 3175 3089 3046 3004 2961 2918 2875 2875 2832 2832 2832 2832 2875 2875 2918 2961 2961 3004 3089 3132 3218 3304 3390 3475 3604 3690
873.557C862J28J29J72K14J72K57K15K57L01L43TL86M29M72N58TO87A0212
$$ 3862 3990 4119 4291 4505 4677 4934 5149 5406 5707 6050 6393 6779 7208 7680 8238 8796 9483 10212
831.901A1027R44J073J158J373J502J759J974K274K532K917L261L562C9260
$$ 11027 11971 13044 14202 15575 17077 18836 20810 23084 25616 28533 31794 35356 39260
801.206D3379M205L948L518K618J415Q6j287k531l390l948m162m119C5785
$$ 43379 47584 51532 55050 57668 59083 59169 57882 55351 51961 48013 43851 39732 35785
770.512C2138l261k961k574k317k017j759j588j373j201j073r44q58I483
$$ 32138 28877 25916 23342 21025 19008 17249 15661 14288 13087 12014 11070 10212 9483
739.818H796o01n15m72Tl86l43Tl01k57Tk15Tj71j72j71j29Uj28q6C218
$$ 8796 8195 7680 7208 6736 6350 6007 5664 5363 5106 4849 4634 4419 4248 4076 3905 3776 3647 3518 3390 3304 3218
691.584C132q6q5q6m3V%m3%Tm3M3%TM3%M3TQ6M3Q6Q5J29TJ28J72TK14D248
$$ 3132 3046 2961 2875 2832 2789 2746 2703 2703 2660 2660 2660 2617 2660 2660 2660 2703 2703 2746 2789 2875 2918 3004 3089 3218 3347 3475 3647 3819 4033 4248
623.618D548L01L43M29TN58O00O44O87P72TP73O43O01L86J72%j72l00A1842
$$ 4548 4849 5192 5621 6050 6608 7208 7852 8539 9311 10083 10856 11499 12100 12486 12658 12658 12486 12186 11842
579.77A1499l00k15j28%Q5J72K15K57L00K58K14K15J71K15K57L44A3988
$$ 11499 11199 10984 10856 10856 10941 11113 11328 11585 11885 12143 12357 12572 12743 12958 13215 13559 13988
540.306A4460N58N14M72L01Q6k15n15p72r01j073Tj029j030r01q58G294
$$ 14460 15018 15532 16004 16305 16391 16176 15661 14889 13988 12915 11842 10813 9783 8882 8024 7294
503.034F608n58n15m72l86Tl01l00k57k15k14j72Tj28j72j29q6j28A931
$$ 6608 6050 5535 5063 4677 4291 3990 3690 3433 3218 3004 2832 2660 2532 2360 2231 2145 2017 1931
461.378A845q6Tm3q5m3Uq6m3U%m3m2m3%m3%m3T%Tm3%m3%Tm3%Um3%j28F01
$$ 1845 1759 1673 1630 1545 1502 1459 1416 1330 1287 1244 1201 1201 1158 1116 1073 1073 1030 1030 987 944 944 944 901 901 858 858 858 815 815 815 815 772 772 644 601
382.45F01%S6M3%UM3%TM2%M3%M3%M3YM2%M3T%M3T%M3VQ6M2Q6TJ29B060
$$ 601 601 601 601 601 601 601 601 601 601 601 601 601 601 601 601 601 644 644 644 644 687 687 687 729 729 772 772 815 815 858 901 944 987 1030 1073 1116 1158 1158 1201 1244 1244 1287 1330 1330 1373 1416 1459 1502 1588 1630 1716 1802 1931 2060
261.865B188J29J72K14K15K14L01L00L86TM72N15O01O86P73Q58R01A0255
$$ 2188 2317 2489 2703 2918 3132 3433 3733 4119 4505 4977 5492 6093 6779 7552 8410 9311 10255
222.401A1242R01P72N58L00%l43o01p72r01r87r44q58q15p30o86n58E063
$$ 11242 12143 12915 13473 13773 13773 13430 12829 12057 11156 10169 9225 8367 7552 6822 6136 5578 5063
182.937D634l86l01l00k14j72Tj28q6Tm3T%M3%M3T%m3Tq6j28j72j29B060
$$ 4634 4248 3947 3647 3433 3261 3089 2961 2875 2789 2746 2703 2703 2746 2746 2789 2832 2832 2789 2746 2660 2532 2360 2231 2060
128.126A888j72j28j29Tq6Tq5q6m3q6m3Um2m3T%m3T%m3%m3%Tm3%Tm3C43
$$ 1888 1716 1588 1459 1330 1244 1158 1073 987 944 858 815 772 729 687 644 601 601 558 515 515 472 472 429 429 429 386 386 386 343 343
60.16C43m3%Um3%Wm2%Xm3%S0m3%S6m3%XH6
$$ 343 300 300 300 300 257 257 257 257 257 257 215 215 215 215 215 215 215 172 172 172 172 172 172 172 172 172 172 172 129 129 129 129 129 129 129 129 129 129 129 129 129 129 129 129 129 86 86 86 86 86 86 86 86
-58.232H6  $$checkpoint
##END= $$ end of RAMAN
##END= $$ end of file