##TITLE=Cu(gly)2 $$
##JCAMP-DX= 4.24
##DATA TYPE=link
##BLOCKS=4
##TITLE=trans-Cu(glyO)2.H2O $$ Begin of the data block
##JCAMP-DX=5.00 $$ ACD/DocManager Library v 5.00
##DATA TYPE=INFRARED SPECTRUM
##DATA CLASS=XYDATA
##BLOCK ID= 1
##ORIGIN= Department of Chemistry, UWI, JAMAICA
##OWNER= public domain
##DATE=22 Feb 2012 14:55:24
##SPECTROMETER/DATA SYSTEM=unknown
##$MODELS=
<Models>
<ModelData id="transCugly2" type="MOL" >
trans-Cu(gly)2

  created with ArgusLab version 4.0.1
 19 20  0  0  0  0  0  0  0  0  0 V2000
    1.2880    1.3080   20.0440 Cu  0  0  0  0  0  0  0  0  0  0  0  0
   -0.1600    0.1160   20.6120 O   0  0  0  0  0  0  0  0  0  0  0  0
    3.5960    1.9440   18.7040 C   0  0  0  0  0  0  0  0  0  0  0  0
    2.8440    2.4120   19.6280 O   0  0  0  0  0  0  0  0  0  0  0  0
   -0.8400    0.4800   21.6080 C   0  0  0  0  0  0  0  0  0  0  0  0
   -0.3640    1.7320   22.3280 C   0  0  0  0  0  0  0  0  0  0  0  0
    2.0120    0.0760   18.6600 N   0  0  0  0  0  0  0  0  0  0  0  0
    3.0840    0.7440   17.9240 C   0  0  0  0  0  0  0  0  0  0  0  0
   -1.8200   -0.1200   22.0440 O   0  0  0  0  0  0  0  0  0  0  0  0
    4.6960    2.4400   18.3880 O   0  0  0  0  0  0  0  0  0  0  0  0
    0.6360    2.4520   21.5200 N   0  0  0  0  0  0  0  0  0  0  0  0
    0.0200    1.4880   23.1840 H   0  0  0  0  0  0  0  0  0  0  0  0
   -1.1200    2.3160   22.5000 H   0  0  0  0  0  0  0  0  0  0  0  0
    1.3560   -0.1640   18.0960 H   0  0  0  0  0  0  0  0  0  0  0  0
    2.3320   -0.6640   19.0560 H   0  0  0  0  0  0  0  0  0  0  0  0
    3.8120    0.1200   17.7720 H   0  0  0  0  0  0  0  0  0  0  0  0
    2.7480    1.0360   17.0600 H   0  0  0  0  0  0  0  0  0  0  0  0
    0.2680    3.2000   21.1840 H   0  0  0  0  0  0  0  0  0  0  0  0
    1.3280    2.6920   22.0480 H   0  0  0  0  0  0  0  0  0  0  0  0
  1 11  1  0  0  0  0
  1  7  1  0  0  0  0
  1  4  1  0  0  0  0
  1  2  1  0  0  0  0
  2  5  1  0  0  0  0
  3 10  1  0  0  0  0
  3  8  1  0  0  0  0
  3  4  1  0  0  0  0
  5  9  1  0  0  0  0
  5  6  1  0  0  0  0
  6 11  1  0  0  0  0
  6 13  1  0  0  0  0
  6 12  1  0  0  0  0
  7  8  1  0  0  0  0
  7 15  1  0  0  0  0
  7 14  1  0  0  0  0
  8 17  1  0  0  0  0
  8 16  1  0  0  0  0
 11 19  1  0  0  0  0
 11 18  1  0  0  0  0
M  END
</ModelData>
</Models>
##$PEAKS=
<Peaks type="IR" xUnitsExpected="1/cm" >
<PeakData id="1" title="C=O stretch" peakShape="singlet" model="transCugly2" xMax="1620" xMin="1580"  />
</Peaks>
##XUNITS=1/CM
##YUNITS=TRANSMITTANCE
##XFACTOR=1.0000000000
##YFACTOR=0.0000312500
##FIRSTX=211.24096680
##LASTX=1804.07995605
##FIRSTY=0.17734376
##DELTAX=1.64719653
##NPOINTS=968
##XYDATA=(X++(Y..Y))
211.2E675j74j77%K44J841L576N89J07J01j49j51k4J26M4Q16K76L56P00J442J990P38
245.8A7946K40J26O57J207M76K70L53P50M22O86P35O72L64L82N16L39M89O90M23J38
278.8B7881N9N6J22J57J85K05R8R4R0O5N8TL5l5l2l6m8j26j30j91k58m98n55n44r32
320B5778j584r43k176l571j240k041r95j054j095p28L94L557Q94M304O506L78M26P55
349.6B7565K74J64j51k64m47o76m49r61j233j259j477j268n81j668o59l59k58K66L43
380.9A6902N98O97J257K652R20J343O76P09J060O88O81N28K91K07L14K53K23K00J33
412.2C0332R2Q9Q5P9P5N1OUPLoj0oj0rl1k9l1l2k5k2j9k2j9k8m5m4Tn1q2q3q8j60j62
469.8B9773k34n11n22o38j275j496r34k53K95K44K33K28P11Q07P69N72K14P9K0J6Tj6
$$ plain form
211.2 5675 5501 5324 5324 5568 7409 10985 11574 11681 11782 11633 11482 11458 11584 11628 12444 12720 13076 13776 15218 17208 17946
245.8 17946 18186 18312 18969 20176 20652 20922 21275 22025 22447 23133 23868 24540 24904 25286 25802 26141 26630 27320 27743 27881
278.8 27881 27940 27996 28118 28275 28460 28665 28763 28857 28947 29012 29070 29128 29163 29128 29096 29060 29012 28886 28756 28565 28307 27809 27254 26710 25778
320 25778 24194 23251 21075 17504 16264 14223 13228 12174 11079 10351 10745 14302 15196 19500 26006 26384 26810 27565
349.6 27565 27839 28003 27852 27588 27141 26465 26016 25055 23822 22563 21086 19818 19237 17569 16910 16551 16293 16559 16902
380.9 16902 17500 18197 19454 22106 23026 24369 25045 25754 26814 27502 28183 28711 29002 29209 29523 29776 29999 30199 30332
412.2 30332 30424 30513 30598 30677 30752 30803 30809 30815 30821 30828 30831 30825 30815 30809 30799 30790 30759 30730 30699 30667 30642 30620 30601 30579 30560 30532 30487 30443 30399 30348 30266 30183 30095 29935 29773
469.8 29773 29539 29028 28506 27868 26593 25097 24163 23910 24205 24449 24682 24910 25621 26428 27197 27769 27983 28062 28082 28098 28114 28098
506.1B8098m6m3m6n5p3p2p3j22j29j55k20k40k75m59p53p59m89o96o11o1m7%UMK5K9
550.6B2732K9Tp6Tp9k43l02l81m10n52p11n72q35p39o14r32n30l06j46J29J28K38L74
588.4A6155N90M35O42M27L79J77J52O6j36j37k52l20m32m12m53m79n92q51o44p42m65
623A3108o03n07k40q7%Tn%Vm%J9O8O2O3Q6J86J80J69J60J62J30J34J28n9q3q8j34k56
674.1A2589k72l14m72m12l89n18n45l93j72m9n4l8K59K57Q22P21J007R71R35Q43M59
708.7A5235Q78Q58M93O06K86K17J89L1p5p4p5k64l27l97o47m70r34m42p28m98k43N8
744.9A3677N4O64N85J334K740k06J332Q01J288P46P40N37N32O78M09L55N41L27K13
776.2B7347K25K40L45J63J57J56TJ55TJ32J22J25J22J25J15J08J12R2Q9R1P0TO6P3
$$ plain form
506.1 28098 28052 28009 27963 27908 27835 27763 27690 27568 27439 27284 27064 26824 26549 26090 25337 24578 24089 23393 22782 22721 22674 22674 22674 22674 22678 22703 22732
550.6 22732 22761 22790 22714 22638 22559 22316 22014 21633 21223 20671 19960 19388 18553 17814 17200 16268 15738 15432 15286 15415 15543 15781 16155
588.4 16155 16745 17180 17822 18249 18628 18805 18957 19023 18887 18750 18498 18178 17746 17334 16881 16402 15810 14959 14315 13573 13108
623 13108 12505 11998 11758 11671 11671 11671 11666 11666 11666 11666 11666 11662 11662 11681 11749 11811 11874 11960 12146 12326 12495 12655 12817 12947 13081 13209 13150 13067 12979 12845 12589
674.1 12589 12317 12003 11531 11119 10730 10212 9667 9274 9102 9053 8999 8961 9220 9477 10299 11020 12027 12998 13933 14776 15235
708.7 15235 16113 16971 17464 18070 18356 18573 18762 18793 18718 18644 18569 18305 17978 17581 16934 16464 15530 15088 14360 13862 13619 13677
744.9 13677 13731 14395 14980 16314 19054 18848 20180 20981 22269 23015 23755 24292 24824 25502 25911 26266 26807 27134 27347
776.2 27347 27572 27812 28157 28320 28477 28633 28789 28944 29099 29231 29353 29478 29600 29725 29840 29948 30060 30152 30241 30332 30402 30472 30538 30611
815.8C0611Q8R1Q8O6UO2O0N6N9O0N6N9N6M0K8L2K7K8K2UK1J3%Tl%lpoTrj0l1k8l1Tn3
880C1581p7q1r7j22j25j51j54r7p9Tj74k35m14p29r84n70m39n688j197l550l188j4
916.2A3337J773P235M251J397J367O61N96K01P3k6k2j13k08l45p02j129j159j583m80
947.5B5124j44J151K900J210R25L28K21J36M1M3M0K5oTj0ork5k2k4k2l1m0l7l8l7l1
992C1656l1Ul8m9n0Tn6o9Up5p8q2q8r1r2r1r5r2j04j24j27j92k17k34k19k20k36l26
1041.4B8330k62k39l67l61l91p62p75j116j516k202l656k421m983j334O095L464M100
1069.4B1604J931L878O46L27j4rj3r2r5r8j11j15j58k42k45k67l11k45l45k65k56l81
1105.7B5124l83l76l57l91l94l98m47n21m08o25m73n82m27o67r01q48n33r35r18r89
$$ plain form
815.8 30611 30699 30790 30878 30944 31010 31076 31138 31198 31254 31313 31373 31429 31488 31544 31584 31612 31644 31671 31699 31721 31743 31765 31786 31799 31799 31799 31796 31796 31793 31786 31780 31774 31765 31755 31724 31696 31665 31634 31581
880 31581 31504 31423 31326 31204 31079 30928 30774 30677 30598 30519 30345 30110 29696 28967 27983 27413 26974 21286 20089 16539 13351 13337
916.2 13337 15110 22345 26596 27993 29360 30021 30617 30818 30891 30865 30843 30730 30522 30177 29475 28346 27187 25604 25124
947.5 25124 24980 26131 29031 30241 31166 31494 31715 31851 31892 31935 31975 32000 31994 31988 31978 31972 31963 31938 31916 31892 31870 31839 31799 31762 31724 31687 31656
992 31656 31625 31594 31563 31525 31476 31426 31376 31320 31251 31182 31113 31038 30960 30878 30790 30699 30607 30516 30421 30329 30225 30101 29974 29782 29565 29331 29112 28892 28656 28330
1041.4 28330 28068 27829 27462 27101 26710 25948 25173 24057 22541 20339 16683 14262 9279 7945 14040 17504 21604
1069.4 21604 23535 27413 28059 28386 28372 28363 28350 28258 28163 28065 27954 27839 27681 27439 27194 26927 26616 26371 26026 25761 25505 25124
1105.7 25124 24741 24365 24008 23617 23223 22825 22378 21857 21449 20824 20351 19769 19342 18675 17774 16926 16393 15458 14540 13551
1138.6A3551j046j087j139j085p62q00o61o91k50q5Tl3L13L11L98P89O42J074J616
1169.9A0970J511J439J375Q77J247Q30N40O26M19N96N66M27N48M83M79L79L72L52L54
1201.2B4390L09K49K21K06J85J77J63J57J15J14R8Q1Q4TL7L3L7L4J3POPT%j0pTj0k0
1249B6760l3l4l3l4m0Tm1m0m7n1n4n0o8p4p5p4r9j02r9j33j37j47j69j89k29k54k48
1293.5B4166k32l60l91l97l68p15p22q16o54p69j076j277j094q65o99o69j47q8r3q9
1326.4A2645j630j951j171o09O21J935M555J927J028J848J202N44N60K80J43m1m0j54
1356.1B1692l95l79n41q66q83j286r32j094k401j639j358k04k412j409q47l49k27j19
1385.7D351j13j23L1M6TJ58L95TM36R42O96J328J722N131K517Q08J588J565J136P31
$$ plain form
1138.6 13551 12505 11418 10279 9194 8432 7632 6971 6280 6030 5945 5860 5827 6140 6451 6849 7638 8280 9354 10970
1169.9 10970 12481 13920 15295 16172 17419 18249 18789 19415 19834 20430 20996 21423 21971 22454 22933 23312 23684 24036 24390
1201.2 24390 24699 24948 25169 25375 25560 25737 25900 26057 26172 26286 26384 26465 26549 26633 26670 26703 26740 26774 26787 26794 26800 26807 26814 26814 26804 26797 26790 26780 26760
1249 26760 26727 26693 26660 26626 26586 26546 26505 26465 26418 26367 26313 26263 26195 26121 26046 25972 25873 25771 25672 25539 25402 25255 25086 24897 24668 24414 24166
1293.5 24166 23934 23574 23183 22786 22418 21703 20981 20165 19511 18742 17666 16389 15295 14430 13731 13062 12915 12827 12734 12645
1326.4 12645 11015 9064 7893 7284 7905 9840 14395 16322 17350 19198 20400 20944 21504 21784 21927 21886 21846 21692
1356.1 21692 21297 20918 20377 19511 18628 17342 16410 15316 12915 11276 9918 9714 7302 5893 5046 4697 4470 4351
1385.7 4351 4238 4115 4146 4192 4238 4396 4791 5186 5622 6564 7260 8588 10310 15441 17958 18766 20354 21919 23055 23786
1418.6B3786P29L78o9j14l52j050r15k046k007N31L183o49K194N04N55K18J52P6P2
1449.9B5176N2OPUL%Tl%l8o5o2o6j34j39j49j70j71j76j72j76j73j78j67j39j43r7
1496.1B2840p9Tq0r4r0r4k70k56k42j85j81k68l34l47k51k79l31l72k62l98k98k52
1532.3A7798k21k79m09k72o42n34p74n42p38n14n19m85l19k88k72m11q44o60q57o38
1565.2G580n00m22p00p45p06n54l35j15j08j18o8%Tr%RQJ7V%Tq%TJ7VJ6J7UJ6L4R9
1626.2C561Q9R7R5J81K60K53M40L61J97J94K43M55N81N90N82N91Q02J068O22L85M47
1660.8A2094O30P36M82R08M88O83N59N10M14O46M39O05N82P90P72P42M79L78TL73N41
1695.4B4229L59L60L65K84K59K48J79J82K18J88J60J93K32K15J81J05TJ08J11TJ14
$$ plain form
1418.6 23786 24515 24893 24824 24710 24358 23308 22393 20347 18340 18871 22054 21405 23599 24103 24658 24876 25028 25104 25176
1449.9 25176 25228 25234 25241 25248 25255 25258 25258 25258 25255 25255 25217 25152 25090 25024 24890 24751 24602 24432 24261 24085 23913 23737 23564 23386 23219 23080 22937 22840
1496.1 22840 22761 22682 22602 22508 22418 22324 22054 21798 21556 21371 21190 20922 20588 20241 19990 19711 19380 19008 18746 18348 18050 17798
1532.3 17798 17577 17298 16889 16617 15975 15441 14667 14125 13387 12873 12354 11869 11550 11262 10990 10579 9735 9075 8218 7580
1565.2 7580 7080 6658 5958 5213 4507 3953 3618 3503 3395 3277 3209 3209 3209 3200 3200 3209 3217 3234 3251 3268 3285 3285 3285 3277 3277 3277 3294 3311 3328 3345 3361 3378 3395 3412 3428 3462 3561
1626.2 3561 3650 3747 3842 4023 4283 4536 4976 5337 5534 5728 5971 6426 7007 7597 8179 8770 9572 10640 11262 11647 12094
1660.8 12094 12724 13460 13942 14850 15338 16021 16580 17090 17504 18150 18589 19194 19776 20566 21338 22080 22559 22937 23315 23688 24229
1695.4 24229 24588 24948 25313 25597 25856 26104 26283 26465 26683 26871 27031 27224 27456 27671 27852 27957 28062 28170 28281 28392 28506
1730B8506J11J10J26J23J20J09J10P7O7P1O7M8N1UO1N7N8O0P0O7P0O0N7O0N4N0N1N0
1777.7C0623N1N0M7N0M8N0UN4N6TN7N6N9N6T
1804.1C1469
$$ plain form
1730 28506 28617 28727 28853 28976 29096 29205 29315 29392 29459 29530 29597 29645 29696 29747 29798 29859 29916 29974 30034 30104 30171 30241 30301 30358 30418 30472 30522 30573 30623
1777.7 30623 30674 30724 30771 30821 30869 30919 30969 31019 31073 31129 31185 31242 31298 31357 31413 31469
1804.1 31469
##END=$$ End of the data block
##TITLE= trans-Cu(glyO)2.H2O
##JCAMP-DX= 5.01
##DATA TYPE= RAMAN SPECTRUM
##DATA CLASS= XYDATA
##BLOCK ID = 2
##ORIGIN= School of Chemistry, Univ of Bristol
##OWNER= public domain
##LONGDATE= 2012/02/22 13:34:10.0749 -0500 $$ export date from JSpecView
##$MODELS=
<Models>
<ModelData id="trans-Cugly2" type="MOL" >
trans-Cu(gly)2

  created with ArgusLab version 4.0.1
 19 20  0  0  0  0  0  0  0  0  0 V2000
    1.2880    1.3080   20.0440 Cu  0  0  0  0  0  0  0  0  0  0  0  0
   -0.1600    0.1160   20.6120 O   0  0  0  0  0  0  0  0  0  0  0  0
    3.5960    1.9440   18.7040 C   0  0  0  0  0  0  0  0  0  0  0  0
    2.8440    2.4120   19.6280 O   0  0  0  0  0  0  0  0  0  0  0  0
   -0.8400    0.4800   21.6080 C   0  0  0  0  0  0  0  0  0  0  0  0
   -0.3640    1.7320   22.3280 C   0  0  0  0  0  0  0  0  0  0  0  0
    2.0120    0.0760   18.6600 N   0  0  0  0  0  0  0  0  0  0  0  0
    3.0840    0.7440   17.9240 C   0  0  0  0  0  0  0  0  0  0  0  0
   -1.8200   -0.1200   22.0440 O   0  0  0  0  0  0  0  0  0  0  0  0
    4.6960    2.4400   18.3880 O   0  0  0  0  0  0  0  0  0  0  0  0
    0.6360    2.4520   21.5200 N   0  0  0  0  0  0  0  0  0  0  0  0
    0.0200    1.4880   23.1840 H   0  0  0  0  0  0  0  0  0  0  0  0
   -1.1200    2.3160   22.5000 H   0  0  0  0  0  0  0  0  0  0  0  0
    1.3560   -0.1640   18.0960 H   0  0  0  0  0  0  0  0  0  0  0  0
    2.3320   -0.6640   19.0560 H   0  0  0  0  0  0  0  0  0  0  0  0
    3.8120    0.1200   17.7720 H   0  0  0  0  0  0  0  0  0  0  0  0
    2.7480    1.0360   17.0600 H   0  0  0  0  0  0  0  0  0  0  0  0
    0.2680    3.2000   21.1840 H   0  0  0  0  0  0  0  0  0  0  0  0
    1.3280    2.6920   22.0480 H   0  0  0  0  0  0  0  0  0  0  0  0
  1 11  1  0  0  0  0
  1  7  1  0  0  0  0
  1  4  1  0  0  0  0
  1  2  1  0  0  0  0
  2  5  1  0  0  0  0
  3 10  1  0  0  0  0
  3  8  1  0  0  0  0
  3  4  1  0  0  0  0
  5  9  1  0  0  0  0
  5  6  1  0  0  0  0
  6 11  1  0  0  0  0
  6 13  1  0  0  0  0
  6 12  1  0  0  0  0
  7  8  1  0  0  0  0
  7 15  1  0  0  0  0
  7 14  1  0  0  0  0
  8 17  1  0  0  0  0
  8 16  1  0  0  0  0
 11 19  1  0  0  0  0
 11 18  1  0  0  0  0
M  END
</ModelData>
</Models>
##$PEAKS=
<Peaks type="Raman" xUnitsExpected="1/cm">
<PeakData id="1" title="C=O stretch" peakShape="singlet" model="trans-Cugly2" xMax="1620" xMin="1580"  />
</Peaks>
##XUNITS= 1/CM
##YUNITS= RAMAN INTENSITY
##XFACTOR= 1E0
##YFACTOR= 1E-4
##FIRSTX= 167.75
##FIRSTY= 4.978125
##LASTX= 1604.70610478
##NPOINTS= 577
##XYDATA= (X++(Y..Y))
167.75D9781L8406R407O844P18J563J9625L6906L0000N156l656J7906B41281
200.1812B25563O25L5375n4407r750J625Q44J9406K0844J8875N4594C96188
230.11761432901045E24594J64531J93938J16937l4594j13000k06218j80938j19344B71875
255.0647047763368B28938k6875j9657j0937j0125l0719j1781L969j1938J6719A30563
282.50631432901037A37375J4313K7375M1000K5437k312l750j2032j375m2843j9094A33844
312.44260955267356A04938j0125m657j6156j1062J3250J4031m125j5719j0969P938F4500
342.3789095526736E8938r594J5969k1782j187k063j1031Q719J125n031N62J781C4813
374.8098095526736C7719P969m07m469r468Q281r750O813p094j625o625Q75k219C2094
$$ plain form
167.75 49781 88187 97594 104438 105156 106719 126344 163250 193250 198406 194750 212656 241281
200.1812 225563 226188 261563 207156 197406 199031 199875 219281 240125 259000 313594 396188
230.11761432901045 524594 689125 883063 1000000 965406 852406 646188 465250 345906 271875
255.0647047763368 228938 202063 182406 171469 161344 130625 118844 122813 110875 127594 130563
282.50631432901037 137375 151688 179063 220063 245500 243188 239438 227406 226031 183188 164094 133844
312.44260955267356 104938 94813 90156 74000 62938 76188 90219 86094 70375 59406 67344 64500
342.3789095526736 58938 49344 65313 43531 42344 40281 29250 37969 39094 34063 34625 36406 34813
374.8098095526736 37719 45688 45281 40812 31344 39625 29875 36688 29594 27969 21344 22219 20000 32094
409.73551432901036C2875o312K593K50m125J532k282j218Q375P343j0781K4844E7563
442.1664E6063R406K0031O969L1875K7656L0688L9156M6062M2782K2406C35000
472.1028191053472C14000m1531k7156o1219l7656k9500k4094j7719L844o219O25G3531
502.03901432901034I4531L0813K2000L8500O6594P9906R0562Q9500M7000k0875D56375
529.4806095526736C51219o4656l1594k0375O406J4531J8125L6625J0500K5250C57156
556.9222C63656J7844J3250J1438L3375M5343L8375J7563R031m0187D48781
584.3638143290103C86063o7813m1000l0906m3219k9281k5531k1563j5437j3657H8875
611.8054095526736H4906k1531j3562p657m593l532P344j0969N188M781p719K875C0156
$$ plain form
409.73551432901036 32875 26563 29156 29406 25281 26813 24531 23313 31688 39031 28250 53094 57563
442.1664 56063 65469 85500 92469 124344 152000 182688 221844 267906 310688 333094 335000
472.1028191053472 314000 272469 245313 184094 146438 116938 92844 75125 78969 72750 73375 73531
502.03901432901034 94531 125344 147344 185844 252438 332344 422906 512406 559406 538531 456375
529.4806095526736 351219 286563 254969 234594 241000 255531 273656 310281 320781 346031 357156
556.9222 363656 381500 394750 406188 439563 484906 523281 540844 549875 509688 448781
584.3638143290103 386063 318250 277250 246344 203125 173844 148313 126750 111313 97656 88875
611.8054095526736 84906 63375 49813 42156 37563 34031 41375 30406 35594 40375 32656 35531 30156
644.2363095526736B7063M281L12l937P594J0687J594j281J437%o687l469O187D7594
679.162E4844J6406R313J5750K6218J9844K0375J1563K8343J4188L8187B84938
709.0983143290103B89500M9375j844p437n63L3625m3156P1219j1656N7593l3500C24813
739.0346095526736B83719j4406K2437r06K000q844j3875n531q219n9250k5469A67156
768.9708095526736A69656k0875k2156j2219l312P750p438l1562q094q75p187J1187H1406
801.4018095526736G1844n031n563j2531r500p156l813j406k500O219K156n000B4188
833.8328143290104B2844N94o532K313r969L13N343m406j812N531m500q156J781D250
868.7584D063j750k313P938n532M219r69K375P313M500J3625Q156J0594G4969
$$ plain form
644.2363095526736 27063 31344 31656 27719 35313 46000 47594 46313 47750 47750 41063 37594 43781 47594
679.162 54844 71250 80563 96313 122531 142375 162750 174313 202656 216844 255031 284938
709.0983143290103 289500 338875 337031 329594 329031 362656 319500 390719 379063 436656 403156 324813
739.0346095526736 283719 269313 291750 290844 292844 284000 270125 264594 256375 197125 171656 167156
768.9708095526736 169656 148781 126625 114406 111094 118844 111406 79844 71750 70875 63688 74875 81406
801.4018095526736 71844 66813 61250 48719 39219 32063 28250 26844 24344 30563 32719 27719 24188
833.8328143290104 22844 23438 16906 19219 9250 9563 14906 10500 8688 14219 9719 1563 3344 4250
868.7584 4063 2313 0 7938 2406 6625 5656 8031 15344 19844 33469 41625 52219 74969
903.6841095526736A11781P9407J14343J24750J01969l062r5438r8000q5969p4312A17688
931.1257047763368H9406j5125J1907K3031J3531M125j4437l0125k3625j5563j5312B7844
961.062B5625j4125k375Q13p313Q250K000q875K750O594j063n656j87D563
995.9876047763368A0125R250J125j937N593K250k187n656J250Q500N625l2M782D0531
1030.9133143290107D5531N438R719L468K032m969P437P625J2750J2625M3907K8156A67656
1063.3452A27750n6844l3937k781o063K531K50m37L062o375P813j1031B7844
1095.776904776337C0250K656J1844j187l13o56J781J594N312O907n313r531J344E3750
1130.7033143290107F1219M687M782O531l063o500O469L563j0032N969j719N125H2656
$$ plain form
903.6841095526736 111781 191188 305531 430281 532250 529188 433750 335750 249781 175469 117688
931.1257047763368 89406 74281 86188 109219 122750 126875 112438 82313 58688 43125 27813 27844
961.062 25625 11500 9125 9938 2625 10875 12875 4000 6750 13344 12281 6625 6438 4563
995.9876047763368 10125 19375 20500 18563 24156 26406 24219 18563 19813 28313 33938 33906 38688 40531
1030.9133143290107 45531 50969 60688 64156 66188 61219 68656 76281 89031 101656 145563 173719 167656
1063.3452 127750 70906 36969 34188 28125 30656 30906 30469 33531 27156 34969 23938 27844
1095.776904776337 30250 32906 44750 43563 43250 42594 44375 45969 51281 58188 52875 43344 44688 53750
1130.7033143290107 61219 65906 70688 77219 74156 67656 74125 77688 67656 73625 71906 77031 82656
1163.1353I2625M063J2281k969L4781M5250L7219L3563k2563k6656m4750A32875
1193.0723A16656J25P250r062p625j2375j3781r844n750J500k19r000F3844
1225.5040047763368F0406m468J500n594k688P875p031K313M437r437N062p719J1375E7344
1260.4304143290108F2688J906j031l250Q12J719J344P18L657J3374K0563M969M312A29625
1295.357004776337A42750N313m07J4750L6907K7312K0406J7094K8781L6844M3125D13125
1325.2940047763368D69656J02407Q5468M750p5531j01469j02812q4938o3062j0969A87594
1352.7363A54375j4250l687O468J9375L0282J8687J3594K3187R250N875B82656
1382.6733B78156Q719N5688J5718M5375o2K2719J3937J7563L656k7250D24375
$$ plain form
1163.1353 92625 96688 108969 106000 140781 186031 223250 256813 234250 207594 162844 132875
1193.0723 116656 116781 124031 114969 107344 94969 81188 71344 65594 67094 66875 57875 63844
1225.5040047763368 60406 55938 57438 51844 49156 57031 50000 52313 56750 47313 52375 44656 56031 57344
1260.4304143290108 62688 64594 63563 60313 61125 62844 64188 64906 68563 81937 102500 107469 111781 129625
1295.357004776337 142750 148063 147656 162406 199313 226625 247031 264125 292906 329750 372875 413125
1325.2940047763368 469656 572063 657531 662281 586750 485281 382469 297531 234469 223500 187594
1352.7363 154375 140125 136438 142906 162281 192563 211250 224844 248031 257281 263156 282656
1382.6733 278156 286875 342563 358281 403656 403594 426313 440250 457813 461469 434219 424375
1412.6104D12188m0313j9594K3563M7875J6687P8907J22312J31781n1687E70500
1440.0525143290108D19438j23907o2468R375L1156q063m2468m0875k1938R4M844A60531
1469.9895143290107A58875j6187o782k4343j4594L469k50j0813q219p656j250R938G9938
1502.4214H8844p50j3250n750l1J2750q657l250P250M38J87j343N31K625F5219
1539.8425143290108H2406K063p531N312L344Q687M313R875N719J5437L0844L4906B51563
1572.2744C13063K2000j7657n5000k2250j1656J0719J5531J3719J3969C02156
1599.7165143290108C35906C53281
$$ plain form
1412.6104 412188 371875 352281 375844 423719 440406 519313 641625 773406 721719 570500
1440.0525143290108 419438 295531 233063 242438 273594 265531 223063 182188 160250 160344 165188 160531
1469.9895143290107 158875 142688 135906 111563 96969 100438 100188 89375 81156 73500 72250 82188 79938
1502.4214 88844 88094 74844 69094 69063 81813 73156 69906 77156 77594 77781 76438 76969 79594 65219
1539.8425143290108 82406 84469 76938 82250 85594 94281 98594 108469 114188 129625 160469 195375 251563
1572.2744 313063 335063 317406 262406 240156 228500 239219 254750 268469 282438 302156
1599.7165143290108 335906 353281
1604.7061047763368C35500  $$checkpoint
##END=
##TITLE=cis-Cu(gly)2.H2O $$ Begin of the data block
##JCAMP-DX=5.00 $$ ACD/DocManager Library v 5.00
##DATA TYPE=INFRARED SPECTRUM
##DATA CLASS=XYDATA
##BLOCK ID=3
##DATE=22 Feb 2012 15:51:36
##ORIGIN= Department of Chemistry, UWI, JAMAICA
##OWNER= public domain
##SPECTROMETER/DATA SYSTEM=unknown
##$MODELS=
<Models>
<ModelData id="cisCugly2" type="MOL" >
cis-Cu(gly)2
__Jmol-12_06181220483D 1   1.00000     0.00000     0
Jmol version 12.3.32_dev  2012-06-17 12:21 EXTRACT: ({0:18})
 19 20  0  0  0  0              1 V2000
   4.74570   1.55870   4.73940 Cu  0  0  0  0  0  0
   4.05030   2.68840   2.32040 C   0  0  0  0  0  0
   5.33840   1.95110   1.97470 C   0  0  0  0  0  0
   3.90340   1.31530   7.35960 C   0  0  0  0  0  0
   5.23150   0.58550   7.37720 C   0  0  0  0  0  0
   5.97600   1.37620   3.16470 N   0  0  0  0  0  0
   5.93080   0.68170   6.08420 N   0  0  0  0  0  0
   3.61730   2.56970   3.50360 O   0  0  0  0  0  0
   3.48440   3.33590   1.42720 O   0  0  0  0  0  0
   3.51140   1.79510   6.23730 O   0  0  0  0  0  0
   3.25850   1.40400   8.41540 O   0  0  0  0  0  0
   5.13700   1.22660   1.32960 H   0  0  0  0  0  0
   5.96770   2.57940   1.53830 H   0  0  0  0  0  0
   5.80470   0.96910   8.08740 H   0  0  0  0  0  0
   5.07620  -0.36860   7.59400 H   0  0  0  0  0  0
   6.56790   1.79510   3.37480 H   0  0  0  0  0  0
   6.15770   0.59840   3.03600 H   0  0  0  0  0  0
   6.55750   1.15400   6.11260 H   0  0  0  0  0  0
   6.13180  -0.08550   5.81450 H   0  0  0  0  0  0
  1  6  1  0  0  0
  1  7  1  0  0  0
  1  8  1  0  0  0
  1 10  1  0  0  0
  2  3  1  0  0  0
  2  8  1  0  0  0
  2  9  1  0  0  0
  3 13  1  0  0  0
  3  6  1  0  0  0
  3 12  1  0  0  0
  4  5  1  0  0  0
  4 10  1  0  0  0
  4 11  1  0  0  0
  5  7  1  0  0  0
  5 14  1  0  0  0
  5 15  1  0  0  0
  6 17  1  0  0  0
  6 16  1  0  0  0
  7 19  1  0  0  0
  7 18  1  0  0  0
M  END
</ModelData>
</Models>
##$PEAKS=
<Peaks type="IR" xUnitsExpected="1/cm" >
<PeakData id="1" title="C=O stretch" peakShape="singlet" model="cisCugly2" xMax="1620" xMin="1580"  />
</Peaks>
##XUNITS=1/CM
##YUNITS=TRANSMITTANCE
##XFACTOR=1.0000000000
##YFACTOR=0.0000296563
##FIRSTX=201.67199707
##LASTX=1809.79040527
##FIRSTY=0.00999417
##DELTAX=1.30317533
##NPOINTS=1235
##XYDATA=(X++(Y..Y))
201.7C37YMOPTLPJ0N29R48P18K83R5R4R5R4R5j69P11O55R37R34TN33K83K290R54J0
244.7A1404P86O44%M4L17R64N66N06J72J76J71K60M11K50J28TM8%Tk30n93n94l37k76
276A4945k30j45j48j38j35L94N67P85J467L922J200M99J234N67N66N67P76L40L20N30
302B7883R41O67R5M4OPJ0Ll7m0l7q1k73l54p42p25l84n241p25l894j534r07j818j642
333.3A1222R71J656O140K489q97K478J919K728P25K66K26J75J86K12K70K73J28%Vj42
362C1025j44j59j75k30l57o54p05p52m92j01j187p19q19j01m7J75J281j07O91J052
388B7475J868K73TK09K26O41N70J01L24%XJ6K1pUop%J0PJ0Tn7o8o7o8o7o8o7Tp1p8
436.2C1322p7p8j18j42j28j31k43l81k02k73o38j568j193k80p59j753n16L34J186O04
$$ plain form
201.7 337 337 337 337 337 337 337 341 347 354 361 364 371 381 910 1858 2576 2859 2954 3048 3143 3237 3332 3163 3874 4529 5466 6400 7334 7867 8150 10440 11394 11404
244.7 11404 12190 12834 12834 12878 13195 14159 14725 15231 15403 15579 15750 16010 16421 16671 16799 16927 16975 16975 16975 16745 16152 15558 15221 14945
276 14945 14715 14570 14422 14284 14149 14543 15110 15895 17362 21284 22484 22983 24217 24784 25350 25917 26693 27033 27353 27883
302 27883 28824 29491 29586 29630 29636 29643 29653 29656 29619 29579 29542 29461 29188 28834 28092 27367 26983 21742 21017 17123 15589 14682 12864 11222
333.3 11222 12193 13849 19989 22478 21581 24059 25978 28706 29431 29697 29923 30098 30284 30496 30766 31039 31167 31167 31167 31167 31167 31025
362 31025 30881 30722 30547 30317 29960 29306 28601 27849 27357 27256 26069 25350 24531 24430 24383 24558 25839 25732 26423 27475
388 27475 29343 29616 29889 30098 30324 30965 31535 31636 31960 31960 31960 31960 31960 31960 31960 31976 31997 31990 31983 31976 31970 31963 31963 31973 31980 31990 32000 31943 31875 31808 31740 31673 31605 31538 31471 31400 31322
436.2 31322 31245 31167 31049 30907 30779 30648 30405 30024 29822 29549 28911 27343 26150 25870 25111 23358 22842 23176 24362 24966
462.3B4966R37R35M45L64J38%lk94m82k93k94m7J72K36L58L87K63K90J93J92j4j0j3
492.3B8426j4j3j7n1n0m7n1q4j05j04j15j32j31j79j95j79j75j93j92k93m45k94k93
522.3B5074k90k93k94k93k73k40j95j65j32j31k67k93k87k63n87n90n93p01q67p69
548.3A7551j254r88j130r04p62q19r64n30r4k4K87K86M76O07N70N29N63J35R5R1R4
575.7A3815R1TJ72L07M48L17M32K63K87K86J92J05J04J12J28J31J55J76M31K87M69
603A8799%Vn1j04j05j04j05j04j05j7Tj3j7LL4TL0L4L0J4%Wj0j08j05j04j66j75k87
647.4A7281k90k83k90n93n36k97n60o47o85o84o85o81o37n90n91n53m92%UJ65J93M24
677.3H969K87K90M55K13J92O1N7TN8L7L3L7L8L7J14J32J45J92L03L88K87K86K60K77
$$ plain form
462.3 24966 25903 26838 27283 27647 27785 27785 27782 27488 27006 26713 26419 26372 26544 26780 27138 27525 27788 28078 28271 28463 28449 28439 28426
492.3 28426 28412 28399 28382 28331 28281 28234 28183 28099 27994 27890 27775 27643 27512 27333 27138 26959 26784 26591 26399 26106 25661 25367 25074
522.3 25074 24784 24491 24197 23904 23631 23391 23196 23031 22899 22768 22501 22208 21921 21658 21071 20481 19888 19187 18320 17551
548.3 17551 16297 15309 14179 13275 12513 11694 10730 10200 10106 10082 10369 10655 11131 11738 12308 12837 13400 13535 13630 13721 13815
575.7 13815 13906 13997 14169 14476 14924 15241 15673 15936 16223 16509 16701 16806 16910 17022 17150 17281 17436 17612 18043 18330 18799
603 18799 18799 18799 18799 18799 18748 18644 18539 18435 18330 18226 18121 18104 18087 18074 18057 18060 18094 18128 18158 18192 18222 18236 18236 18236 18236 18236 18236 18226 18118 18013 17909 17743 17568 17281
647.4 17281 16991 16708 16418 15825 15289 14992 14432 13785 13100 12416 11731 11050 10413 9823 9232 8679 8187 8187 8187 8187 8352 8545 8969
677.3 8969 9256 9546 10001 10214 10406 10467 10524 10581 10639 10676 10709 10746 10784 10821 10935 11067 11212 11404 11707 12095 12382 12668 12928 13205
708.6A3205K86K90K83K87K36J72J05K3K7K4K3o7p8p7q1j75j79j92k13k93k90k77k73
738.6A2766k90k96j72j29r7Q1TQ0M12K86N47N66N67N70N63N66N67R37N63N70L00M28
767.2A9466N67N66N67N70N63N66M83L54K86K87K86K87K77K59K87K12J89J75J76J89
793.3B6612J92J35J31J28J32J31J28J29J31J28TJ12Q7Q5Q7P8O7O8O7N4N1N0N1N0P8
825.9B9090P8P7P4N8N7TN8N4N0M7N1N0N8N7TN8M0K0K1J7K0TJ0PTLPOMpTopUj0j3j0
875.4C0139j4j0TJ3J7K1K0m4Tm7q8j04j01j18j29j31j32j31j75k90k67o57j32r71m38
908B6177r11j564l68j804l696j271l058k101m009m55N86O528J740J477M593J335R58
930.1B4157L84Q1k63k90J01N53O54J400N66P02M01L7n1m7Tk83m96n56p62j127q19q13
$$ plain form
708.6 13205 13491 13781 14064 14351 14587 14759 14864 14887 14914 14938 14961 14894 14816 14739 14658 14483 14304 14112 13899 13606 13316 13039 12766
738.6 12766 12476 12180 12008 11879 11782 11863 11944 12024 12436 12722 13269 13835 14402 14972 15535 16101 16668 17605 18168 18738 19038 19466
767.2 19466 20033 20599 21166 21736 22299 22865 23348 23702 23988 24275 24561 24848 25125 25384 25671 25883 26072 26247 26423 26612
793.3 26612 26804 26939 27070 27198 27330 27461 27589 27718 27849 27977 28105 28217 28304 28389 28476 28554 28621 28689 28756 28810 28861 28911 28962 29012 29090
825.9 29090 29168 29245 29319 29377 29434 29491 29549 29603 29653 29700 29751 29801 29859 29916 29973 30031 30071 30091 30112 30129 30149 30169 30179 30186 30193 30196 30203 30209 30213 30206 30199 30193 30186 30179 30172 30162 30149 30139
875.4 30139 30125 30115 30105 30118 30135 30156 30176 30132 30088 30041 29953 29849 29748 29630 29501 29370 29238 29107 28932 28642 28375 27718 27586 26615 26177
908 26177 25266 23702 23334 21530 17834 16563 13505 11404 7395 6940 7526 14054 15794 17271 21864 23199 24157
930.1 24157 24541 24622 24359 24069 24170 24723 25377 26777 27343 28045 28446 28483 28432 28385 28338 28055 27559 27003 26241 25114 24295 23482
958.8B3482J25P02J800Q8J996N67M55J72J24L4UL3j3k4k7k3k7k4n7n8n7o1n7To1n7
994B9043n8n0n1m7n0o8j04j05j08j31j32j62j95j82j76m38k93m39m01l10n94n19k93
1024B4137p79p35j150j241k307m437k516k363m961q39K701K246K684N685M623J301
1044.8B2049J305N67J38J7r1n94o07r10m377j0824r68j197J150L514R114L332J635
1067B3253J673M31K30n1m7n1q1j75j82j96k36k90k93k67m48l14m85k94n09m58l38n96
1095.6B0276n90r38n93o54q13q20j217j028j110j807j214j328k486n69j788j305j240
1117.8G76l38l7TL1K63N39R34J244J353J422R35J304J407J358Q10J932R34N90R14N63
1143.9A6897R37L85L77K77J31J18m7n0m8r1k93k66m59l03n23r51o91j211n80l50q23
$$ plain form
958.8 23482 23607 24309 26109 26197 28193 28760 29215 29387 29511 29545 29579 29613 29646 29633 29609 29582 29559 29532 29508 29451 29393 29336 29275 29218 29161 29100 29043
994 29043 28985 28935 28884 28837 28787 28719 28615 28510 28402 28271 28139 27977 27782 27600 27424 26986 26693 26254 25853 25543 24949 24430 24137
1024 24137 23358 22623 21473 20232 17925 13488 10972 8609 3648 2809 5510 7756 10440 16125 20748 22049
1044.8 22049 23354 23921 24059 24076 23985 23391 22784 21874 17497 6673 5705 4508 5658 9172 18286 21618 23253
1067 23253 24926 25357 25587 25536 25489 25438 25357 25182 25000 24804 24568 24278 23985 23718 23270 22956 22471 22177 21668 21210 20872 20276
1095.6 20276 19686 18748 18155 17501 16688 15868 14651 13623 12513 10706 9492 8164 5678 5109 3321 2016 776
1117.8 776 438 401 364 395 658 1197 2131 3375 4728 6150 7085 8389 9796 11154 11964 13896 14830 15420 16334 16897
1143.9 16897 17834 18219 18596 18873 19004 19122 19075 19025 18977 18886 18593 18327 17868 17565 17042 16091 15400 14189 13609 13259 12436
1171.2A2436n46r1r5r1n23n93n53p1L20N77O98J868J018J966R55R34L13N8r8n4k7P
1199.9A8408R34N66R34R38M62L03N66K84J72J85J92J22J04J05Q4O8O7TK7PTLPT%l1
1233.8B4588k7l0k7Wk3k7Tn1n4n0n1Tm7n0n1Tm3l7l8l3l7Tm1m0m4m1o4p7p8p7j18j32
1279.4B2926j25j04j05j04j32j31j45j76j82j95j86j75k40k93k90k93k94l91l47m38
1305.5A8580n94n90n93q20j052k040k047j615j831j278r07m42J69N53K83N84J247K158
1328.9I765N16J163O98M39L84L00J72K57L97L61K87K56j3j4j0k53m65l10m96p42p01
1356.3A1991q26j076n56j602r44r04o31r57q26p25q70p02n93l17j08lmlTm%S9J902
1408.4B239q40M418n43L648J258J7m52q16r78p75j137m04R37J892M14J177K536R34
$$ plain form
1171.2 12436 11890 11799 11704 11613 11090 10497 9944 9873 10193 10770 11468 13336 14354 16320 17275 18209 18522 18580 18482 18428 18401 18408
1199.9 18408 19342 19908 20842 21780 22242 22545 23111 23395 23567 23752 23944 24066 24170 24275 24359 24427 24494 24561 24588 24595 24602 24605 24612 24619 24619 24588
1233.8 24588 24561 24531 24504 24477 24450 24423 24396 24373 24346 24319 24268 24214 24164 24113 24062 24015 23965 23914 23863 23820 23783 23745 23712 23675 23638 23597 23557 23513 23472 23408 23331 23253 23176 23058 22926
1279.4 22926 22801 22697 22592 22488 22356 22225 22080 21904 21722 21527 21341 21166 20926 20633 20343 20050 19756 19365 19018 18580
1305.5 18580 17986 17396 16803 15983 14931 12891 10844 9229 7398 6120 5213 4771 4940 5493 5776 6360 7607 9765
1328.9 9765 10281 11444 12142 12581 12965 13265 13437 13694 14091 14452 14739 14995 14982 14968 14958 14705 14240 13930 13434 12692 11991
1356.3 11991 11165 10089 9533 7931 6987 6083 5452 4495 3669 2944 2074 1372 779 462 354 351 347 344 341 337 337 337 337 337 337 337 337 337 337 337 337 337 337 337 337 337 337 337 337 2239
1408.4 2239 1399 5817 5274 8922 10180 10197 9745 8929 7951 7176 6039 5635 6572 8464 8878 10055 12591 13525
1431.9A3525P72K60J68K94N66R38N66Q53K87M35K86J45TJ25R1TQ5J3J7Umj7j3j7Tk3
1467.1A9605k1k0k3k1J4J7K0TP1P8P7P4J7Vml0k7l0l1m4p4p7p8p1n7Tj45l48j24j25
1508.8A8637j28j05r4r5j31j96j85j75l98l24m76l00k93k80l07m45k90k93n70n87k93
1536.1A2672n73r18n93n56n90n94n90n97n90o31p78Q4r17o31p52n49J58j608n06k94
1562.2F47k59o4pTlpTl%U5L%S5J4N0M8M7J55L14K66J271N50L61K90K63K69K73J89J66
1659.9D819M7M4M7q5r1r4k33m18l57k80k19n8n7TJ62J75O81J194R34R37N63R34J170
1689.9I758J309N46N70R34R37N63N67N66M05L61L98L54L67K87TM75K83K87M69J72J75
1717.3B0070J92K02K87K63K26J92J82J72J32J04J05J15J34J86K83J92J86P4P7P8Q4
$$ plain form
1431.9 13525 14297 14557 14725 15019 15585 16523 17089 17942 18229 18664 18950 19095 19240 19365 19456 19547 19632 19645 19662 19679 19696 19692 19675 19662 19645 19628 19605
1467.1 19605 19584 19564 19541 19520 19534 19551 19571 19591 19662 19740 19817 19891 19908 19925 19942 19959 19955 19925 19898 19868 19837 19793 19719 19642 19564 19493 19436 19379 19234 18886 18762 18637
1508.8 18637 18509 18404 18310 18215 18084 17888 17703 17528 17130 16806 16330 16030 15737 15457 15150 14705 14415 14122 13552 12965 12672
1536.1 12672 12099 11181 10588 10032 9442 8848 8258 7661 7071 6440 5662 5746 4829 4198 3446 2897 3055 1447 941 647
1562.2 647 388 324 317 310 307 300 293 290 290 290 290 290 290 290 290 290 290 290 290 290 290 290 290 290 290 290 290 290 290 290 290 290 290 290 290 290 290 290 290 290 290 290 290 293 293 293 293 293 293 293 293 293 293 293 293 293 293 293 293 307 357 405 452 607 921 1187 2458 3008 3369 3659 3922 4191 4464 4653 4819
1659.9 4819 4866 4910 4957 4872 4781 4687 4454 4036 3679 3399 3180 3122 3065 3008 3170 3345 4026 5220 6154 7091 7654 8588 9758
1689.9 9758 11067 11613 12183 13117 14054 14617 15184 15750 16155 16516 16914 17268 17635 17922 18209 18684 18967 19254 19723 19895 20070
1717.3 20070 20262 20464 20751 21014 21240 21432 21614 21786 21918 22022 22127 22242 22376 22562 22845 23037 23223 23297 23374 23452 23536
1744.6B3536J32J31J02Q0Q1WJ32J31J08P4P8P7P8P7P8TP0O8O7O8Q4R1R4Q1O8O7O8O4
1785B6187O7O8O7O4O1N7TN8N0M4VM0L7UL4L7
1809.8B7134
$$ plain form
1744.6 23536 23668 23799 23901 23981 24062 24143 24224 24305 24386 24518 24649 24757 24831 24909 24986 25064 25141 25219 25297 25367 25435 25502 25570 25654 25745 25839 25920 25988 26055 26123 26187
1785 26187 26254 26322 26389 26453 26514 26571 26628 26686 26736 26780 26824 26868 26912 26952 26989 27026 27063 27097 27134
1809.8 27134
##END=$$ End of the data block
##TITLE= cis-Cu(gly)2.H2O
##JCAMP-DX= 5.01
##DATA TYPE= RAMAN SPECTRUM
##DATA CLASS= XYDATA
##BLOCK ID=4
##ORIGIN= School of Chemistry, Univ of Bristol
##OWNER= public domain
##LONGDATE= 2012/02/22 13:33:39.0243 -0500 $$ export date from JSpecView
##$MODELS=
<Models>
<ModelData id="cis-Cugly2" type="MOL" >
cis-Cu(gly)2
__Jmol-12_06181220483D 1   1.00000     0.00000     0
Jmol version 12.3.32_dev  2012-06-17 12:21 EXTRACT: ({0:18})
 19 20  0  0  0  0              1 V2000
   4.74570   1.55870   4.73940 Cu  0  0  0  0  0  0
   4.05030   2.68840   2.32040 C   0  0  0  0  0  0
   5.33840   1.95110   1.97470 C   0  0  0  0  0  0
   3.90340   1.31530   7.35960 C   0  0  0  0  0  0
   5.23150   0.58550   7.37720 C   0  0  0  0  0  0
   5.97600   1.37620   3.16470 N   0  0  0  0  0  0
   5.93080   0.68170   6.08420 N   0  0  0  0  0  0
   3.61730   2.56970   3.50360 O   0  0  0  0  0  0
   3.48440   3.33590   1.42720 O   0  0  0  0  0  0
   3.51140   1.79510   6.23730 O   0  0  0  0  0  0
   3.25850   1.40400   8.41540 O   0  0  0  0  0  0
   5.13700   1.22660   1.32960 H   0  0  0  0  0  0
   5.96770   2.57940   1.53830 H   0  0  0  0  0  0
   5.80470   0.96910   8.08740 H   0  0  0  0  0  0
   5.07620  -0.36860   7.59400 H   0  0  0  0  0  0
   6.56790   1.79510   3.37480 H   0  0  0  0  0  0
   6.15770   0.59840   3.03600 H   0  0  0  0  0  0
   6.55750   1.15400   6.11260 H   0  0  0  0  0  0
   6.13180  -0.08550   5.81450 H   0  0  0  0  0  0
  1  6  1  0  0  0
  1  7  1  0  0  0
  1  8  1  0  0  0
  1 10  1  0  0  0
  2  3  1  0  0  0
  2  8  1  0  0  0
  2  9  1  0  0  0
  3 13  1  0  0  0
  3  6  1  0  0  0
  3 12  1  0  0  0
  4  5  1  0  0  0
  4 10  1  0  0  0
  4 11  1  0  0  0
  5  7  1  0  0  0
  5 14  1  0  0  0
  5 15  1  0  0  0
  6 17  1  0  0  0
  6 16  1  0  0  0
  7 19  1  0  0  0
  7 18  1  0  0  0
M  END
</ModelData>
</Models>
##$PEAKS=
<Peaks type="Raman" xUnitsExpected="1/cm">
<PeakData id="1" title="C=O stretch" peakShape="singlet" model="cis-Cugly2" xMax="1680" xMin="1650"    />
</Peaks>
##XUNITS= 1/CM
##YUNITS= RAMAN INTENSITY
##XFACTOR= 1E0
##YFACTOR= 1E-4
##FIRSTX= 175.27001953
##FIRSTY= 14.33125
##LASTX= 1604.18603221
##NPOINTS= 574
##XYDATA= (X++(Y..Y))
175.27001953A43313J6593K8375J0032K7343M4157L4843L2188L0406K3938D27406
202.70119464727748D58625L7000J8219J6750K1094J4500K8375M6750O5031P6719H42438
230.13235708863874H76594L8937M4313L0844R312k8656n5375n6906n4688n2687F78000
257.56361953E93906r5437r0281o5313m8031k7844j6406j375k5281j4500A89844
284.99473220591636A75406j7187j4781j8344j2625o438k093k563j0250n125p469H1969
314.91963220591634H6594n406N93R219K6500K7844K0750Q031k3812l5375k2313G8688
344.8446322059163G1094j0125o750m38J1875K188o875p563K688Q44N281N750M719G4031
379.75705708863876G4000k719p156o500j0531j438Q063J250m656r4p250j594M656D6719
$$ plain form
175.27001953 143313 159906 188281 198313 225656 269813 304656 336844 367250 391188 427406
202.70119464727748 458625 495625 513844 530594 551688 566188 594563 641313 706344 783063 842438
230.13235708863874 876594 915531 959844 990688 1000000 971344 915969 859063 804375 751688 678000
257.56361953 593906 498469 408188 342875 294844 267000 250594 249219 223938 209438 189844
284.99473220591636 175406 158219 143438 125094 112469 106031 103938 101375 91125 86000 78531 81969
314.91963220591634 86594 81188 81781 91000 117500 145344 166094 174125 150313 114938 92625 78688
344.8446322059163 71094 60969 54219 53781 65656 67844 60969 53406 56094 56938 62219 67969 72688 74031
379.75705708863876 74000 71281 64125 57625 47094 45656 53719 54969 50313 50219 42969 41375 46031 46719
414.6694322059163D2125K19P19k813K000J0375N250j406J0437J2375J4188J9875A56438
447.08811953B11188Q8218J10938Q7375o88q2843r3219o3500j9375K1281C11969
474.5193322059163C91156O2157j8094r0156j00907q3062n2563j9781j9469k750F7469
501.95045708863876F0219J969O875J1375n63L375M937J9282J0875J0344J7406K0593A91375
534.3689946472774B15375L2375O0125P0844O8531P1406M0907L6906K2719J7781F71094
561.7997570886388F44656l9687l9281l0094o156k1438j2187m5907n5312n7031B78094
589.2307322059162B37938k8813k9969l2562j8875j2563j6093q344j0250m125r219F7938
619.1552322059161E9531l625L782p344j906l13J000k656Q031j4594Q750j062L906E3094
$$ plain form
414.6694322059163 42125 42344 43063 40250 42250 52625 57875 56469 66906 79281 93469 113344 156438
447.08811953 211188 299406 410344 497719 497031 414188 320969 257469 238094 259375 311969
474.5193322059163 391156 453313 435219 345063 244156 161094 108531 88750 69281 66531 67469
501.95045708863876 60219 62188 69063 80438 79875 83250 88187 107469 118344 128688 146094 166687 191375
534.3689946472774 215375 247750 307875 378719 447250 518656 559563 596469 619188 636969 671094
561.7997570886388 644656 604969 565688 535594 529438 508000 495813 449906 394594 337563 278094
589.2307322059162 237938 209125 179156 146594 127719 115156 99063 90719 80469 76344 67125 67938
619.1552322059161 59531 55906 59688 52344 50438 50125 51125 48469 56500 41906 50656 49594 53500 53094
654.06711953D9781P094K719K969M062N813r4k938j968L781R531J1594K0281A44938
688.9791570886388A74156M8157M7125J5250L4343J5438L4156L9438M7125L0843D99375
716.41001953D68063L468Q1032j8438q281J7312M1844q125K6375q8719J1782F42000
746.3346322059161E29531Q9625K4750k08187k7000L9937o9781k3344j6844j3281B75156
773.7654946472775B49813j1719k4094k6344k1656K500l406k2219p625M000j5594A00563
803.6899570886387H8219L625m375j7188q031n656l313O125j531m781J406l125D5094
836.1082946472775C6344k469l094j0968L937O656o968k750J781m656p282k81M375I094
871.0202195300001B281j56k125J250J344m38k50L532N875O937R063O125P906J3687G9531
$$ plain form
654.06711953 49781 56875 59594 62563 66625 72438 72344 69406 67438 71219 80750 92344 112625 144938
688.9791570886388 174156 222313 269438 284688 319031 334469 368625 408063 455188 486031 499375
716.41001953 468063 471531 552563 534125 525844 543156 585000 576875 603250 514531 526313 642000
746.3346322059161 529531 619156 643906 435719 408719 448656 378875 355531 338687 325406 275156
773.7654946472775 249813 238094 214000 187656 166000 168500 165094 142875 135250 139250 123656 100563
803.6899570886387 88219 91844 87469 70281 62250 56594 53281 59406 57875 53094 54500 51375 45094
836.1082946472775 36344 33875 30781 19813 23750 30406 23438 20688 22469 17813 10531 10250 14625 9094
871.0202195300001 2281 2125 0 1250 2594 2156 1906 5438 11313 18250 27313 33438 41344 55031 79531
908.4260322059162A20938O9562R7625J53969J94531J25531m5406k02844k15125A95625
933.3630570886387A61438j0094j8844l1906k5625j9625n156O750J3500k282q187E1500
963.28761953C1438j2032p406P81j812p719L594J312J844o562j375Q43L875I844
998.1996946472775A4719j88L000j875K375j781k781L187L469M281R250J2032N875H3844
1033.111732205916A51469P0437J532p3563p0219k9625j3906L219P281K6563K9437A34438
1063.0370322059161I4688l7719k2156j157m656o844O813J000O2J563j25q44J125C4313
1097.95001953D0031J188R06Q406K0782J4968P188n31L187J25m000r875p469F5250
1132.8627570886385E3656j0375l468o282m687N875L844l13N625J9563K187K2719A11875
$$ plain form
908.4260322059162 120938 190500 288125 442094 636625 762156 716750 513906 298781 195625
933.3630570886387 161438 151344 132500 100594 74969 55344 50188 56938 70438 68156 59969 51500
963.28761953 31438 19406 12000 12781 10969 3250 6844 8156 10000 3438 2063 2906 6781 9844
998.1996946472775 14719 14531 17531 15656 18031 16250 13469 16656 20125 24406 33656 45688 51563 83844
1033.111732205916 151469 221906 223438 149875 79656 50031 36125 39344 46625 73188 102625 134438
1063.0370322059161 94688 56969 34813 33656 29000 22156 28969 29969 30031 31594 31469 30625 31750 34313
1097.95001953 40031 41219 42125 50531 71313 86281 93469 92938 96125 96250 92250 82375 74906 65250
1132.8627570886385 53656 43281 39813 33531 28844 34719 38563 38250 43875 63438 65625 88344 111875
1165.2819195299999A37844N5219M4062M6719N7812K8438j1031n3375o0032m6281A76281
1192.7132946472773A69625R031J5344j5062m0625l8657k8812j9938j781j0312r532B5750
1222.6386570886386B7750J063j907q468n500N343k531Q500P81m625J313n281J687B9656
1257.5514946472774B9781q75k18l188j125L094J031L094L437K188L344J4250M37E1000
1292.464232205916E2344K8719O000K656J4437J9438L2281L2844N4156Q9625R3813E22344
1322.3896570886386F34594Q8531J4438p0875j12344p8313m8343m6407o6375o6875A99219
1349.821032205916A67937l4718j4875R06N031J4344K719Q937N563J7312R282L7875B55281
1382.240132205916B97063J03531J47344J74593J53500R6063l1375j3969o6156G35906
$$ plain form
1165.2819195299999 137844 193063 237125 283844 341656 370094 359063 305688 245656 199375 176281
1192.7132946472773 169625 178656 194000 178938 138313 99656 70844 50906 49125 38813 29281 25750
1222.6386570886386 27750 28813 26906 18438 12938 18281 15750 24250 25031 20406 21719 16438 18125 29656
1257.5514946472774 29781 28906 28688 25500 24375 27469 28500 31594 35031 37219 40563 54813 55250 51000
1292.464232205916 52344 81063 87063 89719 104156 123594 155875 188719 242875 332500 426313 522344
1322.3896570886386 634594 723125 737563 666688 554344 476031 427688 381281 314906 248031 199219
1349.821032205916 167937 133219 118344 119250 124281 138625 141344 150281 155844 173156 182438 220313 255281
1382.240132205916 297063 400594 547938 722531 876031 972094 940719 926750 860594 735906
1407.17801953E86719j22719p1687l6563K5406R2344Q8969q656K5281Q4281G50844
1434.6093946472774G23250j55875j66687j20375o7782m1781k625q125k2937M531A36250
1462.0410195299999A18031q781q125J1313k1282j3906j6937K687j1469n531j125D0969
1491.966232205916D2000l281L219L093l218P50N93j4437P219n875N281p875l75C0563
1526.879032205916B9625L375J250m469O25j718O312k81j969P688J0156M062Q532G9031
1561.7920195299998A01938L0625M5625M9562P8156L7938k6719l9969k6406J1188B76344
1589.2234946472774B78156q437k6469l5031k4156A74000
$$ plain form
1407.17801953 586719 464000 392313 355750 381156 473500 562469 553813 579094 663375 750844
1434.6093946472774 723250 567375 400688 280313 212531 170750 168125 160000 137063 141594 136250
1462.0410195299999 118031 109250 101125 112438 91156 77250 60313 63000 51531 46000 44875 40969
1491.966232205916 42000 38719 41938 45031 41813 42563 43156 28719 35938 30063 35344 27469 27094 30563
1526.879032205916 29625 33000 34250 29781 30406 28688 35000 34719 32750 40438 50594 54656 63188 79031
1561.7920195299998 101938 132563 178188 227750 305906 343844 317125 277156 250750 261938 276344
1589.2234946472774 278156 269719 243250 208219 184063 174000
1604.186032205916A90094  $$checkpoint
##END=  $$ end of Raman or cis-isomer
##END=