##TITLE= Chloroform
##JCAMP-DX= 5.01
##DATA TYPE= INFRARED SPECTRUM
##DATA CLASS= XYDATA
##ORIGIN= Department of Chemistry, UWI, Mona, Jamaica
##OWNER= public domain
##LONGDATE= 2007/10/17 19:21:58.0937 -0500 $$ export date from JSpecView
##$MODELS=
<Models>
<ModelData>
CHCl3
RLDSViewer          3D                             0

  5  4  0  0  0  0  0  0  0  0999 V2000
    0.0000    0.0000    0.4971 C   0  0  0  0  0  0  0  0  0  1
    0.0000    0.0000    1.5871 H   0  0  0  0  0  0  0  0  0  2
    0.0000    1.6593   -0.0896 Cl  0  0  0  0  0  0  0  0  0  3
   -1.4370   -0.8297   -0.0896 Cl  0  0  0  0  0  0  0  0  0  4
    1.4370   -0.8297   -0.0896 Cl  0  0  0  0  0  0  0  0  0  5
  1  2  1  0  0  0
  1  3  1  0  0  0
  1  5  1  0  0  0
  1  4  1  0  0  0
M  END
</ModelData>
5
Model[1]: Convg=0.7033D-08;-V/T=2.0004;Energy=NaN;Range=M.O.s;E(RHF)=-1416.86840659 A.U.;PATH=Calculation 1;Input
C     0.00000    0.00000    0.00000
H     0.00000    0.00000    1.09000
Cl    1.65934    0.00000   -0.58667
Cl   -0.82967    1.43703   -0.58667
Cl   -0.82967   -1.43703   -0.58667
5
Model[2]: Convg=0.7033D-08;-V/T=2.0004;Energy=-1416.8685;Range=M.O.s;E(RHF)=-1416.86840659 A.U.;PATH=Calculation 1;Standard
C     0.00000    0.00000    0.49707
H     0.00000    0.00000    1.58707
Cl    0.00000    1.65934   -0.08960
Cl   -1.43703   -0.82967   -0.08960
Cl    1.43703   -0.82967   -0.08960
5
Model[3]: IRIntensity=0.3557 KM/Mole;ReducedMass=26.2449 AMU;ForceConstant=1.3644 mDyne/A;Frequency=297.0416 cm^-1;FrequencyLabel=E;PATH=Calculation 1;FrequenciesFrequencies
C     0.00000    0.00000    0.49707   -0.31000    0.00000    0.00000
H     0.00000    0.00000    1.58707   -0.44000    0.00000    0.00000
Cl    0.00000    1.65934   -0.08960    0.52000    0.00000    0.00000
Cl   -1.43703   -0.82967   -0.08960   -0.20000   -0.42000    0.03000
Cl    1.43703   -0.82967   -0.08960   -0.20000    0.42000   -0.03000
5
Model[4]: IRIntensity=0.3557 KM/Mole;ReducedMass=26.2449 AMU;ForceConstant=1.3644 mDyne/A;Frequency=297.0416 cm^-1;FrequencyLabel=E;PATH=Calculation 1;FrequenciesFrequencies
C     0.00000    0.00000    0.49707    0.00000    0.31000    0.00000
H     0.00000    0.00000    1.58707    0.00000    0.44000    0.00000
Cl    0.00000    1.65934   -0.08960    0.00000    0.44000    0.03000
Cl   -1.43703   -0.82967   -0.08960    0.42000   -0.28000   -0.02000
Cl    1.43703   -0.82967   -0.08960   -0.42000   -0.28000   -0.02000
5
Model[5]: IRIntensity=0.8827 KM/Mole;ReducedMass=20.8013 AMU;ForceConstant=2.0780 mDyne/A;Frequency=411.7711 cm^-1;FrequencyLabel=A1;PATH=Calculation 1;FrequenciesFrequencies
C     0.00000    0.00000    0.49707    0.00000    0.00000   -0.49000
H     0.00000    0.00000    1.58707    0.00000    0.00000   -0.50000
Cl    0.00000    1.65934   -0.08960    0.00000    0.41000    0.06000
Cl   -1.43703   -0.82967   -0.08960   -0.35000   -0.20000    0.06000
Cl    1.43703   -0.82967   -0.08960    0.35000   -0.20000    0.06000
5
$$ [...]
Cl   -1.43703   -0.82967   -0.08960   -0.10000   -0.06000   -0.08000
Cl    1.43703   -0.82967   -0.08960    0.10000   -0.06000   -0.08000
5
Model[7]: IRIntensity=150.8250 KM/Mole;ReducedMass=7.7939 AMU;ForceConstant=3.4807 mDyne/A;Frequency=870.6255 cm^-1;FrequencyLabel=E;PATH=Calculation 1;FrequenciesFrequencies
C     0.00000    0.00000    0.49707    0.00000    0.70000    0.00000
H     0.00000    0.00000    1.58707    0.00000    0.69000    0.00000
Cl    0.00000    1.65934   -0.08960    0.00000   -0.15000    0.07000
Cl   -1.43703   -0.82967   -0.08960   -0.06000   -0.05000   -0.03000
Cl    1.43703   -0.82967   -0.08960    0.06000   -0.05000   -0.03000
5
Model[8]: IRIntensity=150.8250 KM/Mole;ReducedMass=7.7939 AMU;ForceConstant=3.4807 mDyne/A;Frequency=870.6255 cm^-1;FrequencyLabel=E;PATH=Calculation 1;FrequenciesFrequencies
C     0.00000    0.00000    0.49707    0.70000    0.00000    0.00000
H     0.00000    0.00000    1.58707    0.69000    0.00000    0.00000
Cl    0.00000    1.65934   -0.08960   -0.02000    0.00000    0.00000
Cl   -1.43703   -0.82967   -0.08960   -0.12000   -0.06000   -0.06000
Cl    1.43703   -0.82967   -0.08960   -0.12000    0.06000    0.06000
5
Model[9]: IRIntensity=40.5189 KM/Mole;ReducedMass=1.1034 AMU;ForceConstant=1.3066 mDyne/A;Frequency=1417.6560 cm^-1;FrequencyLabel=E;PATH=Calculation 1;FrequenciesFrequencies
C     0.00000    0.00000    0.49707    0.00000   -0.09000    0.00000
H     0.00000    0.00000    1.58707    0.00000    1.00000    0.00000
Cl    0.00000    1.65934   -0.08960    0.00000    0.00000    0.01000
Cl   -1.43703   -0.82967   -0.08960    0.00000    0.00000   -0.01000
Cl    1.43703   -0.82967   -0.08960    0.00000    0.00000   -0.01000
5
Model[10]: IRIntensity=40.5189 KM/Mole;ReducedMass=1.1034 AMU;ForceConstant=1.3066 mDyne/A;Frequency=1417.6560 cm^-1;FrequencyLabel=E;PATH=Calculation 1;FrequenciesFrequencies
C     0.00000    0.00000    0.49707   -0.09000    0.00000    0.00000
H     0.00000    0.00000    1.58707    1.00000    0.00000    0.00000
Cl    0.00000    1.65934   -0.08960    0.00000    0.00000    0.00000
Cl   -1.43703   -0.82967   -0.08960    0.00000    0.00000   -0.01000
Cl    1.43703   -0.82967   -0.08960    0.00000    0.00000    0.01000
5
Model[11]: IRIntensity=0.0972 KM/Mole;ReducedMass=1.0897 AMU;ForceConstant=6.7234 mDyne/A;Frequency=3236.0024 cm^-1;FrequencyLabel=A1;PATH=Calculation 1;FrequenciesFrequencies
C     0.00000    0.00000    0.49707    0.00000    0.00000   -0.09000
H     0.00000    0.00000    1.58707    0.00000    0.00000    1.00000
Cl    0.00000    1.65934   -0.08960    0.00000    0.00000    0.00000
Cl   -1.43703   -0.82967   -0.08960    0.00000    0.00000    0.00000
Cl    1.43703   -0.82967   -0.08960    0.00000    0.00000    0.00000
</ModelData>
</Models>
##$PEAKS=

##XUNITS= 1/CM
##YUNITS= TRANSMITTANCE
##XFACTOR= 3.516E-3
##YFACTOR= 9.4775E-7
##FIRSTX= 450
##FIRSTY= 1
##LASTX= 3966
##NPOINTS= 880
##XYDATA= (X++(Y..Y))
127986A055131j6058l30R23r760J1310p979P979p056P353j0387P617p023J220A038150
145051A030500N177q507Q836J814k737K143j220L067k770K440k143K770j847O27A035083
163254A038150J220O462q012j1244J6487l990j847k143j517j846k737%J220J517A032643
181456A032017q91J814k97r23J517j1508l924m5502j7344M2040k1828k8092J1243I92021
198521A020212Q771L957k440n94l033p848j0485k3543l6501n8592r3709j22494E10782
214448C59173j59885q3949k7137l3071J5794J0023K15346K51352K19269J27209I63433
228100A002902J7310J0288L066J220J517K97J220%j814r23k143l957m550%M550A032643
247440A033566K440K97R23K97%j220k97j549j814j220k737k96k97k440j220L660A031423
$$ y = [1055131, 1039073, 1038743, 1039666, 1029906, 1041216, 1033237, 1041216, 1034160, 1041513, 1031126, 1038743, 1031720, 1032940, 1038150, 1030500, 1035677, 1027170, 1036006, 1037820, 1035083, 1037226, 1036006, 1039073, 1036303, 1038743, 1036600, 1039370, 1037523, 1038150, 1035083, 1038150, 1039370, 1045832, 1037820, 1026576, 1043063, 1039073, 1037226, 1035083, 1033566, 1031720, 1028983, 1028983, 1030203, 1031720, 1032643, 1032017, 1031126, 1032940, 1032643, 1031720, 1033237, 1021729, 1017805, 972303, 954959, 996999, 975171, 947079, 958322, 992021, 1020212, 1028983, 1032940, 1030500, 1029906, 1026873, 1019025, 1008540, 984997, 948496, 889904, 796195, 673701, 510782, 359173, 199288, 115339, 88202, 55131, 70925, 80948, 296294, 547646, 766915, 894124, 963433, 1002902, 1020212, 1030500, 1033566, 1034786, 1036303, 1036600, 1037820, 1037820, 1036006, 1035083, 1032940, 1028983, 1024433, 1024433, 1028983, 1032643, 1033566, 1036006, 1036303, 1037226, 1037523, 1037523, 1036303, 1036006, 1034457, 1032643, 1031423, 1028686, 1028390, 1028093, 1025653, 1024433, 1028093, 1031423]
267918A030203k97K737L363J220J517n93N93%L30N93k96j220%%o27r23r23q91A033237
290671A033237k97j220%n94J517r23R23%K97K97L29N94%%O26Q91O26K97J220k97A037820
315700A038743n93%R23K97O26%l30R24%r24L30l30n93%j253j220k440l660o661A015102
339590A010024j3915l5512n9581r9150j41156j65821J1244J85307J55665Q8862I86184
353242A011211J3848O364M254J846J220O27K96L30Q90%%L30%%%l30%%%k96%%%A041216
381684A040590K96%L30l30L30o26%%%r24%%n93%l30%j220k97r23k737r23l033A027466
408987A025653%K440M847M286J847%r23N93r23L30%%%N93O27o27r23k97j517j549A033237
434016A032017n94k97j220j220J517J814K440k97R23K440K143R24R23J220k97A042733
$$ y = [1030203, 1029906, 1032643, 1036006, 1037226, 1038743, 1038150, 1038743, 1038743, 1039073, 1039666, 1039370, 1038150, 1038150, 1038150, 1037523, 1036600, 1035677, 1034786, 1033237, 1033237, 1032940, 1031720, 1031720, 1031126, 1032643, 1031720, 1032643, 1032643, 1032940, 1033237, 1033566, 1034160, 1034160, 1034160, 1034786, 1035677, 1036303, 1036600, 1037820, 1037523, 1037820, 1038743, 1038150, 1038150, 1039073, 1039370, 1039996, 1039996, 1039666, 1040590, 1040590, 1039666, 1039996, 1039666, 1039073, 1039073, 1037820, 1036600, 1034160, 1030500, 1023839, 1015102, 1010024, 996109, 960597, 901016, 801866, 660710, 494889, 506133, 691440, 847105, 935967, 986184, 1011211, 1025059, 1031423, 1035677, 1037523, 1038743, 1039370, 1039666, 1039996, 1040886, 1040886, 1040886, 1041216, 1041216, 1041216, 1041216, 1040886, 1040886, 1040886, 1040886, 1040590, 1040590, 1040590, 1040590, 1041216, 1040590, 1040886, 1040886, 1041216, 1040886, 1041216, 1040590, 1040590, 1040590, 1040590, 1039666, 1039666, 1039666, 1039073, 1039073, 1038743, 1038743, 1037523, 1037226, 1036303, 1033566, 1032643, 1029610, 1027466, 1025653, 1025653, 1028093, 1032940, 1037226, 1039073, 1039073, 1038150, 1038743, 1037820, 1038150, 1038150, 1038150, 1038150, 1038743, 1039370, 1038743, 1037820, 1037523, 1036006, 1034457, 1033237, 1032017, 1031423, 1031126, 1029906, 1028686, 1030203, 1032017, 1034457, 1034160, 1035083, 1037523, 1039666, 1040590, 1041513, 1042733, 1042436, 1042733]
453356A042733%R23%%L30j253R23L30%l30%L30K97o27L30r23J220k97l30%O27A043986
479522A043656O27%%k97%%N93k96k97N93k96%K96%%k96k97N93n93K97k97N93k96A045206
507964A044283K96r23L30N93k96%%%%R23o27%O27%o27%R56r56O27%%%L29l29%A045206
538680A044579%%%%R56%l29L29l29%%L29%%%%%%K97k97%%K97%k97K97%k97K97A045535
573948A046129k97%K97n94%%%%%%N94k97k97%K97K97k97%k97N94%%%%O26%%o26A046755
608077A046755%%%%%%%K97%r23O26%%%%K97%%%r23R23%%%%k97K97%%%%k97%%%A046755
650171A047052%O27k97K97%R23%k97o26O26o26k97l30k97%J550K97j220j550J220A044283
675199A045535r56k96R23o27n93j847K144k770r793J2266j253n94R24N93J550A044283
$$ y = [1042733, 1042733, 1043656, 1043656, 1043656, 1043986, 1042733, 1043656, 1043986, 1043986, 1043656, 1043656, 1043986, 1044283, 1043656, 1043986, 1043063, 1044283, 1043986, 1043656, 1043656, 1044283, 1043986, 1043656, 1044283, 1044283, 1044283, 1043986, 1043986, 1043986, 1044579, 1044283, 1043986, 1044579, 1044283, 1044283, 1044579, 1044579, 1044579, 1044283, 1043986, 1044579, 1043986, 1044283, 1043986, 1044579, 1044283, 1045206, 1044283, 1044579, 1043656, 1043986, 1044579, 1044283, 1044283, 1044283, 1044283, 1044283, 1045206, 1044579, 1044579, 1045206, 1045206, 1044579, 1044579, 1045535, 1044579, 1045206, 1045206, 1045206, 1045206, 1045535, 1045206, 1045206, 1045206, 1044579, 1044579, 1044579, 1044579, 1044579, 1045535, 1045535, 1045206, 1045535, 1045206, 1045206, 1045206, 1045535, 1045535, 1045535, 1045535, 1045535, 1045535, 1045535, 1045832, 1045535, 1045535, 1045535, 1045832, 1045832, 1045535, 1045832, 1045832, 1045535, 1045832, 1045535, 1046129, 1045832, 1045832, 1046129, 1045535, 1045535, 1045535, 1045535, 1045535, 1045535, 1045535, 1046129, 1045832, 1045535, 1045535, 1045832, 1046129, 1045832, 1045832, 1045535, 1046129, 1046129, 1046129, 1046129, 1046129, 1046755, 1046755, 1046755, 1046129, 1046755, 1046755, 1046755, 1046755, 1046755, 1046755, 1046755, 1046755, 1046755, 1047052, 1047052, 1046129, 1046755, 1046755, 1046755, 1046755, 1046755, 1047052, 1047052, 1047052, 1047052, 1046129, 1047052, 1047052, 1047052, 1047052, 1047052, 1046755, 1047052, 1047052, 1047052, 1047052, 1047052, 1046755, 1046755, 1046755, 1046755, 1046755, 1047052, 1047052, 1047679, 1047382, 1047679, 1047679, 1048602, 1048602, 1048305, 1047679, 1048305, 1047679, 1047382, 1047052, 1046755, 1046755, 1048305, 1048602, 1047382, 1045832, 1047052, 1044283, 1045535, 1044579, 1044283, 1045206, 1044579, 1043986, 1042139, 1044283, 1041513, 1031720, 1043986, 1042733, 1042139, 1043063, 1043656, 1045206, 1044283]
694539A044283%J252l29%L29%J220K97%L30%K97%k97l30O27%k97%%%R23o26%%A047052
725256A047382%l30O27%%%%%%O26%%o26O26%K97r23O26o26%R23%r23%%%%%%k97A048305
761661A047679o27%L30%%%l30L30%%%%%J220j220R23o26%%k97K97%%%%%o27L30A046755
795791A047382%l30%%%%%%k97r23K97%%%%n94r56O27%o27n93%K97k97r23%l30A043656
828783A042733%%L30%%N93r23%%k97K97n94K97k97K97%%k97K97J220r23R23%R23A043063
858362A043986l30L30l30m583N93P386m319J846O27R23%J253%l30L30%%%l30O27A047382
883390A047382K97o27%O27k97%%%%%%%K97k97%l30L30%l30O27o27L30o27O27%A047679
914107A047679k97l30%L30%%%l30k97J847j220R23%o26%O26r23l30L30l30O27A047382
$$ y = [1044283, 1044283, 1045535, 1045206, 1045206, 1045535, 1045535, 1046755, 1047052, 1047052, 1047382, 1047382, 1047679, 1047679, 1047382, 1047052, 1047679, 1047679, 1047382, 1047382, 1047382, 1047382, 1048305, 1047679, 1047679, 1047679, 1047052, 1047382, 1047382, 1047052, 1047679, 1047679, 1047679, 1047679, 1047679, 1047679, 1047679, 1048305, 1048305, 1048305, 1047679, 1048305, 1048305, 1048602, 1047679, 1048305, 1047679, 1047679, 1048602, 1048602, 1047679, 1047679, 1047679, 1047679, 1047679, 1047679, 1047679, 1047382, 1048305, 1047679, 1047052, 1047052, 1047382, 1047382, 1047382, 1047382, 1047052, 1047382, 1047382, 1047382, 1047382, 1047382, 1047382, 1048602, 1047382, 1048305, 1047679, 1047679, 1047679, 1047382, 1047679, 1047679, 1047679, 1047679, 1047679, 1047679, 1047052, 1047382, 1046755, 1047382, 1047382, 1047052, 1047052, 1047052, 1047052, 1047052, 1047052, 1047052, 1046755, 1045832, 1046129, 1046129, 1046129, 1046129, 1046129, 1045535, 1044579, 1045206, 1045206, 1044579, 1043986, 1043986, 1044283, 1043986, 1043063, 1043063, 1042733, 1043656, 1042733, 1042733, 1042733, 1043063, 1043063, 1043063, 1043656, 1042733, 1042733, 1042733, 1042436, 1042733, 1042139, 1042436, 1042139, 1042436, 1042436, 1042436, 1042139, 1042436, 1043656, 1042733, 1043656, 1043656, 1044579, 1043063, 1043986, 1043656, 1043986, 1043656, 1039073, 1039666, 1047052, 1042733, 1044579, 1045206, 1046129, 1046129, 1047382, 1047382, 1047052, 1047382, 1047382, 1047382, 1047382, 1047052, 1047679, 1047382, 1047382, 1047679, 1047052, 1047052, 1047679, 1047382, 1047382, 1047382, 1047382, 1047382, 1047382, 1047382, 1047382, 1047679, 1047382, 1047382, 1047052, 1047382, 1047382, 1047052, 1047679, 1047052, 1047382, 1046755, 1047382, 1047382, 1047679, 1047679, 1047382, 1047052, 1047052, 1047382, 1047382, 1047382, 1047382, 1047052, 1046755, 1048602, 1047382, 1048305, 1048305, 1047679, 1047679, 1048305, 1047382, 1047052, 1047382, 1047052, 1047679, 1047382]
940273A047052%L30J220j550O27k97K97k97K97%O26r23%K97O26r23K97o27%O27A047382
965301A047679k97o27K97%J253o26%O26%j253O27k97%%%J220j550L30R23o26o27A047382
991468A048305r23J220k97%%%%K97r23O26%r23%R23K97r23%R23%k97r23J220j220A047679
1019909A047382R23j550J847j847R24O26o26%O26%k176O26K97L30R23k176%%R23A046755
1043800A046129%l066L692K97j220j253K473j517l29J846k97O27K97O26K97j220A047679
1064278A046755K97L30%R23o26%O26K97k97%K97j220o27R24%%R23r23k97%J220A048305
1090444A048602k97%r23K97o27k97J847%r23O26K97r23R23r23R23j220l30J253A048305
1113197A047679k97%J220k97K97%%j220l30J550%A047382
$$ y = [1047052, 1047052, 1047382, 1048602, 1047052, 1047679, 1047382, 1047679, 1047382, 1047679, 1047679, 1048305, 1047382, 1047382, 1047679, 1048305, 1047382, 1047679, 1047052, 1047052, 1047679, 1047382, 1047679, 1047382, 1046755, 1047052, 1047052, 1048305, 1047679, 1047679, 1048305, 1048305, 1047052, 1047679, 1047382, 1047382, 1047382, 1047382, 1048602, 1047052, 1047382, 1048305, 1047679, 1047052, 1047382, 1048305, 1047382, 1048602, 1048305, 1048305, 1048305, 1048305, 1048305, 1048602, 1047679, 1048305, 1048305, 1047382, 1047382, 1048305, 1048602, 1047679, 1047679, 1048602, 1048602, 1048305, 1047382, 1048602, 1047382, 1047679, 1047382, 1048305, 1046755, 1048602, 1046755, 1047679, 1048305, 1047679, 1047679, 1048305, 1048305, 1046129, 1046755, 1047052, 1047382, 1048305, 1046129, 1046129, 1046129, 1047052, 1046755, 1046129, 1046129, 1043063, 1046755, 1047052, 1045832, 1044579, 1047052, 1045535, 1045206, 1047052, 1046755, 1047382, 1047679, 1048305, 1048602, 1047382, 1047679, 1046755, 1047052, 1047382, 1047382, 1048305, 1047679, 1047679, 1048305, 1048602, 1048305, 1048305, 1048602, 1047382, 1046755, 1047679, 1047679, 1047679, 1048602, 1047679, 1047382, 1047382, 1048602, 1048305, 1048602, 1048305, 1048305, 1047382, 1047679, 1047052, 1046755, 1048602, 1048602, 1047679, 1048305, 1048602, 1047679, 1048602, 1047679, 1048602, 1047382, 1047052, 1048305, 1048305, 1047679, 1047382, 1047382, 1048602, 1048305, 1048602, 1048602, 1048602, 1047382, 1047052, 1048602, 1048602, 1047382]
1127986A048305  $$checkpoint
##END=