##TITLE= 1,2-dichloroethylene
##JCAMP-DX=5.01
##DATA TYPE= LINK
##BLOCKS= 4
##TITLE= cis-1,2-dichloroethylene (Z)
##JCAMP-DX= 5.01
##DATA TYPE= INFRARED SPECTRUM
##DATA CLASS= XYDATA
##BLOCK ID=1
##ORIGIN= Department of Chemistry, UWI, JAMAICA
##OWNER= public domain
##LONGDATE= 2012/02/18 12:31:56.0440 -0500 $$ export date from JSpecView
##SPECTROMETER/DATA SYSTEM= from scan
##$MODELS=
<Models>
<ModelData id="Cc2h2cl2" type="MOL">
cis-1,2-dichloroethylene (Z)
RLDSViewer          3D                             0

  6  5  0  0  0  0  0  0  0  0999 V2000
    0.0000    0.6703    0.9615 C   0  0  0  0  0  0  0  0  0  1
    0.0000    1.6559   -0.4509 Cl  0  0  0  0  0  0  0  0  0  2
    0.0000   -0.6703    0.9615 C   0  0  0  0  0  0  0  0  0  3
    0.0000   -1.2543    1.8960 H   0  0  0  0  0  0  0  0  0  4
    0.0000   -1.6559   -0.4509 Cl  0  0  0  0  0  0  0  0  0  5
    0.0000    1.2543    1.8960 H   0  0  0  0  0  0  0  0  0  6
  1  6  1  0  0  0
  1  3  2  0  0  0
  1  2  1  0  0  0
  3  4  1  0  0  0
  3  5  1  0  0  0
M  END
</ModelData>
<ModelData id="C1" type="XYZVIB" baseModel="Cc2h2cl2" vibrationScale=".5">
6
Model[1]: Convg=0.2429D-08;-V/T=1.0002;Energy=NaN;E(RPM3)=0.919026666692E-02 A.U.;Range=M.O.s;PATH=Calculation 1;Input
C     0.00000    0.00000    0.00000
Cl    0.00000    0.00000    1.72231
C     1.09934    0.00000   -0.76714
H     1.04351    0.00000   -1.86773
Cl    2.71588    0.00000   -0.17287
H    -1.01374    0.00000   -0.43215
6
Model[2]: Convg=0.2429D-08;-V/T=1.0002;Energy=0.009190267;E(RPM3)=0.919026666692E-02 A.U.;Range=M.O.s;PATH=Calculation 1;Standard
C     0.00000    0.67027    0.96153
Cl    0.00000    1.65587   -0.45089
C     0.00000   -0.67027    0.96153
H     0.00000   -1.25431    1.89604
Cl    0.00000   -1.65587   -0.45089
H     0.00000    1.25431    1.89604
6
Model[3]: IRIntensity=0.1623 KM/Mole;ReducedMass=27.1796 AMU;ForceConstant=0.3452 mDyne/A;Frequency=146.8263 cm^-1;FrequencyLabel=A1;PATH=Calculation 1;FrequenciesFrequencies
C     0.00000    0.67027    0.96153    0.00000    0.00000   -0.28000
Cl    0.00000    1.65587   -0.45089    0.00000    0.59000    0.10000
C     0.00000   -0.67027    0.96153    0.00000    0.00000   -0.28000
H     0.00000   -1.25431    1.89604    0.00000    0.20000   -0.14000
Cl    0.00000   -1.65587   -0.45089    0.00000   -0.59000    0.10000
H     0.00000    1.25431    1.89604    0.00000   -0.20000   -0.14000
6
Model[4]: IRIntensity=0.0000 KM/Mole;ReducedMass=2.7386 AMU;ForceConstant=0.2504 mDyne/A;Frequency=393.9051 cm^-1;FrequencyLabel=A2;PATH=Calculation 1;FrequenciesFrequencies
C     0.00000    0.67027    0.96153    0.27000    0.00000    0.00000
Cl    0.00000    1.65587   -0.45089   -0.05000    0.00000    0.00000
C     0.00000   -0.67027    0.96153   -0.27000    0.00000    0.00000
H     0.00000   -1.25431    1.89604   -0.65000    0.00000    0.00000
Cl    0.00000   -1.65587   -0.45089    0.05000    0.00000    0.00000
H     0.00000    1.25431    1.89604    0.65000    0.00000    0.00000
6
$$ [...]
H     0.00000    1.25431    1.89604    0.00000    0.08000    0.39000
6
Model[13]: IRIntensity=41.8464 KM/Mole;ReducedMass=1.0801 AMU;ForceConstant=5.7403 mDyne/A;Frequency=3003.3938 cm^-1;FrequencyLabel=B2;PATH=Calculation 1;FrequenciesFrequencies
C     0.00000    0.67027    0.96153    0.00000    0.03000    0.05000
Cl    0.00000    1.65587   -0.45089    0.00000    0.00000    0.00000
C     0.00000   -0.67027    0.96153    0.00000    0.03000   -0.05000
H     0.00000   -1.25431    1.89604    0.00000   -0.36000    0.60000
Cl    0.00000   -1.65587   -0.45089    0.00000    0.00000    0.00000
H     0.00000    1.25431    1.89604    0.00000   -0.36000   -0.60000
6
Model[14]: IRIntensity=36.4698 KM/Mole;ReducedMass=1.0964 AMU;ForceConstant=5.9009 mDyne/A;Frequency=3022.3735 cm^-1;FrequencyLabel=A1;PATH=Calculation 1;FrequenciesFrequencies
C     0.00000    0.67027    0.96153    0.00000    0.04000    0.05000
Cl    0.00000    1.65587   -0.45089    0.00000    0.00000    0.00000
C     0.00000   -0.67027    0.96153    0.00000   -0.04000    0.05000
H     0.00000   -1.25431    1.89604    0.00000    0.37000   -0.60000
Cl    0.00000   -1.65587   -0.45089    0.00000    0.00000    0.00000
H     0.00000    1.25431    1.89604    0.00000   -0.37000   -0.60000
</ModelData>
</Models>
##$PEAKS=
<Peaks type="IR" xUnitsExpected="1/cm"  >
<PeakData id="1" title="B1-asymm stretch of C-H group (~3088 cm-1)" peakShape="broad" model="C1.13" xMax="3120" xMin="3080"    />
<PeakData id="2" title="A1-symm stretch of C-H group (~3080 cm-1)" peakShape="broad" model="C1.14" xMax="3100" xMin="3060"    />
<PeakData id="3" title="A1- C=C stretch (~1590 cm-1)" peakShape="broad" model="C1.12" xMax="1600" xMin="1555"    />
<PeakData id="4" title="B1-asymm C-H bend (~1300 cm-1)" peakShape="broad" model="C1.11" xMax="1320" xMin="1240"    />
<PeakData id="5" title="A1- C-H scissors (~1180 cm-1)" peakShape="broad" model="C1.10" xMax="1210" xMin="1160"    />
<PeakData id="6" title="Inactive A2- C-H rocking (~875 cm-1)" peakShape="broad" model="C1.8" xMax="900" xMin="860"    />
<PeakData id="7" title="B1-asymm stretch of C-Cl group (~850 cm-1)" peakShape="broad" model="C1.7" xMax="870" xMin="830"    />
<PeakData id="8" title="A1-symm stretch of C-Cl group (~715 cm-1)" peakShape="broad" model="C1.6" xMax="735" xMin="695"    />
<PeakData id="9" title="B2-asym C-H flap (~697 cm-1)" peakShape="broad" model="C1.9" xMax="720" xMin="670"    />
<PeakData id="10" title="B2-asymm bend of C-Cl group (~571 cm-1)" peakShape="broad" model="C1.5" xMax="590" xMin="550"    />
<PeakData id="11" title="Inactive A2- Cl-C=C-Cl torsion (~406 cm-1)" peakShape="broad" model="C1.4" xMax="420" xMin="380"    />
<PeakData id="12" title="A1-symm bend of C-Cl group (~173 cm-1)" peakShape="broad" model="C1.3" xMax="190" xMin="150"    />
</Peaks>
##XUNITS= 1/CM
##YUNITS= TRANSMITTANCE
##XFACTOR= 1E0
##YFACTOR= 8.49006E-7
##FIRSTX= 550
##FIRSTY= 0.911305
##LASTX= 3846
##NPOINTS= 825
##XYDATA= (X++(Y..Y))
550.0 1073379 976441 955469 955649 953887 955254 950434 946585 997483 1067049 1111759 1133629
598.0 1138017 1140319 1140787 1140104 1140104 1140571 1135500 1130643 1124025 1111076 1092048 1065538 1027734 979210
654.0 917414 841373 758606 671451 596957 534513 499982 470235 454625 292543 171684
698.0 289126 425525 419409 436639 449588 475811 499767 545377 615661 701989 775440
742.0 834071 886300 939283 986404 1026870 1059494 1083451 1100069 1111974 1118773 1120608
786.0 1121039 1118773 1115356 1109708 1102515 1097407 1093594 1082335 1053272 996476 903925 748499
834.0 540305 337074 205029 153880 151038 158591 171217 163339 176397 313657 601346
878.0 880365 1027734 1080142 1098953 1111759 1120140 1126507 1132477 1136398 1137081 1139636 1142405
926.0 1145427 1145427 1146146 1146829 1148017 1148232 1148484 1148952 1148484 1148484 1148952 1149419 1148484 1148232 1148484 1147549 1147081 1147549
998.0 1146829 1146146 1144743 1141039 1140571 1141974 1141722 1141722 1142873 1143593 1144959 1147081 1146146 1147297 1150103
1058.0 1151038 1150570 1149167 1147297 1148017 1147765 1142873 1139887 1140104 1141974 1142873 1142657 1142873 1143808 1144959
1118.0 1146146 1147765 1148700 1147549 1147081 1148484 1146829 1144528 1146362 1146614 1145211 1144743 1146146 1145211
1174.0 1143808 1144743 1145427 1145427 1144743 1144743 1144743 1144528 1144060 1142405 1142190 1142657 1142405 1142873 1142873 1140104 1137549 1136650
1246.0 1133880 1129960 1121291 1109708 1093379 1074674 1051366 1021259 967160 870761 734795
1290.0 614151 579512 612784 629186 646955 621057 627531 757383 924356 1044135 1102515
1334.0 1125608 1134312 1137549 1138017 1138701 1139169 1138484 1135715 1134097 1131579 1128593 1126759 1127226 1129493
1390.0 1128593 1124025 1122407 1124708 1128341 1131327 1133880 1135931 1136866 1137549 1137549 1138017 1138484 1138484 1137801 1136650
1454.0 1134312 1131327 1130176 1131579 1132477 1131579 1130895 1131111 1132729 1136398 1138952 1138952 1136866 1134097 1130176
1514.0 1125391 1118989 1108162 1091832 1068379 1031690 978238 904285 821806 746233 693609
1558.0 663717 639365 609331 572389 560627 583648 617532 654222 679544 676486 671559
1602.0 709147 784145 865833 934715 988814 1032121 1067300 1095177 1115141 1127910 1135248
1646.0 1139169 1140787 1140787 1139887 1138952 1138701 1137801 1135500 1132477 1129493 1125391 1120824 1116507 1111543 1106795
1706.0 1105465 1105680 1107011 1106795 1102983 1103414 1110860 1119673 1126291 1130176 1133412 1136866 1139636 1141255
1762.0 1142657 1143808 1145211 1145894 1146614 1147549 1147765 1147297 1147297 1148017 1148700 1148484 1148232 1148484 1148700 1148952 1149419
1830.0 1148952 1148484 1148700 1149419 1149635 1148700 1148017 1148017 1147765 1148017 1148017 1148484 1148017 1147765 1148232 1148017 1148700 1148952
1902.0 1148700 1148484 1148952 1149635 1149419 1149167 1149419 1149167 1149419 1149167 1148952 1148952 1149419 1149419 1149167 1148952 1149167 1148700
1974.0 1148484 1148700 1149167 1149419 1149419 1149167 1149635 1149887 1150103 1150103 1150103 1150355 1150355 1149635 1149635 1149419 1149635 1150103 1150103 1148952 1148952
2058.0 1149635 1149887 1149419 1149419 1150355 1151038 1150570 1149887 1149887 1149419 1148484 1148232 1148484 1148017 1147765 1147081 1146146 1145894
2130.0 1145427 1145211 1144959 1144528 1144743 1145211 1144959 1145211 1144743 1144276 1145679 1147081 1147297 1148232 1148232 1147765 1148232
2198.0 1148484 1148232 1148232 1146614 1146614 1148017 1147549 1147765 1147765 1147549 1148700 1148484 1148017 1148484 1148484 1147765 1147297 1147081
2270.0 1146362 1145427 1145427 1145427 1145894 1146146 1144959 1144276 1145211 1145211 1145679 1145679 1145679 1146829 1147549 1148017 1147549 1146146 1147081
2346.0 1147549 1147081 1145894 1144276 1143125 1142405 1142657 1141974 1141039 1141039 1141255 1141722 1141974 1142657 1143593 1144528
2410.0 1144528 1143593 1143808 1144743 1144959 1144959 1144959 1146614 1147549 1148017 1149167 1148952 1148952 1148952 1148484 1149167 1149887 1149419 1148700
2486.0 1147765 1148952 1149419 1148700 1148484 1148700 1148952 1148700 1148700 1149167 1148700 1148484 1148484 1149419 1150103 1150355 1150103 1150570
2558.0 1149635 1149635 1149419 1148484 1148952 1148952 1148232 1149167 1149419 1148700 1149635 1150103 1149419 1149887 1149887 1150103 1150570 1150355 1150355
2634.0 1150570 1150103 1149635 1150103 1150570 1150355 1149419 1148952 1149419 1149887 1150103 1150103 1149887 1149167 1149419 1149887 1150822
2702.0 1151038 1150103 1150822 1150822 1149635 1150570 1150822 1149167 1148232 1148232 1147549 1147081 1145894 1145211 1146362 1146614 1145894
2770.0 1145894 1146829 1148017 1148484 1148017 1148232 1149167 1149887 1149887 1149635 1148952 1148484 1148484 1147765 1146829 1144959 1142873
2838.0 1142405 1140787 1137549 1134097 1131327 1128808 1126974 1126507 1126291 1126507 1128593 1133162 1136183 1138017
2894.0 1141255 1144276 1146362 1146614 1146829 1147297 1146614 1147549 1148700 1148232 1148017 1148232 1149167 1148952 1148700 1148952
2958.0 1148232 1146829 1146614 1148232 1148952 1148952 1148232 1148700 1147297 1145211 1143808 1143341 1142873 1143341 1142405 1141039
3022.0 1140571 1139169 1137081 1135248 1133162 1129060 1124025 1115356 1098738 1072265 1032734 975073
3070.0 910939 850149 827165 837128 828999 844142 838135 861085 961872 1052876 1102515 1120608
3118.0 1129276 1134097 1138269 1140104 1141722 1143341 1143125 1142873 1143341 1144060 1144528 1145211 1146146 1147081 1147765 1148017
3182.0 1146146 1146146 1147081 1147081 1147765 1148700 1148952 1148952 1148952 1149167 1149419 1148952 1150103 1151038 1149635 1148017 1148232 1148484
3254.0 1147765 1148232 1149167 1148700 1147549 1147081 1148017 1148952 1149419 1148952 1148017 1148700 1148484 1149887 1150355 1149167
3318.0 1149419 1149167 1148232 1148017 1148952 1148952 1148952 1149167 1148700 1147765 1148484 1148484 1148484 1148017 1147081 1148700 1149419 1148232 1147297
3394.0 1146614 1147765 1148484 1148484 1148952 1149167 1148017 1148484 1148017 1146829 1147765 1148952 1148232 1146614 1147081 1146146
3458.0 1145679 1147297 1148484 1148017 1146829 1146614 1146829 1148017 1148484 1147765 1147549 1148952 1150103 1149635 1148484
3518.0 1149419 1149419 1149635 1150355 1149167 1148700 1148484 1148484 1148017 1147081 1147549 1147765 1148232 1149887 1149419 1147549 1147765
3586.0 1148700 1148700 1147549 1147549 1148484 1147549 1148017 1147765 1145427 1145427 1144959 1144276 1144060 1142405 1141974 1141507 1140787 1141039
3658.0 1141722 1142405 1142657 1143341 1145679 1148017 1148484 1146829 1146829 1148232 1148232 1147549 1148700 1147765 1145211 1145211 1146829 1146614
3730.0 1145427 1145679 1145679 1144959 1145894 1146362 1146362 1146362 1144743 1144276 1144959 1146146 1146829 1146614 1144276 1142190 1143125
3798.0 1144060 1143593 1144060 1146829 1147297 1144959 1144959 1145211 1144528 1146146 1148232 1149167
3846.0A150103  $$checkpoint
##END= $$ end of cis-DCE IR
##TITLE=Raman of cis-1,2-dichloroethylene (Z) $$ Begin of the data block
##JCAMP-DX=5.00 $$ ACD/DocManager Library v 5.00
##DATA TYPE=RAMAN SPECTRUM
##DATA CLASS=XYDATA
##BLOCK ID=2
##DATE=19 Feb 2012 10:29:22
##ORIGIN= Department of Chemistry, UWI, Jamaica
##OWNER= public domain
##SPECTROMETER/DATA SYSTEM=from scan
##$MODELS=
<Models>
<ModelData id="Cc2h2cl2" type="MOL">
cis-1,2-dichloroethylene (Z)
RLDSViewer          3D                             0

  6  5  0  0  0  0  0  0  0  0999 V2000
    0.0000    0.6703    0.9615 C   0  0  0  0  0  0  0  0  0  1
    0.0000    1.6559   -0.4509 Cl  0  0  0  0  0  0  0  0  0  2
    0.0000   -0.6703    0.9615 C   0  0  0  0  0  0  0  0  0  3
    0.0000   -1.2543    1.8960 H   0  0  0  0  0  0  0  0  0  4
    0.0000   -1.6559   -0.4509 Cl  0  0  0  0  0  0  0  0  0  5
    0.0000    1.2543    1.8960 H   0  0  0  0  0  0  0  0  0  6
  1  6  1  0  0  0
  1  3  2  0  0  0
  1  2  1  0  0  0
  3  4  1  0  0  0
  3  5  1  0  0  0
M  END
</ModelData>
<ModelData id="C2" type="XYZVIB" baseModel="Cc2h2cl2" vibrationScale=".5">
6
Model[1]: Convg=0.2429D-08;-V/T=1.0002;Energy=NaN;E(RPM3)=0.919026666692E-02 A.U.;Range=M.O.s;PATH=Calculation 1;Input
C     0.00000    0.00000    0.00000
Cl    0.00000    0.00000    1.72231
C     1.09934    0.00000   -0.76714
H     1.04351    0.00000   -1.86773
Cl    2.71588    0.00000   -0.17287
H    -1.01374    0.00000   -0.43215
6
Model[2]: Convg=0.2429D-08;-V/T=1.0002;Energy=0.009190267;E(RPM3)=0.919026666692E-02 A.U.;Range=M.O.s;PATH=Calculation 1;Standard
C     0.00000    0.67027    0.96153
Cl    0.00000    1.65587   -0.45089
C     0.00000   -0.67027    0.96153
H     0.00000   -1.25431    1.89604
Cl    0.00000   -1.65587   -0.45089
H     0.00000    1.25431    1.89604
6
Model[3]: IRIntensity=0.1623 KM/Mole;ReducedMass=27.1796 AMU;ForceConstant=0.3452 mDyne/A;Frequency=146.8263 cm^-1;FrequencyLabel=A1;PATH=Calculation 1;FrequenciesFrequencies
C     0.00000    0.67027    0.96153    0.00000    0.00000   -0.28000
Cl    0.00000    1.65587   -0.45089    0.00000    0.59000    0.10000
C     0.00000   -0.67027    0.96153    0.00000    0.00000   -0.28000
H     0.00000   -1.25431    1.89604    0.00000    0.20000   -0.14000
Cl    0.00000   -1.65587   -0.45089    0.00000   -0.59000    0.10000
H     0.00000    1.25431    1.89604    0.00000   -0.20000   -0.14000
6
Model[4]: IRIntensity=0.0000 KM/Mole;ReducedMass=2.7386 AMU;ForceConstant=0.2504 mDyne/A;Frequency=393.9051 cm^-1;FrequencyLabel=A2;PATH=Calculation 1;FrequenciesFrequencies
C     0.00000    0.67027    0.96153    0.27000    0.00000    0.00000
Cl    0.00000    1.65587   -0.45089   -0.05000    0.00000    0.00000
C     0.00000   -0.67027    0.96153   -0.27000    0.00000    0.00000
H     0.00000   -1.25431    1.89604   -0.65000    0.00000    0.00000
Cl    0.00000   -1.65587   -0.45089    0.05000    0.00000    0.00000
H     0.00000    1.25431    1.89604    0.65000    0.00000    0.00000
6
Model[5]: IRIntensity=9.3488 KM/Mole;ReducedMass=9.5299 AMU;ForceConstant=1.3839 mDyne/A;Frequency=496.4658 cm^-1;FrequencyLabel=B2;PATH=Calculation 1;FrequenciesFrequencies
C     0.00000    0.67027    0.96153    0.00000    0.47000    0.13000
Cl    0.00000    1.65587   -0.45089    0.00000   -0.17000    0.13000
C     0.00000   -0.67027    0.96153    0.00000    0.47000   -0.13000
H     0.00000   -1.25431    1.89604    0.00000    0.43000   -0.17000
Cl    0.00000   -1.65587   -0.45089    0.00000   -0.17000   -0.13000
H     0.00000    1.25431    1.89604    0.00000    0.43000    0.17000
6
Model[6]: IRIntensity=24.2180 KM/Mole;ReducedMass=9.9009 AMU;ForceConstant=1.9484 mDyne/A;Frequency=577.9285 cm^-1;FrequencyLabel=A1;PATH=Calculation 1;FrequenciesFrequencies
C     0.00000    0.67027    0.96153    0.00000    0.00000    0.51000
Cl    0.00000    1.65587   -0.45089    0.00000    0.12000   -0.18000
C     0.00000   -0.67027    0.96153    0.00000    0.00000    0.51000
H     0.00000   -1.25431    1.89604    0.00000   -0.35000    0.27000
Cl    0.00000   -1.65587   -0.45089    0.00000   -0.12000   -0.18000
H     0.00000    1.25431    1.89604    0.00000    0.35000    0.27000
6
Model[7]: IRIntensity=45.6105 KM/Mole;ReducedMass=5.6061 AMU;ForceConstant=1.9169 mDyne/A;Frequency=761.7979 cm^-1;FrequencyLabel=B2;PATH=Calculation 1;FrequenciesFrequencies
C     0.00000    0.67027    0.96153    0.00000   -0.03000    0.43000
Cl    0.00000    1.65587   -0.45089    0.00000    0.01000   -0.09000
C     0.00000   -0.67027    0.96153    0.00000   -0.03000   -0.43000
H     0.00000   -1.25431    1.89604    0.00000   -0.21000   -0.51000
Cl    0.00000   -1.65587   -0.45089    0.00000    0.01000    0.09000
H     0.00000    1.25431    1.89604    0.00000   -0.21000    0.51000
6
Model[8]: IRIntensity=50.3660 KM/Mole;ReducedMass=1.2298 AMU;ForceConstant=0.4404 mDyne/A;Frequency=779.5981 cm^-1;FrequencyLabel=B1;PATH=Calculation 1;FrequenciesFrequencies
C     0.00000    0.67027    0.96153    0.10000    0.00000    0.00000
Cl    0.00000    1.65587   -0.45089   -0.01000    0.00000    0.00000
C     0.00000   -0.67027    0.96153    0.10000    0.00000    0.00000
H     0.00000   -1.25431    1.89604   -0.70000    0.00000    0.00000
Cl    0.00000   -1.65587   -0.45089   -0.01000    0.00000    0.00000
H     0.00000    1.25431    1.89604   -0.70000    0.00000    0.00000
6
Model[9]: IRIntensity=0.0000 KM/Mole;ReducedMass=1.4436 AMU;ForceConstant=0.7836 mDyne/A;Frequency=959.8055 cm^-1;FrequencyLabel=A2;PATH=Calculation 1;FrequenciesFrequencies
C     0.00000    0.67027    0.96153    0.14000    0.00000    0.00000
Cl    0.00000    1.65587   -0.45089    0.00000    0.00000    0.00000
C     0.00000   -0.67027    0.96153   -0.14000    0.00000    0.00000
H     0.00000   -1.25431    1.89604    0.69000    0.00000    0.00000
Cl    0.00000   -1.65587   -0.45089    0.00000    0.00000    0.00000
H     0.00000    1.25431    1.89604   -0.69000    0.00000    0.00000
6
Model[10]: IRIntensity=3.0206 KM/Mole;ReducedMass=1.0231 AMU;ForceConstant=0.8402 mDyne/A;Frequency=1180.6516 cm^-1;FrequencyLabel=A1;PATH=Calculation 1;FrequenciesFrequencies
C     0.00000    0.67027    0.96153    0.00000   -0.01000    0.01000
Cl    0.00000    1.65587   -0.45089    0.00000    0.00000   -0.01000
C     0.00000   -0.67027    0.96153    0.00000    0.01000    0.01000
H     0.00000   -1.25431    1.89604    0.00000    0.61000    0.36000
Cl    0.00000   -1.65587   -0.45089    0.00000    0.00000   -0.01000
H     0.00000    1.25431    1.89604    0.00000   -0.61000    0.36000
6
Model[11]: IRIntensity=39.6557 KM/Mole;ReducedMass=1.1647 AMU;ForceConstant=1.0093 mDyne/A;Frequency=1212.7624 cm^-1;FrequencyLabel=B2;PATH=Calculation 1;FrequenciesFrequencies
C     0.00000    0.67027    0.96153    0.00000    0.06000   -0.06000
Cl    0.00000    1.65587   -0.45089    0.00000    0.00000   -0.01000
C     0.00000   -0.67027    0.96153    0.00000    0.06000    0.06000
H     0.00000   -1.25431    1.89604    0.00000   -0.61000   -0.34000
Cl    0.00000   -1.65587   -0.45089    0.00000    0.00000    0.01000
H     0.00000    1.25431    1.89604    0.00000   -0.61000    0.34000
6
Model[12]: IRIntensity=20.1196 KM/Mole;ReducedMass=8.4412 AMU;ForceConstant=15.0914 mDyne/A;Frequency=1741.9642 cm^-1;FrequencyLabel=A1;PATH=Calculation 1;FrequenciesFrequencies
C     0.00000    0.67027    0.96153    0.00000    0.58000   -0.03000
Cl    0.00000    1.65587   -0.45089    0.00000    0.00000    0.00000
C     0.00000   -0.67027    0.96153    0.00000   -0.58000   -0.03000
H     0.00000   -1.25431    1.89604    0.00000   -0.08000    0.39000
Cl    0.00000   -1.65587   -0.45089    0.00000    0.00000    0.00000
H     0.00000    1.25431    1.89604    0.00000    0.08000    0.39000
6
Model[13]: IRIntensity=41.8464 KM/Mole;ReducedMass=1.0801 AMU;ForceConstant=5.7403 mDyne/A;Frequency=3003.3938 cm^-1;FrequencyLabel=B2;PATH=Calculation 1;FrequenciesFrequencies
C     0.00000    0.67027    0.96153    0.00000    0.03000    0.05000
Cl    0.00000    1.65587   -0.45089    0.00000    0.00000    0.00000
C     0.00000   -0.67027    0.96153    0.00000    0.03000   -0.05000
H     0.00000   -1.25431    1.89604    0.00000   -0.36000    0.60000
Cl    0.00000   -1.65587   -0.45089    0.00000    0.00000    0.00000
H     0.00000    1.25431    1.89604    0.00000   -0.36000   -0.60000
6
Model[14]: IRIntensity=36.4698 KM/Mole;ReducedMass=1.0964 AMU;ForceConstant=5.9009 mDyne/A;Frequency=3022.3735 cm^-1;FrequencyLabel=A1;PATH=Calculation 1;FrequenciesFrequencies
C     0.00000    0.67027    0.96153    0.00000    0.04000    0.05000
Cl    0.00000    1.65587   -0.45089    0.00000    0.00000    0.00000
C     0.00000   -0.67027    0.96153    0.00000   -0.04000    0.05000
H     0.00000   -1.25431    1.89604    0.00000    0.37000   -0.60000
Cl    0.00000   -1.65587   -0.45089    0.00000    0.00000    0.00000
H     0.00000    1.25431    1.89604    0.00000   -0.37000   -0.60000
</ModelData>
</Models>
##$PEAKS=
<Peaks type="RAMAN" xUnitsExpected="1/cm"  >
<PeakData id="1" title="B1-asymm stretch of C-H group (~3088 cm-1)" peakShape="broad" model="C2.13" xMax="3120" xMin="3080"    />
<PeakData id="2" title="A1-symm stretch of C-H group (~3080 cm-1)" peakShape="broad" model="C2.14" xMax="3100" xMin="3060"    />
<PeakData id="3" title="A1- C=C stretch (~1590 cm-1)" peakShape="broad" model="C2.12" xMax="1600" xMin="1555"    />
<PeakData id="4" title="B1-asymm C-H bend (~1300 cm-1)" peakShape="broad" model="C2.11" xMax="1320" xMin="1240"    />
<PeakData id="5" title="A1- C-H scissors (~1180 cm-1)" peakShape="broad" model="C2.10" xMax="1210" xMin="1160"    />
<PeakData id="6" title="A2- C-H rocking (~875 cm-1)" peakShape="broad" model="C2.8" xMax="900" xMin="860"    />
<PeakData id="7" title="B1-asymm stretch of C-Cl group (~850 cm-1)" peakShape="broad" model="C2.7" xMax="870" xMin="830"    />
<PeakData id="8" title="A1-symm stretch of C-Cl group (~715 cm-1)" peakShape="broad" model="C2.6" xMax="735" xMin="695"    />
<PeakData id="9" title="B2-asym C-H flap (~697 cm-1)" peakShape="broad" model="C2.9" xMax="720" xMin="670"    />
<PeakData id="10" title="B2-asymm bend of C-Cl group (~571 cm-1)" peakShape="broad" model="C2.5" xMax="590" xMin="550"    />
<PeakData id="11" title="A2- Cl-C=C-Cl torsion (~406 cm-1)" peakShape="broad" model="C2.4" xMax="420" xMin="380"    />
<PeakData id="12" title="A1-symm bend of C-Cl group (~173 cm-1)" peakShape="broad" model="C2.3" xMax="190" xMin="150"    />
</Peaks>
##XUNITS=1/CM
##YUNITS=RAMAN INTENSITY
##XFACTOR=1.0000000000
##YFACTOR=0.0000356563
##FIRSTX=68.91406250
##LASTX=3365.01416016
##MAXX=3365.01416016
##MINX=68.91406250
##FIRSTY=0.85500002
##NPOINTS=515
##XYDATA=(X++(Y..Y))
68.9 23979 21315 18650 16351 14051 11989 9928 8708 7488 7236 6983 18819 30654 21932 13209 9157 5104
171.5 5104 4095 3085 2636 2188 2047 1907 1809 1711 1711 1711 1669 1627 1486 1346 1234 1122 1080 1038 1094 1150 1416 1683 2734 3786 3646
331.8 3646 3506 3085 2664 2174 1683 2300 2917 5343 7769 5385 3001 2258 1514 1388 1262 1220 1178 1080 982 883 785 785 785 813 841 1150 1458 1528 1599
517.8 1599 1486 1374 2300 3225 3295 3365 2524 1683 1388 1094 1038 982 1024 1066 1108 1150 1248 1346 1543 1739 1949 2160 2174 2188 17094 32000 23488 14976 9101
703.8 9101 3225 2482 1739 1528 1318 1276 1234 1178 1122 1080 1038 1094 1150 1402 1655 1599 1543 1444 1346 1346 1346 1388 1430 1472 1514 1290 1066 940 813 869 926 954 982 982
921.8 982 982 954 926 869 813 799 785 785 785 785 785 785 785 785 785 785 785 771 757 715 673 659 645 743 841 897 954 911 869 841 813 911 1010 1248 1486 3127 4768 5455 6142 4179 2216 1753
1191.1 1753 1290 1136 982 982 982 1038 1094 1262 1430 1935 2440 1865 1290 1094 897 841 785 785 785 785 785 785 785 757 729 673 617 631 645 701 757 743 729 687 645 617 589 589 589 631
1447.6 631 673 715 757 729 701 659 617 645 673 715 757 841 926 1038 1150 1318 1486 10713 19940 11835 3730 2510 1290 1080 869 799 729 673 617 645 673 715 757 1010
1665.7A010K52N19Tl93Tl22l23q4Tn6T%U6K8TM2TJ4Tn6Tk8T%S34J4TM2Vn6Tk8TM2V%
2986.7 785 785 799 813 855 897 1010 1122 1318 1514 2286 3057 10966 18875 12480 6086 4277 2468 1893 1318 1276 1234 1234 1234 1402 1571 1879 2188
3159.8 2188 1795 1402 1136 869 757 645 687 729 729 729 687 645 617 589 589 589 631 673 715 757 813 869 911 954 926 897 855 813 883 954 1052 1150
3365 1150
##END=$$ End of the RAMAN for cis-DCE
##TITLE= trans-1,2-dichloroethene (E)
##JCAMP-DX= 5.01
##DATA TYPE= INFRARED SPECTRUM
##DATA CLASS= XYDATA
##BLOCK ID=3
##ORIGIN= Department of Chemistry, UWI, JAMAICA
##OWNER= public domain
##LONGDATE= 2012/02/18 12:32:26.0301 -0500 $$ export date from JSpecView
##SPECTROMETER/DATA SYSTEM= from scan
##$MODELS=
<Models>
<ModelData id="Tc2h2cl2" type="MOL">
trans-1,2-dichloroethylene (E)

  created with ArgusLab version 4.0.1
  6  5  0  0  0  0  0  0  0  0  0 V2000
   -0.3642    0.5617    0.0000 C   0  0  0  0  0  0  0  0  0  0  0  0
   -1.4662    0.5830    0.0000 H   0  0  0  0  0  0  0  0  0  0  0  0
    0.3642    2.1208    0.0000 Cl  0  0  0  0  0  0  0  0  0  0  0  0
    0.3642   -0.5617    0.0000 C   0  0  0  0  0  0  0  0  0  0  0  0
    1.4662   -0.5830    0.0000 H   0  0  0  0  0  0  0  0  0  0  0  0
   -0.3642   -2.1208    0.0000 Cl  0  0  0  0  0  0  0  0  0  0  0  0
  1  2  1  0  0  0  0
  1  3  1  0  0  0  0
  1  4  2  0  0  0  0
  4  5  1  0  0  0  0
  4  6  1  0  0  0  0
M  END
</ModelData>
<ModelData id="T1" type="XYZVIB" baseModel="Tc2h2cl2" vibrationScale=".5">
6
Model[1]: E(RAM1)=-0.434016412453E-02 A.U.;Convg=0.4972D-08;-V/T=0.9999;Energy=NaN;Range=M.O.s;PATH=Calculation 1;Input
C     0.00000    0.00000    0.00000
H     0.00000    0.00000    1.10217
Cl    1.57296    0.00000   -0.69806
C    -1.10899    0.00000   -0.75009
H    -1.10899    0.00000   -1.85226
Cl   -2.68195    0.00000   -0.05203
6
Model[2]: E(RAM1)=-0.434016412453E-02 A.U.;Convg=0.4972D-08;-V/T=0.9999;Energy=-0.004340164;Range=M.O.s;PATH=Calculation 1;Standard
C    -0.36422    0.56166    0.00000
H    -1.46618    0.58304    0.00000
Cl    0.36422    2.12079    0.00000
C     0.36422   -0.56166    0.00000
H     1.46618   -0.58304    0.00000
Cl   -0.36422   -2.12079    0.00000
6
Model[3]: IRIntensity=1.0809 KM/Mole;ReducedMass=6.8502 AMU;ForceConstant=0.2257 mDyne/A;Frequency=236.4958 cm^-1;FrequencyLabel=AU;PATH=Calculation 1;FrequenciesFrequencies
C    -0.36422    0.56166    0.00000    0.00000    0.00000    0.43000
H    -1.46618    0.58304    0.00000    0.00000    0.00000    0.54000
Cl    0.36422    2.12079    0.00000    0.00000    0.00000   -0.16000
C     0.36422   -0.56166    0.00000    0.00000    0.00000    0.43000
H     1.46618   -0.58304    0.00000    0.00000    0.00000    0.54000
Cl   -0.36422   -2.12079    0.00000    0.00000    0.00000   -0.16000
6
Model[4]: IRIntensity=2.4048 KM/Mole;ReducedMass=6.8794 AMU;ForceConstant=0.2853 mDyne/A;Frequency=265.3070 cm^-1;FrequencyLabel=BU;PATH=Calculation 1;FrequenciesFrequencies
C    -0.36422    0.56166    0.00000   -0.40000    0.15000    0.00000
H    -1.46618    0.58304    0.00000   -0.38000    0.38000    0.00000
Cl    0.36422    2.12079    0.00000    0.15000   -0.06000    0.00000
C     0.36422   -0.56166    0.00000   -0.40000    0.15000    0.00000
H     1.46618   -0.58304    0.00000   -0.38000    0.38000    0.00000
Cl   -0.36422   -2.12079    0.00000    0.15000   -0.06000    0.00000
6
Model[5]: IRIntensity=0.0000 KM/Mole;ReducedMass=18.4278 AMU;ForceConstant=1.4783 mDyne/A;Frequency=368.9947 cm^-1;FrequencyLabel=AG;PATH=Calculation 1;FrequenciesFrequencies
C    -0.36422    0.56166    0.00000    0.21000    0.15000    0.00000
H    -1.46618    0.58304    0.00000    0.21000    0.39000    0.00000
Cl    0.36422    2.12079    0.00000    0.05000    0.48000    0.00000
C     0.36422   -0.56166    0.00000   -0.21000   -0.15000    0.00000
H     1.46618   -0.58304    0.00000   -0.21000   -0.39000    0.00000
Cl   -0.36422   -2.12079    0.00000   -0.05000   -0.48000    0.00000
6
Model[6]: IRIntensity=0.0000 KM/Mole;ReducedMass=4.8520 AMU;ForceConstant=2.0603 mDyne/A;Frequency=848.9532 cm^-1;FrequencyLabel=AG;PATH=Calculation 1;FrequenciesFrequencies
C    -0.36422    0.56166    0.00000    0.32000    0.19000    0.00000
H    -1.46618    0.58304    0.00000    0.31000    0.50000    0.00000
Cl    0.36422    2.12079    0.00000   -0.07000   -0.08000    0.00000
C     0.36422   -0.56166    0.00000   -0.32000   -0.19000    0.00000
H     1.46618   -0.58304    0.00000   -0.31000   -0.50000    0.00000
Cl   -0.36422   -2.12079    0.00000    0.07000    0.08000    0.00000
6
Model[7]: IRIntensity=0.0000 KM/Mole;ReducedMass=1.8465 AMU;ForceConstant=0.8421 mDyne/A;Frequency=879.8182 cm^-1;FrequencyLabel=BG;PATH=Calculation 1;FrequenciesFrequencies
C    -0.36422    0.56166    0.00000    0.00000    0.00000    0.19000
H    -1.46618    0.58304    0.00000    0.00000    0.00000   -0.68000
Cl    0.36422    2.12079    0.00000    0.00000    0.00000   -0.01000
C     0.36422   -0.56166    0.00000    0.00000    0.00000   -0.19000
H     1.46618   -0.58304    0.00000    0.00000    0.00000    0.68000
Cl   -0.36422   -2.12079    0.00000    0.00000    0.00000    0.01000
6
Model[8]: IRIntensity=156.1848 KM/Mole;ReducedMass=10.4115 AMU;ForceConstant=4.7511 mDyne/A;Frequency=880.0642 cm^-1;FrequencyLabel=BU;PATH=Calculation 1;FrequenciesFrequencies
C    -0.36422    0.56166    0.00000    0.21000    0.51000    0.00000
H    -1.46618    0.58304    0.00000    0.18000    0.35000    0.00000
Cl    0.36422    2.12079    0.00000   -0.08000   -0.19000    0.00000
C     0.36422   -0.56166    0.00000    0.21000    0.51000    0.00000
H     1.46618   -0.58304    0.00000    0.18000    0.35000    0.00000
Cl   -0.36422   -2.12079    0.00000   -0.08000   -0.19000    0.00000
6
Model[9]: IRIntensity=85.4112 KM/Mole;ReducedMass=1.1165 AMU;ForceConstant=0.6016 mDyne/A;Frequency=956.3369 cm^-1;FrequencyLabel=AU;PATH=Calculation 1;FrequenciesFrequencies
C    -0.36422    0.56166    0.00000    0.00000    0.00000   -0.07000
H    -1.46618    0.58304    0.00000    0.00000    0.00000    0.70000
Cl    0.36422    2.12079    0.00000    0.00000    0.00000    0.00000
C     0.36422   -0.56166    0.00000    0.00000    0.00000   -0.07000
H     1.46618   -0.58304    0.00000    0.00000    0.00000    0.70000
Cl   -0.36422   -2.12079    0.00000    0.00000    0.00000    0.00000
6
Model[10]: IRIntensity=16.6654 KM/Mole;ReducedMass=1.0902 AMU;ForceConstant=0.9190 mDyne/A;Frequency=1196.1292 cm^-1;FrequencyLabel=BU;PATH=Calculation 1;FrequenciesFrequencies
C    -0.36422    0.56166    0.00000    0.02000   -0.06000    0.00000
H    -1.46618    0.58304    0.00000    0.06000    0.70000    0.00000
Cl    0.36422    2.12079    0.00000   -0.01000    0.00000    0.00000
C     0.36422   -0.56166    0.00000    0.02000   -0.06000    0.00000
H     1.46618   -0.58304    0.00000    0.06000    0.70000    0.00000
Cl   -0.36422   -2.12079    0.00000   -0.01000    0.00000    0.00000
6
Model[11]: IRIntensity=0.0000 KM/Mole;ReducedMass=1.1490 AMU;ForceConstant=1.0669 mDyne/A;Frequency=1255.3385 cm^-1;FrequencyLabel=AG;PATH=Calculation 1;FrequenciesFrequencies
C    -0.36422    0.56166    0.00000   -0.07000   -0.04000    0.00000
H    -1.46618    0.58304    0.00000   -0.04000    0.70000    0.00000
Cl    0.36422    2.12079    0.00000   -0.01000    0.00000    0.00000
C     0.36422   -0.56166    0.00000    0.07000    0.04000    0.00000
H     1.46618   -0.58304    0.00000    0.04000   -0.70000    0.00000
Cl   -0.36422   -2.12079    0.00000    0.01000    0.00000    0.00000
6
Model[12]: IRIntensity=0.0000 KM/Mole;ReducedMass=9.1626 AMU;ForceConstant=17.0165 mDyne/A;Frequency=1775.4231 cm^-1;FrequencyLabel=AG;PATH=Calculation 1;FrequenciesFrequencies
C    -0.36422    0.56166    0.00000   -0.29000    0.53000    0.00000
H    -1.46618    0.58304    0.00000   -0.36000   -0.03000    0.00000
Cl    0.36422    2.12079    0.00000    0.00000   -0.01000    0.00000
C     0.36422   -0.56166    0.00000    0.29000   -0.53000    0.00000
H     1.46618   -0.58304    0.00000    0.36000    0.03000    0.00000
Cl   -0.36422   -2.12079    0.00000    0.00000    0.01000    0.00000
6
Model[13]: IRIntensity=0.0000 KM/Mole;ReducedMass=1.0823 AMU;ForceConstant=6.2456 mDyne/A;Frequency=3129.6222 cm^-1;FrequencyLabel=AG;PATH=Calculation 1;FrequenciesFrequencies
C    -0.36422    0.56166    0.00000   -0.06000    0.01000    0.00000
H    -1.46618    0.58304    0.00000    0.70000   -0.03000    0.00000
Cl    0.36422    2.12079    0.00000    0.00000    0.00000    0.00000
C     0.36422   -0.56166    0.00000    0.06000   -0.01000    0.00000
H     1.46618   -0.58304    0.00000   -0.70000    0.03000    0.00000
Cl   -0.36422   -2.12079    0.00000    0.00000    0.00000    0.00000
6
Model[14]: IRIntensity=124.2254 KM/Mole;ReducedMass=1.0815 AMU;ForceConstant=6.2982 mDyne/A;Frequency=3143.8929 cm^-1;FrequencyLabel=BU;PATH=Calculation 1;FrequenciesFrequencies
C    -0.36422    0.56166    0.00000   -0.06000    0.00000    0.00000
H    -1.46618    0.58304    0.00000    0.70000   -0.03000    0.00000
Cl    0.36422    2.12079    0.00000    0.00000    0.00000    0.00000
C     0.36422   -0.56166    0.00000   -0.06000    0.00000    0.00000
H     1.46618   -0.58304    0.00000    0.70000   -0.03000    0.00000
Cl   -0.36422   -2.12079    0.00000    0.00000    0.00000    0.00000
</ModelData>
</Models>
##$PEAKS=
<Peaks type="IR" xUnitsExpected="1/cm"  >
<PeakData id="1" title="Bu- asymm stretch of CH group (~3096 cm-1)" peakShape="broad" model="T1.14" xMax="3130" xMin="3080"    />
<PeakData id="2" title="Inactive Ag-symm stretch of CH group (~3071 cm-1)" peakShape="broad" model="T1.13" xMax="3090" xMin="3050"    />
<PeakData id="3" title="Inactive Ag- C=C stretch (~1576 cm-1)" peakShape="broad" model="T1.12" xMax="1600" xMin="1545"    />
<PeakData id="4" title="Inactive Ag- H-C-H scissors (~1272 cm-1)" peakShape="broad" model="T1.11" xMax="1300" xMin="1230"    />
<PeakData id="5" title="Bu- C-H scissors (~1205 cm-1)" peakShape="broad" model="T1.10" xMax="1230" xMin="1175"    />
<PeakData id="6" title="Au- C-H wagging (~900 cm-1)" peakShape="broad" model="T1.9" xMax="920" xMin="880"    />
<PeakData id="7" title="Inactive Ag-symm stretch of CCl group (~845 cm-1)" peakShape="broad" model="T1.6" xMax="870" xMin="830"    />
<PeakData id="8" title="Bu- asymm stretch of CCl group (~830 cm-1)" peakShape="broad" model="T1.8" xMax="850" xMin="790"    />
<PeakData id="9" title="Bg- wag of CH group (~750 cm-1)" peakShape="broad" model="T1.7" xMax="770" xMin="730"    />
<PeakData id="10" title="Inactive Ag-symm bend of CCl group (~350 cm-1)" peakShape="broad" model="T1.5" xMax="370" xMin="330"    />
<PeakData id="11" title="Bu-asymm bend of CCl group (~265 cm-1)" peakShape="broad" model="T1.4" xMax="285" xMin="245"    />
<PeakData id="12" title="Au-Cl-C=C-Cl torsion  (~192 cm-1)" peakShape="broad" model="T1.3" xMax="220" xMin="170"    />
</Peaks>
##XUNITS= 1/CM
##YUNITS= TRANSMITTANCE
##XFACTOR= 1E0
##YFACTOR= 9.83769E-7
##FIRSTX= 450
##FIRSTY= 0.995466
##LASTX= 3966
##NPOINTS= 880
##XYDATA= (X++(Y..Y))
450.0 1011890 1006072 1001296 999336 999557 999778 998577 996648 996205 998735 1003225 1006641 1006356 1003605 1002308
510.0 1004205 1007242 1009107 1009582 1008981 1007177 1004395 1001455 998893 997248 996427 995542 994561 994782
566.0 996047 996838 997122 998545 1000854 1001612 999841 997913 998451 1001233 1003541 1003763 1002782 1001834 1001392
626.0 1001834 1003067 1004111 1004237 1003763 1002941 1002181 1002340 1002941 1002371 1000538 998830 997818 997344 996996
686.0 995605 993518 993359 996047 998735 999588 999494 998767 997629 997755 999557 1000980 1000475 996205 985548 970181
750.0 956583 949722 949911 954117 958291 961801 967272 972584 971446 960663 930527 851758 690583
802.0 452821 223691 89205 36586 19099 13028 11890 18530 56793 231818 632810
846.0 865293 790349 699374 658803 629743 610739 605869 595750 576809 565014 550373
890.0 505849 448046 425057 454845 507115 532444 527321 525961 541582 564729 591639 625917
938.0 664084 701081 738870 777701 811409 837592 859600 879743 898431 913262 919713
982.0 921104 929705 949943 971446 984347 989818 991936 991747 990513 989659 988711 987352 986561
1034.0 986814 988047 990039 991494 991588 991146 990513 988742 986498 985454 985454 985580 986182 987003 986561 984948
1098.0 983652 983019 983177 984727 986498 986529 985485 984442 982103 978465 975556 972141 965912 958829
1154.0 952347 944409 937041 933974 932140 930084 928345 899032 802808 672179 582975 552144
1202.0 538420 520396 538357 634581 785795 900361 935081 936314 938717 941405 944915
1246.0 952979 961643 967778 973532 978656 981565 983746 986182 987952 989407 991209 992032 991620 991209
1302.0 991051 990640 990703 991588 992252 992252 991968 991905 992568 993802 994182 993328 992821 993581 994656 995161 995352 995636
1374.0 995699 995289 994688 994845 996111 997438 997501 996111 994339 993675 994782 996395 996427 994972 994056
1434.0 994339 994023 992189 990956 992664 996237 997913 996174 993897 993960 994624 993202 991114 991241
1490.0 992632 992790 992758 994751 997786 999178 999178 999621 999747 997597 994592 994529 997438 998514 995289 991936
1554.0 992853 995826 995826 992601 989692 988522 987415 985328 983272 982419 982355 981785 980584 979572 978845
1614.0 977833 976505 973944 967745 957469 941753 912124 864659 817353 794017 794935 801480
1662.0 809764 836801 886573 935270 961516 970560 974545 976695 979698 986466 992379 992664
1710.0 991936 994845 997565 996585 995542 997565 999715 999209 997533 996869 996743 995762 994213 993707 995067
1770.0 996901 997059 995067 992442 990988 990798 990513 989312 988142 988110 988711 988742 988585 989375 990577 990672
1834.0 990165 991082 993771 995921 995889 994814 994877 996459 998418 999241 998577 997565 997629 998735 999525 999399
1898.0 998956 998862 999115 999621 1000285 1000758 1000664 1000063 999399 999336 1000063 1000948 1001138 1000791 1000538 1000758 1001138 1001360
1970.0 1001296 1000885 1000348 999968 1000063 1000475 1000695 1000316 999684 999399 999557 1000000 1000475 1000664 1000379 999905 999684
2038.0 999715 999652 999304 998893 998703 998830 999178 999462 999431 998545 996142 992442 988742 986182 984695 984031 985169
2106.0 989154 994908 999462 1001233 1001233 1001107 1001202 1001392 1001708 1002087 1002245 1002118 1001961 1001834 1001739 1001708 1001771 1001865
2178.0 1001992 1002118 1002150 1002213 1002435 1002719 1002941 1002972 1002878 1002719 1002656 1002782 1003004 1003131 1003035 1002751 1002593 1002751 1003035
2254.0 1003225 1003067 1002688 1002245 1002024 1001992 1001802 1001138 999841 998008 995921 993771 991462 988964 986845
2314.0 985548 984916 984506 984189 984189 984252 984062 983936 983999 983240 980521 976916 975556 978244 983525 988774 993012
2382.0 996743 1000316 1003098 1004585 1005059 1005059 1005028 1005059 1005091 1004965 1004553 1003858 1003194 1002719 1002403 1002308 1002371 1002213
2454.0 1001549 1000854 1000664 1000885 1001011 1000948 1001138 1001739 1002530 1003131 1003447 1003636 1003952 1004427 1004965 1005407 1005755
2522.0 1006135 1006609 1007114 1007558 1007747 1007684 1007652 1007968 1008475 1008949 1009265 1009328 1009075 1008759 1008665 1008917 1009265 1009550
2594.0 1009708 1009739 1009771 1009929 1010087 1010024 1009898 1009898 1009992 1010182 1010498 1010783 1010846 1010656 1010371 1010182 1010277 1010371 1010182 1009835
2674.0 1009550 1009454 1009486 1009613 1009645 1009360 1008885 1008412 1008095 1007874 1007715 1007431 1006957 1006356 1005787 1005186 1004711 1004332
2746.0 1003826 1003004 1001676 999588 996996 995067 994688 995130 995858 997501 1000695 1004111 1005818 1005818
2802.0 1005407 1005375 1005471 1005502 1005597 1005534 1005218 1004870 1004774 1004774 1004711 1004774 1004902 1004870 1004680 1004521 1004427 1004364 1004301 1004205 1004111 1004048
2890.0 1003858 1003541 1003478 1003668 1003700 1003320 1003004 1003035 1003257 1003288 1003004 1002751 1002815 1002941 1002656 1002181 1001961 1001928
2962.0 1001865 1001739 1001708 1001581 1001455 1001360 1001138 1000885 1000854 1000822 1000632 1000569 1000506 999968 999209 998671 997913 997028 996585
3038.0 995699 993928 992505 991272 988806 986624 986055 983240 974102 952347 898526 803156 701904
3090.0 641349 626834 631704 646977 698741 801701 915981 980933 993549 991272 990672
3134.0 989912 990355 993454 995984 996743 997407 997755 997375 997344 997882 998198 998577 999209 999368 999020 998767 998418
3202.0 997882 997818 998229 998418 998229 997945 997723 997660 997755 997723 997692 997913 998229 998166 997850 997786 997818 997818 998008 998451
3282.0 998671 998545 998292 998071 997818 997375 996996 997091 997565 997850 997786 997723 997692 997501 997154 996648 996047 995731
3354.0 996015 996553 996616 996174 995699 995510 995542 995573 995320 994908 994719 994877 994972 994751 994498 994624 995226 995636
3426.0 995226 994339 993897 994150 994529 994592 994276 993771 993422 993675 994308 994688 994529 994087 993771 993612 993549
3494.0 993422 993296 993202 993043 992790 992758 993106 993707 994087 993991 993549 993138 993043 993012 992632 991905 991304 991304 991747
3570.0 991968 991462 990672 990545 991335 992095 991779 990577 989565 989628 990577 991241 990893 990640 991588 992442 991114
3638.0 988679 988363 990513 992158 991178 988553 986592 987003 989439 991716 991651 990071 989217 989565 989439
3698.0 988237 987256 987509 988269 988237 987319 986655 987162 988774 990672 992189 993454 994529 994656 992917 990292
3762.0 988742 988522 988332 987888 988047 988395 987921 987383 988553 991146 992664 991842 990450 990862 992568 992758
3826.0 990988 990228 991747 992790 991398 990071 991178 993106 993359 992727 992917 993518 993486 993233 993106
3886.0 992126 990324 989565 990988 992853 992886 991462 990577 990956 991651 991747 991019 989470 987478 986213 986466
3950.0 987130 986655 986529 990609
3966.0A000032  $$checkpoint
##END= $$ end of trans-DCE IR
##TITLE=Raman of trans-1,2-dichloroethylene (E) $$ Begin of the data block
##JCAMP-DX=5.00 $$ ACD/DocManager Library v 5.00
##DATA TYPE=RAMAN SPECTRUM
##DATA CLASS=XYDATA
##BLOCK ID=4
##DATE=19 Feb 2012 10:30:00
##ORIGIN= Department of Chemistry, UWI, Jamaica
##OWNER= public domain
##SPECTROMETER/DATA SYSTEM=from scan
##$MODELS=
<Models>
<ModelData id="Tc2h2cl2" type="MOL">
trans-1,2-dichloroethylene (E)

  created with ArgusLab version 4.0.1
  6  5  0  0  0  0  0  0  0  0  0 V2000
   -0.3642    0.5617    0.0000 C   0  0  0  0  0  0  0  0  0  0  0  0
   -1.4662    0.5830    0.0000 H   0  0  0  0  0  0  0  0  0  0  0  0
    0.3642    2.1208    0.0000 Cl  0  0  0  0  0  0  0  0  0  0  0  0
    0.3642   -0.5617    0.0000 C   0  0  0  0  0  0  0  0  0  0  0  0
    1.4662   -0.5830    0.0000 H   0  0  0  0  0  0  0  0  0  0  0  0
   -0.3642   -2.1208    0.0000 Cl  0  0  0  0  0  0  0  0  0  0  0  0
  1  2  1  0  0  0  0
  1  3  1  0  0  0  0
  1  4  2  0  0  0  0
  4  5  1  0  0  0  0
  4  6  1  0  0  0  0
M  END
</ModelData>
<ModelData id="T2" type="XYZVIB" baseModel="Tc2h2cl2" vibrationScale=".5">
6
Model[1]: E(RAM1)=-0.434016412453E-02 A.U.;Convg=0.4972D-08;-V/T=0.9999;Energy=NaN;Range=M.O.s;PATH=Calculation 1;Input
C     0.00000    0.00000    0.00000
H     0.00000    0.00000    1.10217
Cl    1.57296    0.00000   -0.69806
C    -1.10899    0.00000   -0.75009
H    -1.10899    0.00000   -1.85226
Cl   -2.68195    0.00000   -0.05203
6
Model[2]: E(RAM1)=-0.434016412453E-02 A.U.;Convg=0.4972D-08;-V/T=0.9999;Energy=-0.004340164;Range=M.O.s;PATH=Calculation 1;Standard
C    -0.36422    0.56166    0.00000
H    -1.46618    0.58304    0.00000
Cl    0.36422    2.12079    0.00000
C     0.36422   -0.56166    0.00000
H     1.46618   -0.58304    0.00000
Cl   -0.36422   -2.12079    0.00000
6
Model[3]: IRIntensity=1.0809 KM/Mole;ReducedMass=6.8502 AMU;ForceConstant=0.2257 mDyne/A;Frequency=236.4958 cm^-1;FrequencyLabel=AU;PATH=Calculation 1;FrequenciesFrequencies
C    -0.36422    0.56166    0.00000    0.00000    0.00000    0.43000
H    -1.46618    0.58304    0.00000    0.00000    0.00000    0.54000
Cl    0.36422    2.12079    0.00000    0.00000    0.00000   -0.16000
C     0.36422   -0.56166    0.00000    0.00000    0.00000    0.43000
H     1.46618   -0.58304    0.00000    0.00000    0.00000    0.54000
Cl   -0.36422   -2.12079    0.00000    0.00000    0.00000   -0.16000
6
Model[4]: IRIntensity=2.4048 KM/Mole;ReducedMass=6.8794 AMU;ForceConstant=0.2853 mDyne/A;Frequency=265.3070 cm^-1;FrequencyLabel=BU;PATH=Calculation 1;FrequenciesFrequencies
C    -0.36422    0.56166    0.00000   -0.40000    0.15000    0.00000
H    -1.46618    0.58304    0.00000   -0.38000    0.38000    0.00000
Cl    0.36422    2.12079    0.00000    0.15000   -0.06000    0.00000
C     0.36422   -0.56166    0.00000   -0.40000    0.15000    0.00000
H     1.46618   -0.58304    0.00000   -0.38000    0.38000    0.00000
Cl   -0.36422   -2.12079    0.00000    0.15000   -0.06000    0.00000
6
Model[5]: IRIntensity=0.0000 KM/Mole;ReducedMass=18.4278 AMU;ForceConstant=1.4783 mDyne/A;Frequency=368.9947 cm^-1;FrequencyLabel=AG;PATH=Calculation 1;FrequenciesFrequencies
C    -0.36422    0.56166    0.00000    0.21000    0.15000    0.00000
H    -1.46618    0.58304    0.00000    0.21000    0.39000    0.00000
Cl    0.36422    2.12079    0.00000    0.05000    0.48000    0.00000
C     0.36422   -0.56166    0.00000   -0.21000   -0.15000    0.00000
H     1.46618   -0.58304    0.00000   -0.21000   -0.39000    0.00000
Cl   -0.36422   -2.12079    0.00000   -0.05000   -0.48000    0.00000
6
Model[6]: IRIntensity=0.0000 KM/Mole;ReducedMass=4.8520 AMU;ForceConstant=2.0603 mDyne/A;Frequency=848.9532 cm^-1;FrequencyLabel=AG;PATH=Calculation 1;FrequenciesFrequencies
C    -0.36422    0.56166    0.00000    0.32000    0.19000    0.00000
H    -1.46618    0.58304    0.00000    0.31000    0.50000    0.00000
Cl    0.36422    2.12079    0.00000   -0.07000   -0.08000    0.00000
C     0.36422   -0.56166    0.00000   -0.32000   -0.19000    0.00000
H     1.46618   -0.58304    0.00000   -0.31000   -0.50000    0.00000
Cl   -0.36422   -2.12079    0.00000    0.07000    0.08000    0.00000
6
Model[7]: IRIntensity=0.0000 KM/Mole;ReducedMass=1.8465 AMU;ForceConstant=0.8421 mDyne/A;Frequency=879.8182 cm^-1;FrequencyLabel=BG;PATH=Calculation 1;FrequenciesFrequencies
C    -0.36422    0.56166    0.00000    0.00000    0.00000    0.19000
H    -1.46618    0.58304    0.00000    0.00000    0.00000   -0.68000
Cl    0.36422    2.12079    0.00000    0.00000    0.00000   -0.01000
C     0.36422   -0.56166    0.00000    0.00000    0.00000   -0.19000
H     1.46618   -0.58304    0.00000    0.00000    0.00000    0.68000
Cl   -0.36422   -2.12079    0.00000    0.00000    0.00000    0.01000
6
Model[8]: IRIntensity=156.1848 KM/Mole;ReducedMass=10.4115 AMU;ForceConstant=4.7511 mDyne/A;Frequency=880.0642 cm^-1;FrequencyLabel=BU;PATH=Calculation 1;FrequenciesFrequencies
C    -0.36422    0.56166    0.00000    0.21000    0.51000    0.00000
H    -1.46618    0.58304    0.00000    0.18000    0.35000    0.00000
Cl    0.36422    2.12079    0.00000   -0.08000   -0.19000    0.00000
C     0.36422   -0.56166    0.00000    0.21000    0.51000    0.00000
H     1.46618   -0.58304    0.00000    0.18000    0.35000    0.00000
Cl   -0.36422   -2.12079    0.00000   -0.08000   -0.19000    0.00000
6
Model[9]: IRIntensity=85.4112 KM/Mole;ReducedMass=1.1165 AMU;ForceConstant=0.6016 mDyne/A;Frequency=956.3369 cm^-1;FrequencyLabel=AU;PATH=Calculation 1;FrequenciesFrequencies
C    -0.36422    0.56166    0.00000    0.00000    0.00000   -0.07000
H    -1.46618    0.58304    0.00000    0.00000    0.00000    0.70000
Cl    0.36422    2.12079    0.00000    0.00000    0.00000    0.00000
C     0.36422   -0.56166    0.00000    0.00000    0.00000   -0.07000
H     1.46618   -0.58304    0.00000    0.00000    0.00000    0.70000
Cl   -0.36422   -2.12079    0.00000    0.00000    0.00000    0.00000
6
Model[10]: IRIntensity=16.6654 KM/Mole;ReducedMass=1.0902 AMU;ForceConstant=0.9190 mDyne/A;Frequency=1196.1292 cm^-1;FrequencyLabel=BU;PATH=Calculation 1;FrequenciesFrequencies
C    -0.36422    0.56166    0.00000    0.02000   -0.06000    0.00000
H    -1.46618    0.58304    0.00000    0.06000    0.70000    0.00000
Cl    0.36422    2.12079    0.00000   -0.01000    0.00000    0.00000
C     0.36422   -0.56166    0.00000    0.02000   -0.06000    0.00000
H     1.46618   -0.58304    0.00000    0.06000    0.70000    0.00000
Cl   -0.36422   -2.12079    0.00000   -0.01000    0.00000    0.00000
6
Model[11]: IRIntensity=0.0000 KM/Mole;ReducedMass=1.1490 AMU;ForceConstant=1.0669 mDyne/A;Frequency=1255.3385 cm^-1;FrequencyLabel=AG;PATH=Calculation 1;FrequenciesFrequencies
C    -0.36422    0.56166    0.00000   -0.07000   -0.04000    0.00000
H    -1.46618    0.58304    0.00000   -0.04000    0.70000    0.00000
Cl    0.36422    2.12079    0.00000   -0.01000    0.00000    0.00000
C     0.36422   -0.56166    0.00000    0.07000    0.04000    0.00000
H     1.46618   -0.58304    0.00000    0.04000   -0.70000    0.00000
Cl   -0.36422   -2.12079    0.00000    0.01000    0.00000    0.00000
6
Model[12]: IRIntensity=0.0000 KM/Mole;ReducedMass=9.1626 AMU;ForceConstant=17.0165 mDyne/A;Frequency=1775.4231 cm^-1;FrequencyLabel=AG;PATH=Calculation 1;FrequenciesFrequencies
C    -0.36422    0.56166    0.00000   -0.29000    0.53000    0.00000
H    -1.46618    0.58304    0.00000   -0.36000   -0.03000    0.00000
Cl    0.36422    2.12079    0.00000    0.00000   -0.01000    0.00000
C     0.36422   -0.56166    0.00000    0.29000   -0.53000    0.00000
H     1.46618   -0.58304    0.00000    0.36000    0.03000    0.00000
Cl   -0.36422   -2.12079    0.00000    0.00000    0.01000    0.00000
6
Model[13]: IRIntensity=0.0000 KM/Mole;ReducedMass=1.0823 AMU;ForceConstant=6.2456 mDyne/A;Frequency=3129.6222 cm^-1;FrequencyLabel=AG;PATH=Calculation 1;FrequenciesFrequencies
C    -0.36422    0.56166    0.00000   -0.06000    0.01000    0.00000
H    -1.46618    0.58304    0.00000    0.70000   -0.03000    0.00000
Cl    0.36422    2.12079    0.00000    0.00000    0.00000    0.00000
C     0.36422   -0.56166    0.00000    0.06000   -0.01000    0.00000
H     1.46618   -0.58304    0.00000   -0.70000    0.03000    0.00000
Cl   -0.36422   -2.12079    0.00000    0.00000    0.00000    0.00000
6
Model[14]: IRIntensity=124.2254 KM/Mole;ReducedMass=1.0815 AMU;ForceConstant=6.2982 mDyne/A;Frequency=3143.8929 cm^-1;FrequencyLabel=BU;PATH=Calculation 1;FrequenciesFrequencies
C    -0.36422    0.56166    0.00000   -0.06000    0.00000    0.00000
H    -1.46618    0.58304    0.00000    0.70000   -0.03000    0.00000
Cl    0.36422    2.12079    0.00000    0.00000    0.00000    0.00000
C     0.36422   -0.56166    0.00000   -0.06000    0.00000    0.00000
H     1.46618   -0.58304    0.00000    0.70000   -0.03000    0.00000
Cl   -0.36422   -2.12079    0.00000    0.00000    0.00000    0.00000
</ModelData>
</Models>
##$PEAKS=
<Peaks type="RAMAN" xUnitsExpected="1/cm"  >
<PeakData id="1" title="Inactive Bu- asymm stretch of CH group (~3096 cm-1)" peakShape="broad" model="T2.14" xMax="3130" xMin="3080"    />
<PeakData id="2" title="Ag-symm stretch of CH group (~3071 cm-1)" peakShape="broad" model="T2.13" xMax="3090" xMin="3050"    />
<PeakData id="3" title="Ag- C=C stretch (~1576 cm-1)" peakShape="broad" model="T2.12" xMax="1600" xMin="1545"    />
<PeakData id="4" title="Ag- H-C-H scissors (~1272 cm-1)" peakShape="broad" model="T2.11" xMax="1300" xMin="1230"    />
<PeakData id="5" title="Inactive Bu- C-H scissors (~1205 cm-1)" peakShape="broad" model="T2.10" xMax="1230" xMin="1175"    />
<PeakData id="6" title="Inactive Au- C-H wagging (~900 cm-1)" peakShape="broad" model="T2.9" xMax="920" xMin="880"    />
<PeakData id="7" title="Ag-symm stretch of CCl group (~845 cm-1)" peakShape="broad" model="T2.6" xMax="870" xMin="830"    />
<PeakData id="8" title="Inactive Bu- asymm stretch of CCl group (~830 cm-1)" peakShape="broad" model="T2.8" xMax="850" xMin="790"    />
<PeakData id="9" title="Bg- wag of CH group (~750 cm-1)" peakShape="broad" model="T2.7" xMax="770" xMin="730"    />
<PeakData id="10" title="Ag-symm bend of CCl group (~350 cm-1)" peakShape="broad" model="T2.5" xMax="370" xMin="330"    />
<PeakData id="11" title="Inactive Bu-asymm bend of CCl group (~265 cm-1)" peakShape="broad" model="T2.4" xMax="285" xMin="245"    />
<PeakData id="12" title="Inactive Au-Cl-C=C-Cl torsion  (~192 cm-1)" peakShape="broad" model="T2.3" xMax="220" xMin="170"    />
</Peaks>
##XUNITS=1/CM
##YUNITS=RAMAN INTENSITY
##XFACTOR=1.0000000000
##YFACTOR=0.0000418750
##FIRSTX=77.97705078
##LASTX=3387.97705078
##FIRSTY=1.34000003
##NPOINTS=593
##XYDATA=(X++(Y..Y))
78 32000 30591 29182 26304 23427 21254 19081 16693 14304 12299 10293 8884 7475 6782 6090 5325 4561 4107 3654 3379 3104 2913
195.4 2913 2722 2639 2555 2519 2484 2316 2149 1958 1767 1648 1528 1445 1361 1361 1361 1373 1385 1504 1624 1863 2101 8346 14591 17875 21158
335.2 21158 17194 13230 8131 3033 2484 1934 1743 1552 1433 1313 1290 1266 1337 1409 1445 1481 1397 1313 1230 1146 1075 1003 943 884 884 884 884 884 860 836 800
508.5 800 764 800 836 907 979 979 979 896 812 788 764 800 836 860 884 848 812 776 740 704 669 633 597 657 716 812 907 967 1027 991 955 931 907 955 1003 1063 1122 1194 1266 1552
732.1 1552 1839 2507 3176 2699 2221 1899 1576 1385 1194 1194 1194 1266 1337 1660 1982 7976 13970 13815 13660 8203 2746 1982 1218 1015 812 776
877.5 776 740 740 740 728 716 681 645 609 573 573 573 573 573 573 573 573 573 573 573 573 573 585 597 633 669 704 740 740 740 740 740 740 740 740 740 764 788 824 860 860 860 824 788 764 740 740 740 740 740 740 740 740 740 740 740 752 764 788 812 848 884 955 1027 1110 1194 7451
1246.5 7451 13707 13863 14018 8597 3176 2400 1624 1433 1242 1087 931 812 693 657 621 645 669 704 740 740 740 728 716 693 669 633 597 609 621 657
1414.3 657 693 693 693 669 645 609 573 573 573 573 573 573 573 573 573 609 645 681 716 788 860 967 1075 1349 1624 9755 17887 11427 4967 2949 931 1003 1075 1146 1218 1254 1290 1266
1626.7 1266 1242 1063 884 812 740 740 740 931 1122 1481 1839 1397 955 860 764 693 621 597 573 573 573 573 573 573 573 573 573 573 573 585 597 633 669 693 716 669 621 549 478 501 525
1856 525 597 669 669 669 597 525 478 430 466 501 537 573 573 573 573 573 549 525 490 454 454 454 490 525 549 573 573 573 573 573 537 501 466 430 454 478 513 549 549 549 513 478 454 430 430
2107.6 430 430 430 430 454 478 513 549 561 573 573 573 573 573 537 501 466 430 454 478 513 549 561 573 573 573 561 549 513 478 454 430 430 430 430 430 454 478 513 549 549 549 513 478 454 430 430
2364.8 430 430 430 430 430 430 430 430 454 478 501 525 549 573 573 573 573 573 549 525 490 454 442 430 430 430 430 430 430 430 430 430 430 430 430 430 430 430 430 430 430 430 430 430 430 430 430 430 430 430 430 430 430 430 430 430 430 430 430 430 454 478 513 549 549 549 513 478 454 430 430 430 430 430 430 430 430 430 442 454 478 501 537 573 537 501 466 430 466
2856.8 466 501 525 549 585 621 657 693 704 716 681 645 609 573 609 645 681 716 704 693 657 621 621 621 657 693 740 788 860 931 1027 1122 1349 1576 2209 2842 11093 19343
3063.7 19343 13779 8215 5087 1958 1684 1409 1337 1266 1301 1337 1457 1576 1696 1815 1779 1743 1433 1122 1003 884 884 884 860 836 800
3203.5 800 764 752 740 740 740 740 740 740 740 740 740 800 860 943 1027 979 931 860 788 764 740 740 740 752 764 800 836 860 884 967 1051 1122 1194
3388 1194
##END=$$ End of RAMAN of trans-DCE
##END= $$ end of file