##TITLE= Chromium(III) spectra
##JCAMP-DX= 4.24
##DATA TYPE= LINK
##BLOCKS= 2
##TITLE= Potassium Chrome Alum
##JCAMP-DX= 5.01
##DATA TYPE= UV/VIS SPECTRUM
##DATA CLASS= XYDATA
##ORIGIN= Chemistry Department, UWI, JAMAICA
##OWNER= Prof Robert J. Lancashire
##DATE= 02/07/10
##TIME= 09:26:13.00
##BLOCK_ID= 1
##RESOLUTION= 1.000000
##SPECTROMETER/DATA SYSTEM= PERKIN-ELMER LAMBDA 19 UV/VIS/NIR UV
##XUNITS= NANOMETERS
##YUNITS= ABSORBANCE
##XFACTOR= 3.8E-4
##YFACTOR= 5.08327007E-7
##FIRSTX= 320
##FIRSTY= 0.2430681
##LASTX= 700
##NPOINTS= 381
##XYDATA= (X++(Y..Y))
842105D78173p330o894o442n993n602n231m849m515m165l834l517l221k933k655D08621
884211D06551j754j395j060p17l64oL64P20J094J484J869K258K707L224L834M527D28616
931579D34687O846P572Q288R012R712J0387J1050J1734J2419J3091J3774J4516E78372
968421E94377J6633J7145J7579J7898J8140J8405J8717J9074J9409J9645J9764H16565
1002632H36161J9318J9005J8674J8372J8053J7673J7269J6784J6177J5521J4796A041814
1036842A055032J2358J1437J0511R561Q581P609O608N576M558L511K467J428M45A139168
1076316A137754k298l157l986m812n663o520p371q235r081r899j0680j1416j2100A029782
1115789A016436j3916j4465j4971j5458j5892j6284j6626j6961j7251j7526j7748H21406
$$ plain form
842105 478173 470843 463949 457507 451514 445912 440681 435832 431317 427152 423318 419801 416580 413647 410992 408621
884211 406551 404797 403402 402342 401625 401261 401255 401619 402339 403433 404917 406786 409044 411751 414975 418809 423336 428616
931579 434687 441533 449105 457393 466405 476117 486504 497554 509288 521707 534798 548572 563088 578372
968421 594377 611010 628155 645734 663632 681772 700177 718894 737968 757377 777022 796786 816565
1002632 836161 855479 874484 893158 911530 929583 947256 964525 981309 997486 1013007 1027803 1041814
1036842 1055032 1067390 1078827 1089338 1098899 1107480 1115089 1121697 1127273 1131831 1135342 1137809 1139237 1139682 1139168
1076316 1137754 1135456 1132299 1128313 1123501 1117838 1111318 1103947 1095712 1086631 1076732 1066052 1054636 1042536 1029782
1115789 1016436 1002520 988055 973084 957626 941734 925450 908824 891863 874612 857086 839338 821406
1150000H03347j8091j8025j7865j7628j7278j6864j6393j5942j5492j5079j4697F05630
1184211E91582j3718j3424j3149j2913j2724j2585j2456j2331j2149j1861j1485D41798
1218421D31382r783r091q376p696p049o421n839n291m799m316l828l338k890k463C48162
1260526C46539j208q13m32n4L06O25R15J218J528J841K133K418K701K970L234L508C71218
1307895C75302M359M635M893N138N372N621N882O118O362O590O815P027P216P424D66395
1350000D74238Q050Q266Q487Q707Q916R118R318R488R620R738R842R962J0084J0208F14360
1392105F24765J0486J0526J0549J0548J0564J0556J0533J0479J0411J0352J0263G50200
1426316G60282R984R872R743R598R443R276R071Q839Q598Q328Q061P793P518P250H90618
$$ plain form
1150000 803347 785256 767231 749366 731738 714460 697596 681203 665261 649769 634690 619993 605630
1184211 591582 577864 564440 551291 538378 525654 513069 500613 488282 476133 464272 452787 441798
1218421 431382 421599 412508 404132 396436 389387 382966 377127 371836 367037 362721 358893 355555 352665 350202 348162
1260526 346539 345331 344518 344086 344032 344338 344963 345878 347096 348624 350465 352598 355016 357717 360687 363921 367429 371218
1307895 375302 379661 384296 389189 394327 399699 405320 411202 417320 423682 430272 437087 444114 451330 458754 466395
1350000 474238 482288 490554 499041 507748 516664 525782 535100 544588 554208 563946 573788 583750 593834 604042 614360
1392105 624765 635251 645777 656326 666874 677438 687994 698527 709006 719417 729769 740032 750200
1426316 760282 770266 780138 789881 799479 808922 818198 827269 836108 844706 853034 861095 868888 876406 883656 890618
1468421H97257O291N932N551N149M739M345L972L578L160K744K333J928J499J096I50300
1510526I50648m9m70q70j265j639k008k345k674l013l358l717m062m403m729n052I05647
1555263H99994n959o282o606o946p279p607p932q221q510q774r034r273r512r753G78294
1597368G68043j0473j0696j0877j1007j1062j1069j1015j0920j0814j0719j0661F38091
1631579F27451j0612j0578j0458j0329j0181j0013r797r590r370r095q805q557E01630
1668421D93153q671q989r409r824j0165j0358j0406j0283j0023r665r231q789q406C60823
1707895C52938p709p566p383p151o872o557o255o012n817n680n613n466n194m658B61184
1750000B58387j808j084q58j259k171l333m399n174n577n638n445n162m936m771B02165
$$ plain form
1468421 897257 903548 909480 915031 920180 924919 929264 933236 936814 939974 942718 945051 946979 948478 949574 950300
1510526 950648 950599 950129 949259 947994 946355 944347 942002 939328 936315 932957 929240 925178 920775 916046 910994 905647
1555263 899994 894035 887753 881147 874201 866922 859315 851383 843162 834652 825878 816844 807571 798059 788306 778294
1597368 768043 757570 746874 735997 724990 713928 702859 691844 680924 670110 659391 648730 638091
1631579 627451 616839 606261 595803 585474 575293 565280 555483 545893 536523 527428 518623 510066 501630
1668421 493153 484482 475493 466084 456260 446095 435737 425331 415048 405025 395360 386129 377340 368934 360823
1707895 352938 345229 337663 330280 323129 316257 309700 303445 297433 291616 285936 280323 274857 269663 265005 261184
1750000 258387 256579 255495 254637 253378 251207 247874 243475 238301 232724 227086 221641 216479 211543 206772 202165
1792105A97719m322m202m072l921l745l565l364l146k958k835k731k655k585k505A48678
1834211A46323k280A41838
$$ plain form
1792105 197719 193397 189195 185123 181202 177457 173892 170528 167382 164424 161589 158858 156203 153618 151113 148678
1834211 146323 144043 141838
1842105A39682  $$checkpoint
##END=
##TITLE= [Cr(H2O)4Cl2]Cl
##JCAMP-DX= 4.24
##DATA TYPE= UV/VIS SPECTRUM
##DATA CLASS= XYDATA
##ORIGIN= Chemistry Department, UWI, JAMAICA
##OWNER= Prof Robert J. Lancashire
##DATE= 02/07/10
##TIME= 09:40:24.00
##BLOCK_ID= 2
##RESOLUTION= 1.000000
##SPECTROMETER/DATA SYSTEM= PERKIN-ELMER LAMBDA 19 UV/VIS/NIR UV
##XUNITS= NANOMETERS
##YUNITS= ABSORBANCE
##XFACTOR= 3.8E-4
##YFACTOR= 9.13411975E-7
##FIRSTX= 320
##FIRSTY= 0.041677
##LASTX= 700
##NPOINTS= 381
##XYDATA= (X++(Y..Y))
842105D5628n955n228m568l975l453l002k565k160j779j438j128q63o31m55l26G899
886842G825N4J75K80L77M67N24N98O87P86Q88J003J118J233J351J457J599J732B3997
936842B5966K110K262K413K566K718K907L087L264L462L675L913M140M368M580G6247
978947H1296N278N542N856O207O564O917P257P601P901Q192Q511Q855R225R610A94806
1021053B05192J0768J1117J1475J1833J2187J2545J2906J3264J3610J3954J4271C57715
1055263C72607J5170J5455J5721J5976J6192J6401J6578J6739J6845J6913J6959E68519
1089474E85461J6885J6826J6733J6598J6392J6127J5829J5506J5156J4802J4448G74835
1123684G88489J3180J2657J2096J1493J0841J0165R469Q772Q050P332O596N837I10025
$$ plain form
842105 45628 39673 34445 29877 25902 22449 19447 16882 14722 12943 11505 10377 9514 8883 8428 8102 7899
886842 7825 7879 8054 8334 8711 9178 9702 10300 10987 11773 12661 13664 14782 16015 17366 18823 20422 22154 23997
936842 25966 28076 30338 32751 35317 38035 40942 44029 47293 50755 54430 58343 62483 66851 71431 76247
978947 81296 86574 92116 97972 104179 110743 117660 124917 132518 140419 148611 157122 165977 175202 184812 194806
1021053 205192 215960 227077 238552 250385 262572 275117 288023 301287 314897 328851 343122 357715
1055263 372607 387777 403232 418953 434929 451121 467522 484100 500839 517684 534597 551556 568519
1089474 585461 602346 619172 635905 652503 668895 685022 700851 716357 731513 746315 760763 774835
1123684 788489 801669 814326 826422 837915 848756 858921 868390 877162 885212 892544 899140 904977 910025
1160526I14238L363K513J668Q18kq24j644k468l309m146m965n742o470p114p690H70059
1205263H61496q906r197r437r618r782r930j0096j0313j0638j1105j1682j2342G25451
1242105G11811j4189j4619j4936j5202j5418j5614j5809j5991j6206j6416j6590E24087
1276316E07245j6864j6802j6664j6454j6178j5845j5465j5057j4625j4164j3696C22208
1310526C09462j2249j1754j1253j0751j0235r719r212q715q234p769p306o853o396A83073
1350000A77568n073m674m288l917l554l197k844k503k172j853j553j244r52o64A38691
1392105A38570J35L89O43Q91J144J390J637J877K111K344K570K788L009L227L452A69850
1436842A73750M132M376M612M846N085N323N560N806O057O308O553O788P019P249B60926
$$ plain form
1160526 914238 917601 920114 921782 922600 922598 921774 920130 917662 914353 910207 905242 899500 893030 885916 878226 870059
1205263 861496 852590 843393 833956 824338 814556 804626 794530 784217 773579 762474 750792 738450 725451
1242105 711811 697622 683003 668067 652865 637447 621833 606024 590033 573827 557411 540821 524087
1276316 507245 490381 473579 456915 440461 424283 408438 392973 377916 363291 349127 335431 322208
1310526 309462 297213 285459 274206 263455 253220 243501 234289 225574 217340 209571 202265 195412 189016 183073
1350000 177568 172495 167821 163533 159616 156062 152865 150021 147518 145346 143493 141940 140696 139744 139080 138691
1392105 138570 138705 139094 139737 140628 141772 143162 144799 146676 148787 151131 153701 156489 159498 162725 166177 169850
1436842 173750 177882 182258 186870 191716 196801 202124 207684 213490 219547 225855 232408 239196 246215 253464 260926
1478947B68603P925Q173Q420Q663Q902R149R379R587R783R999J0195J0385J0571D00503
1518421D11492J1198J1395J1575J1762J1923J2068J2204J2345J2505J2635J2753E56709
1552632E69643J2984J3020J3035J3054J3075J3075J3082J3078J3070J3050J3008G26117
1586842G38982J2773J2675J2568J2463J2358J2232J2059J1845J1605J1346J1082H82811
1621053H93366J0277R981R643R263Q860Q421P965P474O950O396N837N231M586L940A001477
1663158A004097J928J237N63q3p11j271j719k040k258k363k369k312k225k138k072I84208
1707895I82106k282k583l011l547m162m827n521o219o919p664q464r295j0156j1015H84613
1750000H72064j3125j3534j3792j3918j3930j3844j3645j3297j2730j1925j0886G17755
$$ plain form
1478947 268603 276528 284701 293121 301784 310686 319835 329214 338801 348584 358583 368778 379163 389734 400503
1518421 411492 422690 434085 445660 457422 469345 481413 493617 505962 518467 531102 543855 556709
1552632 569643 582627 595647 608682 621736 634811 647886 660968 674046 687116 700166 713174 726117
1586842 738982 751755 764430 776998 789461 801819 814051 826110 837955 849560 860906 871988 882811
1621053 893366 903643 913624 923267 932530 941390 949811 957776 965250 972200 978596 984433 989664 994250 998190 1001477
1663158 1004097 1006025 1007262 1007825 1007742 1007031 1005760 1004041 1002001 999743 997380 995011 992699 990474 988336 986264 984208
1707895 982106 979824 977241 974230 970683 966521 961694 956173 949954 943035 935371 926907 917612 907456 896441 884613
1750000 872064 858939 845405 831613 817695 803765 789921 776276 762979 750249 738324 727438 717755
1784211G09312p307o420n898n785n942o223o419o378o067n617n263n255n754o684F16388
1826316F07194j0348j1280j1999j2568E47944
$$ plain form
1784211 709312 702005 695585 689687 683902 677960 671737 665318 658940 652873 647256 641993 636738 630984 624300 616388
1826316 607194 596846 585566 573567 560999 547944
1842105E34447  $$checkpoint
##END=

##END= $$ of all data