##TITLE= Fuchsine
##JCAMP-DX= 5.01
##DATA TYPE= UV/Vis SPECTRUM
##DATA CLASS= XYDATA
##ORIGIN= unknown
##OWNER= unknown
##LONGDATE= Tue, 1 Nov 2016 20:55:43 -0500 $$ export date from JSpecView
##SPECTROMETER/DATASYSTEM= unknown
##XLABEL= Wavelength [nm]
##YLABEL= Absorbance
##XUNITS= NANOMETERS
##YUNITS= ABSORBANCE
##XFACTOR= 1
##YFACTOR= 8.341300E-07
##FIRSTX= 3.536540E+02
##FIRSTY= 1.193100E-01
##LASTX= 6.991890E+02
##NPOINTS= 168
##MINY= -1.790000E-03
##MAXY= 8.323401E-01
##XYDATA= (X++(Y..Y))
353.654A43035q727p961p792q740Tq344p480o606o138n455m951m784E4428
$$ 143035 134308 126347 118555 109815 101075 92731 85251 78645 72507 67052 62101 57317 54428
382.62155E1551k890k301j715p79M8L6TN75R24J618J990TK062K674K781F1933
$$ 51551 48661 46360 44645 43866 43914 43950 43986 44561 45485 47103 49093 51083 53145 55819 58600 61933
417.79514F4882K673M436N587O629O091N526O522P373Q824J0538Q823A46788
$$ 64882 67555 71991 77578 84207 90298 95824 102346 109719 118543 129081 137904 146788
444.69354A58524J1749J4482J3032J3835J6760J6292J5837J8930J5909C14232
$$ 158524 170273 184755 197787 211622 228382 244674 260511 279441 295350 314232
467.4527C31064J9781J9793K0033K1267K3342K5715J9793J9781J8918E34341
$$ 331064 350845 370638 390671 411938 435280 460995 480788 500569 519487 534341
490.21283E46090J1749P205O617O630O618O438N526O858P756Q812J0766F42801
$$ 546090 557839 565044 571661 578291 584909 591347 596873 603731 611487 620299 631065 642801
517.11127F55270J6664K0788J9793K1567K7586K8065L1290L4659L4083I19341
$$ 655270 671934 692722 712515 734082 761668 789733 821023 855682 889765 919341
539.87I47790K4229J9781O054j235j3403k2550m1085m2643o0542o1070F95971
$$ 947790 972019 991800 997854 996619 983216 960666 919581 876938 816396 755326 695971
564.6993F34889o8550o8755n3289n9571n1742m3555m2427l5079k8017A55887
$$ 634889 566339 497584 444295 384724 332982 289427 247000 211921 183904 155887
587.45844A33648j9253j9278j4722q859j1665j0083q547n443m304l848B4708
$$ 133648 114395 95117 80395 71536 59871 49788 41241 35798 31494 27646 24708
612.28766B2215q27q40q39k002n227l632M7k99r35q75q40k99M8L6M7n63D376
$$ 22215 21388 20548 19709 17707 12480 8848 8895 8596 7661 6786 5946 5647 5695 5731 5778 5215 4376
649.5304D807R24n04r23q39q16M8k4q39p43M8L6M8j055k314L6M8L6K997A499
$$ 4807 5731 5227 4304 3465 2649 2697 2673 1834 1091 1139 1175 1223 168 -2146 -2110 -2062 -2026 971 1499
690.9124A547L5M8A666
$$ 1547 1582 1630 1666
699.18896A702  $$checkpoint
##END=