##TITLE=azo dye comparison
##JCAMP-DX= 4.24
##DATA TYPE= LINK
##BLOCKS= 5
##TITLE= azobenzene dye 320nm
##JCAMP-DX= 5.01
##DATA TYPE= UV/Vis SPECTRUM
##DATA CLASS= XYDATA
##BLOCK_ID= 1
##ORIGIN= public
##OWNER= public
##LONGDATE= Fri, 28 Oct 2016 14:20:11 -0500 $$ export date from JSpecView
##SPECTROMETER/DATASYSTEM= unknown
##XLABEL= Wavelength [nm]
##YLABEL= Absorbance
##XUNITS= NANOMETERS
##YUNITS= ABSORBANCE
##XFACTOR= 1
##YFACTOR= 1.000180E-06
##FIRSTX= 3.006400E+02
##FIRSTY= 2.441500E-01
##LASTX= 7.209374E+02
##NPOINTS= 203
##MINY= -1.800000E-04
##MAXY= 1
##XYDATA= (X++(Y..Y))
300.64B44106R3493O6418L9333n80j1558k8155k0866m0163n3620m7121A71629
$$ 244106 337599 404017 443350 442770 431212 403057 382191 342028 288408 241287 171629
325.60837A08091m3133j5377L2834J65030K38338K43876J73358Q1806I99820
$$ 108091 64958 49581 82415 247445 485783 729659 903017 984823 999820
346.41537I99820l5874m7571p5536q2066r0953o9698p4406j06801j04941B11382
$$ 999820 963946 916375 840839 758773 667820 598122 523716 416915 311974 211382
369.30203A27897m2772l5994k4645o779p199m279j550j240j689j200o30a80
$$ 127897 85125 49131 24486 17707 10508 6229 4679 3439 1750 550 -80 -180
396.35107@%S54@
720.9374@  $$checkpoint
##END=

##TITLE= azobenzene dye NHA 375nm
##JCAMP-DX= 5.01
##DATA TYPE= UV/Vis SPECTRUM
##DATA CLASS= XYDATA
##BLOCK_ID= 2
##ORIGIN= unknown
##OWNER= unknown
##LONGDATE= Fri, 28 Oct 2016 20:37:10 -0500 $$ export date from JSpecView
##SPECTROMETER/DATASYSTEM= unknown
##XLABEL= Wavelength [nm]
##YLABEL= Absorbance
##XUNITS= NANOMETERS
##YUNITS= ABSORBANCE
##XFACTOR= 1
##YFACTOR= 9.588100E-07
##FIRSTX= 3.000112E+02
##FIRSTY= 1.696000E-01
##LASTX= 7.023782E+02
##NPOINTS= 342
##MINY= 7.910000E-03
##MAXY= 9.667200E-01
##XYDATA= (X++(Y..Y))
300.01117A76886r18k1R18J492J637J731K034K409L400M558N695O581B13473
$$ 176886 175968 175947 176865 178357 179994 181725 183759 186168 189568 194126 199821 206402 213473
316.5305B20617P071O926P154P249P426Q396J0033J1254J2786J4070C27646
$$ 220617 227688 234614 241768 249017 256443 264839 274872 286126 298912 312982 327646
330.68964C41538J3402J3298J4851J6427J8085J9409K0140J9201TJ7428E33077
$$ 341538 354940 368238 383089 399516 417601 437010 457150 476351 495552 512980 533077
344.848E53728K0233K1100K0275K0024J9744K3612K6857K5792K3133G75607
$$ 553728 573961 595061 615336 635360 655104 678716 705573 731365 754498 775607
357.8281G93463J6030J4455J8982J9034J8450J6719J5457J4403J3120I51857
$$ 793463 809493 823948 842930 861964 880414 897133 912590 926993 940113 951857
370.80716I63726J0951R741P989O091M443L265J616M28p30k931n632p426I83094
$$ 963726 974677 984418 992407 998498 1002941 1006206 1007822 1008250 1007520 1004589 998957 991531 983094
387.32748I73895j0586j1817j3089j5321j7178j7125j7678j8972j9263H10536
$$ 973895 963309 951492 938403 923082 905904 888779 871101 852129 832866 810536
400.30655G87299k2977k5187k5480k5104k7617k6648k7221k7169k6178E26549
$$ 787299 764322 739135 713655 688551 660934 634286 607065 579896 553718 526549
413.28564E02456k2862k5104k3685k3133k3686k2486k1558j8982j7751B85635
$$ 502456 479594 454490 430805 407672 383986 361500 339942 320960 303209 285635
426.26572B69104j5686j3913j2818j2745j2161j0742j0242r480q407p405A48768
$$ 269104 253418 239505 226687 213942 201781 191039 180797 171317 162910 155505 148768
440.42407A42395o007n695m975m505l776l598l525l755l661l202k649I5128
$$ 142395 136388 130693 125718 121213 117437 113839 110314 106559 102898 99696 97047 95128
455.7633I3741j397j648k159k190k086j930j543j367j543j690j689j607G1328
$$ 93741 92344 90696 88537 86347 84261 82331 80788 79421 77878 76188 74499 72892 71328
472.28262F9816j314j127j095j147j220j137j221j272j293j252j220j398E3848
$$ 69816 68502 67375 66280 65133 63913 62776 61555 60283 58990 57738 56518 55120 53848
488.80115E2690j251j106j230j262j242j293j158j355j283j200j063q04C7870
$$ 52690 51439 50333 49103 47841 46599 45306 44148 42793 41510 40310 39247 38443 37870
505.32147C7328q87j147j085j012q24o36n94p20j116j210j418j596j908B1089
$$ 37328 36441 35294 34209 33197 32373 31737 31143 30423 29307 28097 26679 25083 23175 21089
523.0191A8805k441k221j857j345j002o67l34k61k50j15o2R4%S38H344
702.3782H344  $$checkpoint
##END=

##TITLE= azobenzene dye 470nm
##JCAMP-DX= 5.01
##DATA TYPE= UV/Vis SPECTRUM
##DATA CLASS= XYDATA
##BLOCK_ID= 3
##ORIGIN= unknown
##OWNER= unknown
##LONGDATE= Fri, 28 Oct 2016 14:53:47 -0500 $$ export date from JSpecView
##SPECTROMETER/DATASYSTEM= unknown
##XLABEL= Wavelength [nm]
##YLABEL= Absorbance
##XUNITS= NANOMETERS
##YUNITS= ABSORBANCE
##XFACTOR= 1
##YFACTOR= 9.853100E-07
##FIRSTX= 3.014070E+02
##FIRSTY= 1.773800E-01
##LASTX= 7.160471E+02
##NPOINTS= 236
##MINY= 6.700000E-03
##MAXY= 9.920100E-01
##XYDATA= (X++(Y..Y))
301.407A80025n136o942q769j1225j0189j2281r763j0799q840j2655G3906
$$ 180025 174889 167947 159178 147953 137764 125483 115720 104921 96081 83426 73906
322.57944F4812o637m842l044j340M171M963P419N166Q393J1804J5609A25849
$$ 64812 58175 53333 50289 48949 53120 58083 65502 70668 79061 90865 106474 125849
345.51712A44919J1407J1692J4087J1103J7000K2135K0136K1892J8329C08715
$$ 144919 156326 168018 182105 193208 210208 232343 252479 274371 292700 308715
364.92535C21757J6918J4595J7639J4432J7182J8370K1973K1536J6228D94829
$$ 321757 338675 353270 370909 385341 402523 420893 442866 464402 480630 494829
384.3336E10854J9324J4980J1225J0768K0938K6763K3069J4686N856F65476
$$ 510854 530178 545158 556383 567151 588089 614852 637921 652607 658463 665476
403.7418F79421J8826K0572J8167J1154J0261P531J5254J7811J1530H20889
$$ 679421 698247 718819 736986 748140 758401 765932 781186 798997 810527 820889
423.15103H28856R124J4391J7487J6005J6817R398J0018Q687J1083J0687I62956
$$ 828856 837980 852371 869858 885863 902680 912078 922096 930783 941866 952553 962956
444.32523I70121O313O698O140L989M273L623L156J908N38M1o09q02j522A000122
$$ 970121 976434 983132 989272 993261 997534 1001157 1004313 1006221 1006759 1006800 1006191 1005389 1003867 1000122
470.79135I95707m537n409p196o993m861r804j2270j2727j8248j4118H87893
$$ 995707 991170 985761 978565 971572 966711 956907 944637 931910 913662 899544 887893
491.9638H76973j3671r682j7974j5123j8938j3833j4249p389j6157j7051G13106
$$ 876973 863302 853620 835646 820523 801585 787752 773503 766114 749957 732906 713106
513.139F95527j5081j0961k0674j8471k2166k2795k2592j5264k0948E16315
$$ 695527 680446 669485 648811 630340 608174 585379 562787 547523 526575 516315
532.54724D98787j8928j3437j1885j6929j5467k5545k2298j2534j8085C25674
$$ 498787 479859 466422 454537 437608 422141 396596 374298 361764 343679 325674
551.95544C09537k0917j3803j4868j7335k0867j9151j4280j2808j5416A51161
$$ 309537 288620 274817 259949 242614 221747 202596 188316 175508 160092 151161
571.36365A41042r946n856q769j1134p987o536o668p531n236o465m669E6378
$$ 141042 131096 125240 116471 105337 97350 90814 84146 76615 71379 64914 60245 56378
594.30133E1882n602m679l511k467j928l410l836l441l349l228k618k050A0230
$$ 51882 46280 41601 38090 35623 33695 30285 26449 23008 19659 16431 13813 11763 10230
619.004I459q73r94n49k13l0N28O69O80N89M37K03K33L45N38M87N18A2463
$$ 9459 8586 7592 7043 6830 6800 7328 7997 8677 9266 9703 9906 10139 10484 11022 11509 12027 12463
650.7628A2839M87M16K84N18N58P00Q12O50M06L75M67O49P41O19L05B0867
$$ 12839 13326 13742 14026 14544 15102 15802 16614 17264 17670 18045 18512 19161 19902 20521 20826 20867
680.7581B0846k0%S7B0826
$$ 20846 20826 20826 20826 20826 20826 20826 20826 20826 20826 20826 20826 20826 20826 20826 20826 20826 20826 20826 20826
716.0471B0826  $$checkpoint
##END=

##TITLE= azobenzene dye DR1 520nm
##JCAMP-DX= 5.01
##DATA TYPE= UV/Vis SPECTRUM
##DATA CLASS= XYDATA
##BLOCK_ID= 4
##ORIGIN= unknown
##OWNER= unknown
##LONGDATE= Fri, 28 Oct 2016 14:50:06 -0500 $$ export date from JSpecView
##SPECTROMETER/DATASYSTEM= unknown
##XLABEL= Wavelength [nm]
##YLABEL= Absorbance
##XUNITS= NANOMETERS
##YUNITS= ABSORBANCE
##XFACTOR= 1
##YFACTOR= 9.986199E-07
##FIRSTX= 3.014070E+02
##FIRSTY= 1.696700E-01
##LASTX= 7.160471E+02
##NPOINTS= 236
##MINY= -5.700000E-04
##MAXY= 9.980499E-01
##XYDATA= (X++(Y..Y))
301.407A69904K61l295o839j1636j1206j4209j3879j4871j1015j0735F9476
$$ 169904 170165 166870 160031 148395 137189 122980 109101 94230 83215 72480 69476
322.57944F5380m296n297m857m816k674k714k153k193J90J963L625N147E1171
$$ 65380 61084 55787 50930 46114 43440 40726 38573 36380 36570 38533 42158 47305 51171
347.28134E2362J042K723L856M536N478M436M726N147O439L575P110P961A19595
$$ 52362 53404 56127 59983 64519 69997 74433 79159 84306 90745 94320 101430 109391 119595
371.984A28748Q772M967P240Q061TN678P580P821N718O679O149Q251B24640
$$ 128748 137520 142487 149727 157788 165849 171527 179107 186928 192646 199325 205474 213725 224640
396.6849B34223J1686J2738J0965J0014O819M527O008N487J1636J3299C46578
$$ 234223 245909 258647 269612 279626 286445 290972 296980 302467 314103 327402 346578
417.85837C65885R924P720R303J1055J2638J4880J3539J8025J4830J5362E08221
$$ 365885 375809 383529 392832 403887 416525 431405 444944 462969 477799 493161 508221
439.0308E26587J7023K0168J6453J2918J2637J2207J2257K1359K1940F90813
$$ 526587 543610 563778 580231 593149 605786 617993 630250 651609 673549 690813
458.43903G06495J0164J2728J9977J7024J3979J6633J1546J1966J2878H46789
$$ 706495 716659 729387 749364 766388 780367 797000 808546 820512 833390 846789
477.85H59706J2738J3398J1346Q962J0976O198N668P590O770M005I52504
$$ 859706 872444 885842 897188 906150 917126 923324 928992 936582 943352 947357 952504
499.02246I55509N337N107M436L435L855L535M576M957M386L675O21o71I97707
$$ 955509 960846 965953 970389 973824 977679 981214 985790 990747 995133 998808 999429 998758 997707
523.72437I96996k91R12k293l095n818o579m196k193m346n337q922q482I40778
$$ 996996 996705 997617 995324 992229 986411 979832 975636 973443 969097 963760 954838 946356 940778
548.427I34770n438m346q912p630j3880j5781k0649j9647j5401j1967G98051
$$ 934770 929332 924986 916074 908444 894564 878783 858134 838487 823086 811119 798051
569.5994G94146j0394j7174j8976j7925k6276j8936k4604k5796k3462E98015
$$ 794146 783752 766578 747602 729677 703401 684465 659861 634065 610603 598015
589.00867E77847j6743k3031k5365k2742j5792j6442k0228k3983k5035C66556
$$ 577847 561104 538073 512708 489966 474174 457732 437504 413521 388486 366556
608.41693C48100j6883k2691j8456k0077k6277k5795k4414k1510r723A53542
$$ 348100 331217 308526 290070 269993 243716 217921 193507 171997 162274 153542
627.82513A45581j1065j6113j7834j5121r864k383l004k534m245l575E4936
$$ 145581 134516 118403 100569 85448 75584 73201 70197 67663 63418 59843 54936
648.9986E0500m336n678n007l194m537l575m005m857m156k763k003q61D767
$$ 50500 46164 40486 35479 32285 27748 24173 20168 15311 11155 8392 6389 5528 4767
673.70123D056p61l41n0J00%Uj00m0N71J472J00j001j813j903q61N71@
$$ 4056 3295 2954 2904 3004 3004 3004 3004 2904 2864 3435 4907 5007 4006 2193 290 -571 0 0
707.226@%U@
$$ 0 0 0 0 0
716.0471@  $$checkpoint
##END=

##TITLE= azobenzene dye 578nm
##JCAMP-DX= 5.01
##DATA TYPE= UV/Vis SPECTRUM
##DATA CLASS= XYDATA
##BLOCK_ID= 5
##ORIGIN= unknown
##OWNER= unknown
##LONGDATE= Fri, 28 Oct 2016 15:04:53 -0500 $$ export date from JSpecView
##SPECTROMETER/DATASYSTEM= unknown
##XLABEL= Wavelength [nm]
##YLABEL= Absorbance
##XUNITS= NANOMETERS
##YUNITS= ABSORBANCE
##XFACTOR= 1
##YFACTOR= 9.700800E-07
##FIRSTX= 3.014070E+02
##FIRSTY= 1.703200E-01
##LASTX= 7.160471E+02
##NPOINTS= 236
##MINY= 2.530000E-02
##MAXY= 9.953800E-01
##XYDATA= (X++(Y..Y))
301.407A75573j237k020k815l422m092n814p721r701j0885j0876r659I8497
$$ 175573 174336 172316 169501 166079 161987 156173 148452 138751 127866 116990 107331 98497
324.3437H9714p875n917l804j887o80r90j536k237l092l546l113k144E1831
$$ 89714 81839 75922 72118 70231 69551 68561 67025 64788 61696 58150 55037 52893 51831
349.0456E0985k072l144l164k361p52K37J0m23o80q87r69r89j041j083C2585
$$ 50985 48913 45769 42605 40244 39492 39729 39739 39316 38636 37749 36780 35791 34750 33667 32585
377.27667C1513j072j217j226m95O39J948K680K268J237M33j44j13J54C7018
$$ 31513 30441 29224 27998 27503 28142 30090 32770 35038 36275 36708 36564 36451 36605 37018
403.7418C7636P63R59J216J464J721K062K392K834K876K536J990J680F2201
$$ 37636 38399 39358 40574 42038 43759 45821 48213 51047 53923 56459 58449 60129 62201
428.44547F5170L824M412M443M082L835M268N154O041O896P422P525P814A38865
$$ 65170 68994 73406 77849 81931 85766 90034 95188 101229 108125 115547 123072 130886 138865
453.14636A46648P958Q277Q732R391R999J0267J0412J0483J1236J2391B58989
$$ 146648 154606 162883 171615 181006 191005 201272 211684 222167 233403 245794 258989
474.3198B72400J2989J2762J3236J3535J3215J3875J4803J5432J5772D14059
$$ 272400 285389 298151 311387 324922 338137 352012 366815 382247 398019 414059
493.72803D29872J6256J6700J6720J6803J7483J8112J7906J6122J6452F00641
$$ 429872 446128 462828 479548 496351 513834 531946 549852 565974 582426 600641
513.139F20567K0390J8154J6081J6947J9246K0874K0617J7988J6916H04356
$$ 620567 640957 659111 675192 692139 711385 732259 752876 770864 787780 804356
532.54724H21272J7380J7896J7885J8122J7690J6988J5432J3483J1752I78569
$$ 821272 838652 856548 874433 892555 910245 927233 942665 956148 967900 978569
551.95544I88382R577Q185O412M968L516K432J660R48k06j484k670m144A011185
$$ 988382 997959 1006144 1012556 1017524 1021040 1023472 1025132 1026080 1025874 1024390 1021720 1017576 1011185
576.6564A002989j0339j1731j2700j3494j5957j8524k1112k2462k4565H25427
$$ 1002989 992650 980919 968219 954725 938768 920244 899132 876670 852105 825427
596.06555G97460l0152l0482l1018l4513l4038l2090l2018l2029l2265D72775
$$ 797460 767308 736826 705808 671295 637257 605167 573149 541120 508855 472775
615.4738D35923l4533l1709k9565k5482k6946k8617k7430k4967k1627A67027
$$ 435923 401390 369681 340116 314634 287688 259071 231641 206674 185047 167027
634.882A49091j6463j5596j3474j1298r793q978q309q370p567o576C6554
$$ 149091 132628 117032 103558 92260 82467 73489 65180 56810 49243 42667 36554
656.05725C1719l288j897m54L61P2%T7B6513
$$ 31719 28431 26534 26080 26441 26513 26513 26513 26513 26513 26513 26513 26513 26513 26513 26513 26513 26513 26513 26513 26513 26513 26513 26513 26513 26513 26513 26513 26513 26513 26513 26513 26513 26513
716.0471B6513  $$checkpoint
##END=

##END= $$ of all data