##TITLE= alizarin
##JCAMP-DX= 5.01
##DATA TYPE= UV/Vis SPECTRUM
##DATA CLASS= XYDATA
##ORIGIN= unknown
##OWNER= unknown
##LONGDATE= Tue, 1 Nov 2016 19:31:41 -0500 $$ export date from JSpecView
##SPECTROMETER/DATASYSTEM= unknown
##XLABEL= Wavelength [nm]
##YLABEL= Absorbance
##XUNITS= NANOMETERS
##YUNITS= ABSORBANCE
##XFACTOR= 1
##YFACTOR= 5.910000E-07
##FIRSTX= 2.905190E+02
##FIRSTY= 5.950000E-01
##LASTX= 8.007377E+02
##NPOINTS= 152
##MINY= 4.000000E-03
##MAXY= 5.950000E-01
##XYDATA= (X++(Y..Y))
290.519 1006768 886142 786125 698528 625956 581794 569780 588342 633384 680288 729002
327.68668 767665 792200 803723 800660 767310 732335 669475 610474 539289 472335 400034
364.85538 361794 324129 294873 277986 264129 251844 244061 239188 235533 232064 231810 231810
405.40173 234010 236971 241844 247851 256751 262589 267513 275296 283096 290880 298663 307191 316091
449.32678 324992 334010 342657 350474 359374 369662 381083 391455 401827 412200 422572 432961 443333
493.255 451963 459949 469019 475804 482183 486413 488156 488613 487834 485330 479475 473113 466091 455668
540.5587 445245 433790 418393 398816 382978 364822 338037 318393 303570 288376 269408
577.7274 248968 229391 210998 187868 171066 156464 138291 120355 104704 91895 75195
614.8951 62673 52369 45499 40305 36024 33096 29222 24873 21574 18646 17750 16819 14213 11844
662.202 11844 11844 11844 11844 11844 11844 11844 11844 11320 10068 9289 8511 7648 6785 6768 6768 6768 6768 6768 6768 6768 6768 6768 6768 6768 6768 6768 6768 6768 6768 6768 6768 6768 7293 8071 8460 8460 8460 8460 8325 7547
800.7377F768  $$checkpoint
##END=