##TITLE= Congo Red
##JCAMP-DX= 5.01
##DATA TYPE= UV/VIS SPECTRUM
##DATA CLASS= XYDATA
##ORIGIN= public
##OWNER= public
##LONGDATE= Tue, 1 Nov 2016 15:05:16 -0500 $$ export date from JSpecView
##RESOLUTION= 1
##XUNITS= NANOMETERS
##YUNITS= ABSORBANCE
##XFACTOR= 1
##YFACTOR= 9.313200E-10
##FIRSTX= 214
##FIRSTY= 5.942400E-01
##LASTX= 754
##NPOINTS= 541
##MINY= 3.434911E-02
##MAXY= 6.101855E-01
##XYDATA= (X++(Y..Y))
$$ plain form
214 638062080 619056256 602327552 589403264 578643968 570461568 564454528 560294528
222 558155264 557130240 557412352 558622720 559865600 562041600 564471680 567023232
230 568382976 570828928 572857344 574303232 575227008 575850496 575377280 574024064 572410368
239 569184640 565339136 560170624 554224512 546955648 538726528 529407360 519397760
247 508542208 497308032 485556480 473876480 462058880 450610816 438843776 427866240
255 417716096 407907456 398966912 390670464 382443264 375024128 368039040 361307136
263 354664064 348351232 342401664 336598528 330649216 325187328 319840384 314524544
271 309876480 304946432 301037184 296766464 292924032 289644288 286434944 284197888
$$ packed form
214F38062080j9005824j6728704j2924288j0759296q182400o007040E60294528
222E58155264j025024K82112J210368J242880K176000K430080E67023232
230E68382976K445952K028416J445888R23776O23488m73216j353216E72410368
239E69184640l845504n168512n946112p268864q229120r319168E19397760
247E08542208j1234176j1751552j1680000j1817600j1448064j1767040D27866240
255D17716096r808640q940544q296448q227200p419136o985088C61307136
263C54664064o312832n949568n803136n949312n461888n346944C14524544
271C09876480m930048l909248m270720l842432l279744l209344B84197888
$$ plain form
279 282244608 280045184 279130240 278614784 277878400 277534848 278113280 278392576 279660416
288 281350784 283243264 285655040 288091264 291982592 294854144 298093952 302275072
296 306801536 310539264 315651712 319485696 324048640 328564736 333194624 337919488
304 342144640 346872960 351890432 355873408 360157568 363829120 368671232 372137984
312 376069504 380029184 383628928 386948096 390485504 394086784 397506944 401041408
320 403899520 407607040 411251456 415017088 418030208 421879168 424941568 428992896
328 433038208 436291968 440209792 443670400 445538560 450164864 452440448 454353280
336 457363840 459390592 461140864 461506176 462209536 462852096 463069952 463767552 463784320
$$ packed form
279B82244608k199424r14944n15456p36384l43552N78432K79296B79660416
288B81350784J892480K411776K436224L891328K871552L239808C02275072
296C06801536L737728N112448L833984M562944M516096M629888C37919488
304C42144640M728320N017472L982976M284160L671552M842112C72137984
312C76069504L959680L599744L319168L537408L601280L420160D01041408
320D03899520L707520L644416L765632L013120L848960L062400D28992896
328D33038208L253760L917824L460608J868160M626304K275584D54353280
336D57363840K026752J750272L65312P03360O42560K17856O97600D63784320
$$ plain form
345 463612800 463525632 462784896 461521152 459444224 457794944 454782848 452283520 448969728
354 445154304 441549696 437567872 432340992 427624576 422817664 417728384 412982272
362 407123200 401949952 396222976 390231296 384787968 379582080 373988864 368482048
370 363119104 358131328 353223296 347978496 342391040 337794688 332388736 327195648
378 323024640 317689728 312991104 308431488 303735168 299210368 294839040 290927232
386 287160320 283923200 280195968 276586112 274027904 271566336 268702208 266623488
394 265104768 263610112 262460160 261997056 260743296 261143936 261374464 261449216 262636160
403 263790976 264710528 266409728 267947776 270094592 272376448 275086848 277456640
$$ packed form
345D63612800q7168p40736j263744k076928j649280l012096k499328D48969728
354D45154304l604608l981824n226880m716416m806912n089280D12982272
362D07123200n173248n726976n991680n443328n205888n593216C68482048
370C63119104m987776m908032n244800n587456m596352n405952C27195648
378C23024640n334912m698624m559616m696320m524800m371328B90927232
386B87160320l237120l727232l609856k558208k461568k864128B66623488
394B65104768j494656j149952m63104j253760M00640K30528P4752B62636160
403B63790976R19552J699200J538048K146816K281856K710400B77456640
$$ plain form
411 280484736 283495040 286781952 289971584 293521024 297588736 300974976 304869504
419 308564992 311986176 315502592 319363584 323106944 327042176 331133056 334707072
427 338736512 342736384 346526976 350796800 354878592 358877824 363081088 367255936
435 371185408 375598848 379644288 383702656 388122752 392151680 396539776 400988288
443 405302272 409698944 414484096 418844160 423348224 428347648 433029504 437763968
451 442894464 447731968 452615552 457751936 462660224 467995392 473385984 478591744
459 483837824 489507072 494859904 500336000 506113152 511493632 517169024 523253632
467 528679424 534596736 540241536 546061440 552098048 557636480 563326336 569123712
$$ packed form
411B80484736L010304L286912L189632L549440M067712L386240C04869504
419C08564992L421184L516416L860992L743360L935232M090880C34707072
427C38736512L999872L790592M269824M081792L999232M203264C67255936
435C71185408M413440M045440M058368M420096M028928M388096D00988288
443D05302272M396672M785152M360064M504064M999424M681856D37763968
451D42894464M837504M883584N136384M908288N335168N390592D78591744
459D83837824N669248N352832N476096N777152N380480N675392E23253632
467E28679424N917312N644800N819904O036608N538432N689856E69123712
$$ plain form
475 574529536 579943168 585383168 590915328 596242944 601525376 606543104 611748864
483 616412160 621023104 625255424 629583872 632966784 636992640 640193408 643276800
491 645983104 648470656 650232320 652149504 653569152 654237952 654750464 655183488 654774528
500 654251008 653389568 651966336 650149888 648102912 645328896 642570496 639709824
508 636173056 632345216 628217216 623701888 619432448 614584064 609711616 604598784
516 599230080 593385344 587529344 581373696 575212416 568703872 562152960 555510144
524 548317568 541277952 534132736 526424576 518813696 511046144 502932736 494794624
532 486894720 478460160 469842304 461435008 452529024 443331456 434451712 425178240
$$ packed form
475E74529536N413632N440000N532160N327616N282432N017728F11748864
483F16412160M610944M232320M328448L382912M025856L200768F43276800
491F45983104K487552J761664J917184J419648O68800N12512M33024F54774528
500F54251008q61440j423232j816448k046976k774016k758400F39709824
508F36173056l827840m128000m515328m269440m848384m872448F04598784
516E99230080n844736n856000o155648o161280o508544o550912E55510144
524E48317568p039616p145216p708160p610880p767552q113408D94794624
532D86894720q434560q617856q407296q905984r197568q879744D25178240
$$ plain form
540 416032768 406983552 397680512 388226304 379090048 369580288 360102912 351122176
548 342050560 332823424 324015872 314656768 305457152 296678272 287798144 278939392
556 270197376 261820032 253480320 245484800 237270784 229532032 221735808 214365440
564 206872960 199745536 192923648 185688576 179217408 173024384 166255104 160258304
572 154347008 148395776 142590592 137394688 132198272 126754944 122032384 117444736
580 112710784 108465280 104596352 100163200 96590464 92869376 89369344 86108800
588 82852352 79841280 76995456 74298752 71704576 69362048 67169152 64897024
596 62836352 61025536 59274112 57500800 55994368 54625792 53198464 52043648
$$ packed form
540D16032768r049216r303040r454208r136256r509760r477376C51122176
548C42050560r227136q807552r359104r199616q778880q880128B78939392
556B70197376q377344q339712p995520q214016p738752p796224B14365440
564B06872960p127424o821888p235072o471168o193024o769280A60258304
572A54347008n951232n805184n195904n196416n443328m722560A17444736
580A12710784m245504l868928m433152l572736l721088l500032H6108800
588H2852352l011072k845824k696704k594176k342528k192896F4897024
596F2836352j810816j751424j773312j506432j368576j427328E2043648
$$ plain form
604 50962688 49904384 48809600 47853952 46963968 46200832 45288576 44761344 44002048
613 43115904 42716416 42070400 41532928 41238912 40756608 40352512 39986304 39693824
622 39479040 39064960 38834944 38583680 38412160 38315136 38422784 38153216 38148864 38138752
632 37952768 38004608 38086400 37980928 37886208 38016384 37936384 38015232 37769472 38027776
642 37708544 37646720 37555968 37455232 37432576 37443840 37550080 37372288 37336192 37513216
652 37303424 37476608 37378816 37432832 37345536 37513728 37597824 37486720 37482880 37389696
662 37547008 37528448 37410432 37362432 37513088 37151744 37321728 37449216 37244160 37312384
672 37276416 37140352 37286400 37190272 37010688 37031296 37111808 36882176 37074944 36945408
$$ packed form
604E0962688j058304j094784r55648q89984p63136r12256n27232D4002048
613D3115904l99488o46016n37472k94016m82304m04096l66208C9693824
622C9479040m14080k30016k51264j71520r7024J07648k69568m352C8138752
632C7952768N1840Q1792j05472r4720J30176q0000P8848k45760C8027776
642C7708544o1824r0752j00736k2656J1264J06240j77792l6096C7513216
652C7303424J73184r7792N4016q7296J68192Q4096j11104l840C7389696
662C7547008j8560j18016m8000J50656l61344J69984J27488k05056C7312384
672C7276416j36064J46048r6128j79584K0608Q0512k29632J92768C6945408
$$ plain form
682 36947328 37063808 37140864 37066752 37365376 37286144 37271936 37420032 37397376 37437184
692 37653760 37327488 37674240 37400320 37437824 37527680 37260544 37335040 37622016 37521664
702 37634048 37714816 37864064 37912448 38041088 38262272 38051200 38326272 38607744 38686976
712 38933504 39005824 39195776 39374336 39290624 39619456 39782144 39831552 39895424 40411136
722 40380800 40798976 40802432 41202304 41511296 41758976 42382720 43032576 43325952 43935616
732 44643840 44742784 45557120 45880576 46070016 46609664 46942976 46881792 46796032 47438720
742 47225344 47346432 47472640 47297408 47438464 47543552 47428864 47379712 47584256 47380352
752 47335552 47100160
$$ packed form
682C6947328J16480P7056p4112K98624p9232j4208J48096k2656C7437184
692C7653760l26272L46752k73920L7504Q9856k67136P4496K86976C7521664
702C7634048Q0768J49248M8384J28640K21184k11072K75072K81472C8686976
712C8933504P2320J89952J78560q3712L28832J62688M9408O3872D0411136
722D0380800M18176L456L99872L08992K47680O23744O49856K93376D3935616
732D4643840R8944Q14336L23456J89440N39648L33312o1184q5760D7438720
742D7225344J21088J26208j75232J41056J05088j14688m9152K04544D7380352
752D7335552D7100160
754D7170304  $$checkpoint
##END=