##TITLE= Bismarck Brown Y
##JCAMP-DX= 5.01
##DATA TYPE= UV/Vis SPECTRUM
##DATA CLASS= XYDATA
##ORIGIN= unknown
##OWNER= unknown
##LONGDATE= Wed, 2 Nov 2016 12:37:06 -0500 $$ export date from JSpecView
##SPECTROMETER/DATASYSTEM= unknown
##XLABEL= Wavelength [nm]
##YLABEL= Absorbance
##XUNITS= NANOMETERS
##YUNITS= ABSORBANCE
##XFACTOR= 1
##YFACTOR= 5.800000E-07
##FIRSTX= 2.696340E+02
##FIRSTY= 2.189999E-01
##LASTX= 7.023600E+02
##NPOINTS= 168
##MINY= 0
##MAXY= 5.800000E-01
##XYDATA= (X++(Y..Y))
269.634C77586j724Uj2069k0690k9310l4483l2759l6206k7587k2413A46552
303.317A43103J725Q620J8966J5517K2414TK2413K7587K4138L1034C70690
334.411D00000M3103L4483TJ8965K4138K0690K5862K7586J7242J5517F81034
365.504F93103K0690J8966J2069J5517J7241J5517J7242J3793J2069H48276
394.005H60345Q621J0344J3793N173O896O897N172N173O896O897O896I48276
427.688I55172O897J0345O896N173Q620N173%J724j724Tq621j2069I58621
463.964I43103j8965k4138k5862k7586l4483Tl7931l2758m6552l9655E81034
495.057E46552m1380m4827l4483l9655m1379k4138l7931l1035k2414A98276
$$ y = [377586, 375862, 374138, 372414, 360345, 339655, 310345, 275862, 243103, 206897, 179310, 156897, 146552, 143103, 144828, 153448, 172414, 187931, 210345, 232759, 255172, 282759, 306897, 337931, 370690, 400000, 443103, 477586, 512069, 531034, 555172, 575862, 601724, 629310, 646552, 662069, 681034, 693103, 713793, 732759, 744828, 760345, 777586, 793103, 810345, 824138, 836207, 848276, 860345, 868966, 879310, 893103, 898276, 905172, 912069, 917241, 922414, 929310, 936207, 943103, 948276, 955172, 962069, 972414, 979310, 984483, 993103, 998276, 998276, 1000000, 998276, 996552, 987931, 975862, 958621, 943103, 924138, 900000, 874138, 846552, 812069, 777586, 739655, 706897, 660345, 620690, 581034, 546552, 505172, 460345, 425862, 386207, 344828, 320690, 282759, 251724, 229310, 198276]
523.558A72414j5517k4138j5518j3793Tj7241q621Tq620o897o896n173B4138
559.832B0690l449l448Tj724Tj725j724%j724%j724%V2@
$$ y = [172414, 156897, 132759, 117241, 103448, 89655, 72414, 63793, 55172, 46552, 39655, 32759, 27586, 24138, 20690, 17241, 13793, 10345, 8621, 6897, 5172, 3448, 3448, 1724, 1724, 0, 0, 0, 0, 0, 0, 0, 0, 0, 0, 0, 0, 0, 0, 0, 0, 0, 0, 0, 0, 0, 0, 0, 0, 0, 0, 0, 0, 0, 0, 0, 0, 0, 0, 0, 0, 0, 0, 0, 0, 0, 0, 0, 0]
702.36@  $$checkpoint
##END=