##TITLE= Bismarck Brown R
##JCAMP-DX= 5.01
##DATA TYPE= UV/Vis SPECTRUM
##DATA CLASS= XYDATA
##ORIGIN= unknown
##OWNER= unknown
##LONGDATE= Tue, 1 Nov 2016 20:11:33 -0500 $$ export date from JSpecView
##SPECTROMETER/DATASYSTEM= unknown
##XLABEL= Wavelength [nm]
##YLABEL= Absorbance
##XUNITS= NANOMETERS
##YUNITS= ABSORBANCE
##XFACTOR= 1
##YFACTOR= 3.473400E-07
##FIRSTX= 2.748750E+02
##FIRSTY= 9.809000E-02
##LASTX= 7.981186E+02
##NPOINTS= 129
##MINY= 1.234000E-02
##MAXY= 3.596800E-01
##XYDATA= (X++(Y..Y))
274.875B82403p370k735k9Tm865p284n528l339l340Tj72k9%k9T%P169B63575
352.54324B79150J5345J6382K0211K2629K4961K3723K6545L4692L5815E36851
397.511E79260L5008M6122L7399M5604L7398L7399K7494L3368L4232I45327
442.47668I66603K1622J9232J3445R213N412k9%o506j3704j7217k1621I48120
495.61877I18092l4030l4462m0307l8981l3109m5345l7197m4481l8032E34951
540.5845D97783l1727l4318l4202l3138l3022k8992k8042k7408k2284B02914
585.55115A83682j7706j0365j6094j1257r040p917p313n527o622o132H1505
634.60455H1476m001m175j670l368k016%l138l483l542%k8k9j670k476D8540
$$ plain form
274.875 282403 275033 272298 272269 272240 267375 260091 254563 251224 247884 244544 244372 244343 244343 244314 244285 244285 251454 263575
352.54324 279150 294495 310877 331088 353717 378678 402401 428946 463638 499453 536851
397.511 579260 614268 660390 697789 743393 780791 818190 845684 879052 913284 945327
442.47668 966603 988225 1007457 1020902 1030115 1035527 1035498 1035498 1028992 1015288 998071 976450 948120
495.61877 918092 884062 849600 809293 770312 737203 691858 654661 610180 572148 534951
540.5845 497783 466056 431738 397536 364398 331376 302384 274342 246934 224650 202914
585.55115 183682 165976 155611 139517 128260 119220 111303 103990 98463 91841 85709 81505
634.60455 81476 77475 73300 71630 68262 66246 66246 63108 59625 56083 56083 56055 56026 54356 51880 48540
700.0108D8396q35j612J612P49l17j670j785k389l714j843j036%k9N47C7715
765.417C8003k9k8%p20j670J439C7859
$$ plain form
700.0108 48396 47561 45949 47561 48310 47993 46323 44538 42149 38435 36592 35556 35556 35527 36074 37715
765.417 38003 37974 37946 37946 37226 35556 36995 37859
798.1186C7830  $$checkpoint
##END=